Android studio报错build failed怎么解决?急,求大神指教

图片说明
项目所有代码没有显示错误,但是运行的时候就显示这样
我快奔溃了,大神救救我。。。

0

3个回答

看你的代码中是不是有错误,或者看下是否有些资源包没下载,你截的图看不出来具体问题

0
weixin_43919342
fdou 好的,谢谢
5 个月之前 回复

build 里面 所有“compile”替换成 implementation

0
weixin_43919342
fdou 好的,谢谢
5 个月之前 回复

你倒是吧最后那行的错误展开啊,看得我强迫症都犯了

0
Csdn user default icon
上传中...
上传图片
插入图片
抄袭、复制答案,以达到刷声望分或其他目的的行为,在CSDN问答是严格禁止的,一经发现立刻封号。是时候展现真正的技术了!
其他相关推荐
Failed to notify build listener因为Gradle版本问题导致的项目无法构建
有一次pull完代码以后,需要重新构建,但是报Failed to notify build listener。 经过排查发现是Gradle版本问题 我用的版本是4.3的,公司统一用4.4的,升级版本就好了,这是修改之后的,use local gradledistribute ...
关于android studio启动时加载项目gradle build出现错误的解决方法
Stack Overflow QuestionsTagsUsersBadgesUnansweredAsk Question Take the 2-minute tour × Stack Overflow is a question and answer site for professional and enthusiast programmers. It’s 100% free, no reg
android studio新导入一个eclipse项目出现了这个错误 麻烦大神忙吧
Error:Execution failed for task ':app:processDebugResources'. > Failed to execute aapt Information:15 errors Information:See complete output in console Information:BUILD FAILED in 0s Error:com.an
Android Studio开发过程中Gradle Sync报错解决方法
本文会汇总遇见的报错问题及其解决方案,不断更新 更新于2018年12月3日 (1) Gradle sync failed: No toolchains found in the NDK toolchains folder for ABI with prefix: mips64el-linux-android 解决方法: A:设置project srtucture如下 B:手动设置...
cordova build android 打包时报错的解决方案
错误如下:1 Error: Could not find an installed version of Gradle either in Android Studio, 2 or on your system to install the gradle wrapper. Please include gradle 3 in your path, or install Android Studio...
Android Studio新建或导入项目一直在build问题解决
Android Studio新建或导入项目一直在build问题解决 最近从新安装Android Studio新建项目时发现,一直卡在build很久没有反应,只好使用任务管理器关闭AS,后来查阅资料发现是网络被墙的原因,因为新建或倒入项目的时候,AS会下载gradle。解决方案如下 下载离线gradle包 在文件目录C:\Users\.gradle\wrapper\dists下回看到gra
安卓studio中由于版本兼容问题造成的build错误
认真分析。 安卓程序在程序电脑上和自己电脑上运行的android版本不一致。git ignore文件当中添加.idea/libraries然后造成了一些切换到同事分支的时候有些库被覆盖。 安卓库版本不一致造成了build错误。 解决方法: 在build.gradle中强制项目的所有模块使用同一版本的安卓支持库。...
android studio使用错误排查记录
配环境这玩意儿真是考验耐力和碰运气啊!!!! 导入一个已有的gradle项目 一开始提示 Error:failed to find Build Tools revision 21.1.1 来回改project structure里面的配置,指定不同的SDK,反正安装android studio默认的sdk不能使用 Error:(11, 0) Gradle DSL method not fo
Android build失败 原因总结:
AndroidStudio中编译失败原因 总结:1,包冲突编译异常:Error:Execution failed for task ':app:transformClassesWithJarMergingForRelease'. > com.android.build.api.transform.TransformException: java.util.zip.ZipException: dupl
Android studio 一些错误及解决方法
1.在低版本的手机或者模拟器不能运行 但是高的可以 使用自定义的Application继承MultiDexApplication这个类,或者重写Application的方法attachBaseContext(),并调用MultiDex.install(); @Override protected void attachBaseContext(Context base) { super...
萌新更新Android Studio 3.0遇到的各种gradle错误以及解决过程
最近公司给了个Android项目,本萌新持着有点基础的样子打开了AS,并且在导入代码之前更新了AS(原本是希望高版本能够更好用的),结果就是更新完后各种gradle build时间过长,错误,support-v7等依赖无法resolve,Gradle sync failed: Unable to start the daemon process 等问题,下面就来就简单介绍下我遇到的这些错误和介绍方
android studio 常见问题总结
如果你之前有用Eclipse做过安卓开发,现在想要把Eclipse中的项目导入到Android Studio的环境中,那么首先要做的是生成Build Gradle的文件。因为Android Studio 是用Gradle来管理项目的,具体操作步骤如下: 从Eclipse中导出 1.将你的ADT插件版本升级到22.0以上。 2.在Eclipse中,选择File-->Export。 3.在弹出
AndroidStudio build项目出现异常错误sync
看看这篇文章 https://blog.csdn.net/qq874455953/article/details/82713138
AndroidStudio安装完以后,新建项目时,build项目报错!
AndroidStudio安装完以后,构建项目时会出现错误,如下图所示,这是我遇到的Sync错误 可能是由于网络的原因,一些依赖包没有下载,解决方法:我们使用“阿里云国内镜像”重新build我们的项目,打开你的项目,在打开build.gradle这个文件,把原来的google() jcenter()注释掉, 添加maven { url 'http://maven.aliyun.com/nexus/...
Android Studio、Gradle常见错误、设置
Android Studio使用过程中遇到问题,在此整理一下,遇到新问题会随时更新,方便查询,如有问题,多多交流!Gradle sync failedGradle sync failed: %Android Studio%\gradle\gradle-2.8\wrapper\dists\gradle-2.8-all\ah86jmo43de9lfa8xg9ux3c4h\gradle-2.8-all.z
Android Studio build失败情况解决方案
1. Android Studio -> preferences... -> Build, Execution, Deployment -> Build Tools -> Gradle Check the 'Offline work' under 'Global Gradle settings' It will reduce 90% gradle build time...
当android studio 进行Build或sync失败的时候 有一些问题其实不是问题的
      很多情况下如果Build或者sync 失败的话,尤其在你并没有动相关代码却莫名其妙的爆出错误的时候,那么请先不要急着修改代码,请考虑下网络,不要告诉我网页是能打开的啊,网络没问题,NONONO,网页新闻可能没问题,但在开发这里就不一样了。还好如果有人在这里为你关上了一扇门,缺留下了一扇小窗子。呵呵 废话说多了 ,其实就是一句话:如果你是你实在不知道该问题出在哪里的话,请将...
打包apk时报错:ndk-bundle找不到相关文件
我这边的解放方案是:把local.properties文件中的ndk.dir的路径给注释掉,之后再打包apk就正常了
android studio 导入项目时遇到的坑
Error:(2290) error: style attribute '@android:attr/windowEnterAnimation' not found.Error:(2291) error: style attribute '@android:attr/windowExitAnimation' not found.Error:(2290) style attribute '@andr...
Eclipse 项目转移到Android Studio遇到的问题
1、Android Studio(简称AS)直接导入项目是copy原项目的,无法纳入代码管控 解决方案: 英文地址:http://developer.android.com/sdk/installing/migrate.html 翻译:Android Studio 中文组(大锤译) 如果你之前有用Eclipse做过安卓开发,现在想要把Eclipse中的项目导入到Android St
解决android studio更新gradle错误,构建失败的问题
一、版本错误 对应版本,修改gradle version,和plusing version两个地方 修改gradle version,和plusing version的方法有两种,一种是在 project.build。这里plusing version的设置 buildscript { repositories { jcenter() } dep...
android studio升级3.0版本,问题处理
问题1:编译版本与构建版本修改 compileSdkVersion : 26, buildToolsVersion : “26.0.2”, gradle版本: distributionUrl=https://services.gradle.org/distributions/gradle-4.1-all.zip classpath ‘com.and
使用android studio导入之前版本系统的project sync failed 解决办法
使用android studio导入之前版本系统的project sync failed 解决办法 Error:(15, 0) Gradle DSL method not found: ‘runProguard()’ Possible causes:The project ‘HackerTool’ may be using a version of Gradle that does not con
2.添加android平台后,build或者run的时候报错
  问题原因:   cordova在6.4.0(cordova-android在6.1.2)之后,会要求安装Gradle,基于Gradle来编译、打包android。   (具体版本号有待考证,但是需要安装Gradle属实) 解决办法: 1)去Gradle官网:https://gradle.org/install 2)下载Gradle:https://gradle.org/rele...
host 解决 failed to find Build Tools revision 19.1.0
Failed to sync Gradle project 'XXXX' Error :failed to find Build Tools revision 19.1.0 Install Build Tools 19.1.0 and sync project 相信用android studio的很多都遇到过这种类似的提示. 将下载下来的资源替换掉你本地的,mac 在finder中前往 /etc/hosts 并替换就可以.成功下载.
android studio build-tools 27.0.1
解压放到 sdk build-tools就行了。 用于解决failed to find build tools 27.0.1
导入别人的Android Studio工程失败的解决办法
我们经常在github或者csdn上找到别人的studio工程导入到android studio中会失败或者会一直loading。其实这个loading的过程会先判断本地gradle版本以及会下载里面的jar包。一般会卡在gradle版本这里。如果工程里面的gradle版本跟机子的studio里面的gradle版本不一致的话studio就会去下载工程里面的gradle版本,当然,你的网络好或者有着性
android studio 异常处理大全
用过Android studio 的人都知道 这B玩意真是一大堆莫名的异常啊,恨不得把它砸了,不过,无可否认,开发起来确实挺爽的 现在我们一起来汇总处理各种异常的处理办法吧 持续更新 playout的预览图preview无法显示 尝试修改你的buildToolsVersion版本号然后sync...
Android Studio项目打包时资源文件报错解决办法
有的项目打包时会报Error:(64) Error: "xxx.xml" is translated here but not found in defaul这种错误 1.build.gradle里的android{}里添加 lintOptions { abortOnError false } 2.build.gradle里的android{}里添加 lintOpt
android studio在build过程中出现的错误
今天从远程服务器上download代码的时候在编译过程中出现了这样一个错误: org.gradle.api.tasks.TaskExecutionException: Execution failed for task ‘:app:compileUCDebugJavaWithJavac’. at org.gradle.api.internal.tasks.execution.E...
AndroidStudio 安装各种错误解决-安装教程
从Eclipse ADT转到Android Studio出了不少问题,也花了不少功夫才最终成功。特此记录备忘。下载问题因为墙太高,所以要在这个网站下国内的。 http://www.android-studio.org/index.php/download/androidstudio-download-baidudisk这是百度云盘的,下载没问题。 下载的版本,建议下载 和 zip版本的方便移动
Android Studio 解决build.gradle运行编译报错问题
总结: 1、compileSdkVersion:使用编译的SDK版本,如 2、buildToolsVersion:构建gradle、ant的工具,如28.0.3取自: 3、依赖appcompat-v7和support:design版本: 可以使用 + 号,但不建议这样做,会导致测试版本不稳定。 dependencies { compile 'com.android.support...
jrebel编译报错
最近打开项目用jrebel for Android 打开时候,发现报错了,怎么clean rebuild 重启都不行,最后随便点了下升级Android studio,发现jrebel for Android竟然有新版本了,顺便升级了下,就莫名奇妙好了。 Error:Configuration on demand is an incubating feature. :app:preBuild UP...
Android开发:Android Studio工具遇到的坑,以及解决办法
场景打开a s工程项目,报错:Could not find method android() for arguments Error:(31, 0) Could not find method android() for arguments [build_4g5zqa4pkpj6q6qii8a22khzz$_run_closure2@7a96d128] on root project 'Mybaby
Android Studio 多渠道打包以及常见错误
Android Studio 多渠道打包以及常见错误 ONE Goal ,ONE Passion ! 在多渠道打包方面可以说Google真的是业界良心. studio支持多渠道打包啦.而且打包还算是效率比较高的.深吸一口气,开始吧!第一步:在build.gradle(Modle:app)下配置要发布的渠道名称.android { compileSdkVersion 23 bui
Android Studio常见报错及解决方案汇总
作者:郭孝星 微博:郭孝星的新浪微博 邮箱:allenwells@163.com 博客:http://blog.csdn.net/allenwells Github:https://github.com/AllenWells一 unknown host services.gradle.org原因分析在国内,services.gradle.org被墙了,无法连接。解决方案方案一:使用代理方案二
Android Studio SDK Build-tools, revision 26.0.1
下载后解压到sdk中的build-tools目录下即可
Android studio 遇到的问题和解决方案
善用ctrl+F ============================================================================ 2016年5月15日 在使用progresshint的第三方库时,直接在gradle中添加 repositories { jcenter() maven { url "https://jitpack.
android studio 导入项目,库,框架时提示编译报错
编译错误提示:     Manifest merger failed : Attribute application@icon value=(@mipmap/ic_launcher) from AndroidManifest.xml:7:9-43     is also present at [com.pnikosis:materialish-progress:1.0] AndroidManif...
通过Android Studio编译安装App报错INSTALL_FAILED_TEST_ONLY终极解决方案
引入 在使用Android Studio 3.0编译安装项目时报错,如下: 点OK也是安装失败。 通过adb instal命令行安装,同样失败,错误信息为: ErrorCode:-15 略略略 INSTALL_FAILED_TEST_ONLY 略略略 解决方案 检查AndroidMainfest <appliaction ... android:testOn...
文章热词 机器学习教程 Objective-C培训 交互设计视频教程 颜色模型 设计制作学习
相关热词 mysql关联查询两次本表 native底部 react extjs glyph 图标 java大神班 大数据大神班