重装anaconda后import pandas报错

图片说明

重新写了个脚本也是一样的错误
AttributeError: 'tuple' object has no attribute 'type'

图片说明

1个回答

图片说明
点下叉叉试试,再在终端执行试试,可能是装了,但这个终端还是之前的环境变量,并未加载到

weixin_43767739
weixin_43767739 我也碰到同样问题,求解
9 个月之前 回复
qq_31247017
孔橙 我昨天把环境换成了我TensorFlow的环境,然后.py脚本可以正常运行了,但在.ipynb脚本里还是运行一上来就报这个错,现在不能用Jupyter依旧很烦恼
一年多之前 回复
Csdn user default icon
上传中...
上传图片
插入图片
抄袭、复制答案,以达到刷声望分或其他目的的行为,在CSDN问答是严格禁止的,一经发现立刻封号。是时候展现真正的技术了!
其他相关推荐
Python+OpenCV计算机视觉

Python+OpenCV计算机视觉

import pandas as pd报错为OSError: [WinError 193] %1 不是有效的 Win32 应用程序。

import pandas as pd报错为OSError: [WinError 193] %1 不是有效的 Win32 应用程序。

我pandas明明都装好了,为什么我导入还是报错

我pandas明明都装好了,为什么我导入还是报错,重装也不行,pip安装或者下载安装的都不行。有没有遇到同样问题的兄弟,教下我![图片说明](https://img-ask.csdn.net/upload/201908/04/1564931064_614958.png) Traceback (most recent call last): File "E:/Deep Learning Data/TensorFlow Learn 1/testItemAccuracy.py", line 3, in <module> import pandas as pd File "D:\Anaconda3\envs\tensorflow\lib\site-packages\pandas\__init__.py", line 55, in <module> from pandas.core.api import ( File "D:\Anaconda3\envs\tensorflow\lib\site-packages\pandas\core\api.py", line 5, in <module> from pandas.core.arrays.integer import ( File "D:\Anaconda3\envs\tensorflow\lib\site-packages\pandas\core\arrays\__init__.py", line 7, in <module> from .categorical import Categorical # noqa: F401 File "D:\Anaconda3\envs\tensorflow\lib\site-packages\pandas\core\arrays\categorical.py", line 54, in <module> from pandas.core.base import NoNewAttributesMixin, PandasObject, _shared_docs File "D:\Anaconda3\envs\tensorflow\lib\site-packages\pandas\core\base.py", line 36, in <module> import pandas.core.nanops as nanops File "D:\Anaconda3\envs\tensorflow\lib\site-packages\pandas\core\nanops.py", line 38, in <module> bn = import_optional_dependency("bottleneck", raise_on_missing=False, on_version="warn") File "D:\Anaconda3\envs\tensorflow\lib\site-packages\pandas\compat\_optional.py", line 99, in import_optional_dependency version = _get_version(module) File "D:\Anaconda3\envs\tensorflow\lib\site-packages\pandas\compat\_optional.py", line 48, in _get_version raise ImportError("Can't determine version for {}".format(module.__name__)) ImportError: Can't determine version for bottleneck

linux anaconda3 python环境,import dlib报错

服务器linux是凝思操作系统 anaconda3、python配置都弄好了 #python -V Python 3.5.2 :: Anaconda 4.2.0 (64-bit) 进入python #python #import dlib --报下面错误 Traceback (most recent call last): File "<stdin>", line 1, in <module> ImportError: /opt/python/anaconda3/lib/python3.5/site-packages/dlib-19.9.0-py3.5-linux-x86_64.egg/dlib.cpython-35m-x86_64-linux-gnu.so: undefined symbol: _ZNSt8messagesIcE2idE /opt/python/anaconda3是我的anaconda3目录 我在本机linux虚拟机(优麒麟系统),同样配置import dlib不会报错,python项目也能跑的起来,应该是环境问题,各位大神看下这个报错是哪个环境有问题,怎么解决

Anaconda卸载重装后出现问题,请问如何解决

1.安装过程中没有出现黑窗口。 2.报错如图所示。 3开始菜单里面只有一个anaconda prompt。![图片说明](https://img-ask.csdn.net/upload/201807/24/1532400279_317399.png)

anaconda 安装pytorch成功,PyCharm使用anaconda环境时在import torch这个地方报错

**我用anaconda成功安装pytorch,,测试结果如下:** ![图片说明](https://img-ask.csdn.net/upload/201907/31/1564571781_433161.jpg) **然后我配置PyCharm使用anaconda已经成功安装pytorh了的环境,如下图:** ![图片说明](https://img-ask.csdn.net/upload/201907/31/1564572015_840592.jpg) **都没问题,但是我测试的时候却出错了:** ![图片说明](https://img-ask.csdn.net/upload/201907/31/1564572102_460453.jpg) ![图片说明](https://img-ask.csdn.net/upload/201907/31/1564572161_739375.jpg) **我试过添加环境变量,把...torch/lib(_C.lib就在这里面)添加到PATH不行,sys,path.apend()也不行,仍然报同样的错。。。** 请问怎么解决?

Centos6.4 安装完tensorflow后 命令行输入 import tensorflow报错

小弟刚刚接触tensorflow,照的网上的教程安装完之后,在命令行运行import tensorflow这条语句的时候就报错了,下面是报错的内容,希望各位大神帮帮小弟。 >>> import tensorflow Traceback (most recent call last): File "<stdin>", line 1, in <module> File "/home/anaconda2/envs/tensorflow/lib/python2.7/site-packages/tensorflow/__init__.py", line 24, in <module> from tensorflow.python import * File "/home/anaconda2/envs/tensorflow/lib/python2.7/site-packages/tensorflow/python/__init__.py", line 49, in <module> from tensorflow.python import pywrap_tensorflow File "/home/anaconda2/envs/tensorflow/lib/python2.7/site-packages/tensorflow/python/pywrap_tensorflow.py", line 72, in <module> raise ImportError(msg) ImportError: Traceback (most recent call last): File "/home/anaconda2/envs/tensorflow/lib/python2.7/site-packages/tensorflow/python/pywrap_tensorflow.py", line 58, in <module> from tensorflow.python.pywrap_tensorflow_internal import * File "/home/anaconda2/envs/tensorflow/lib/python2.7/site-packages/tensorflow/python/pywrap_tensorflow_internal.py", line 28, in <module> _pywrap_tensorflow_internal = swig_import_helper() File "/home/anaconda2/envs/tensorflow/lib/python2.7/site-packages/tensorflow/python/pywrap_tensorflow_internal.py", line 24, in swig_import_helper _mod = imp.load_module('_pywrap_tensorflow_internal', fp, pathname, description) ImportError: /lib64/libc.so.6: version `GLIBC_2.16' not found (required by /home/zhufeng/anaconda2/envs/tensorflow/lib/python2.7/site-packages/tensorflow/python/_pywrap_tensorflow_internal.so) Failed to load the native TensorFlow runtime. See https://www.tensorflow.org/install/install_sources#common_installation_problems for some common reasons and solutions. Include the entire stack trace above this error message when asking for help.

安装anaconda时python报错

安装anaconda时python报错![图片说明](https://img-ask.csdn.net/upload/202003/25/1585151446_966341.png) 请问这个warning该如何解决? 查询python版本为3.7.4 ``` C:\Users\lenovo>python --version Python 3.7.4 ```

Python运行时找不到pandas库

需使用ARIMA代码,复制了论坛内一位大佬的ARIMA代码,F5运行时显示找不到pandas模块。萌新一枚,求指教怎么办555~

ANACONDA运行Spyder运行不了,报错,错误提示如下,不知道是什么原因。

Traceback (most recent call last): File "C:\Users\cgl9911\Anaconda3\Scripts\spyder-script.py", line 10, in sys.exit(main()) File "C:\Users\cgl9911\Anaconda3\lib\site-packages\spyder\app\start.py", line 186, in main from spyder.app import mainwindow File "C:\Users\cgl9911\Anaconda3\lib\site-packages\spyder\app\mainwindow.py", line 90, in from qtpy import QtWebEngineWidgets # analysis:ignore File "C:\Users\cgl9911\Anaconda3\lib\site-packages\qtpy\QtWebEngineWidgets.py", line 22, in from PyQt5.QtWebEngineWidgets import QWebEnginePage ValueError: PyCapsule_GetPointer called with incorrect name

安装anaconda后输入conda info 报错求解

想问下这个administrator : false; offline mode : false是什么问题怎么解决. 并且输入python后显示是环境变量但未激活。并且安装后桌面找不到anaconda的图标。望大神救救我!!! active environment : base active env location : D:\anaconda shell level : 1 user config file : C:\Users\Katharine\.condarc populated config files : conda version : 4.7.10 conda-build version : 3.18.8 python version : 3.7.3.final.0 virtual packages : __cuda=10.0 base environment : D:\anaconda (writable) channel URLs : https://repo.anaconda.com/pkgs/main/win-64 https://repo.anaconda.com/pkgs/main/noarch https://repo.anaconda.com/pkgs/r/win-64 https://repo.anaconda.com/pkgs/r/noarch https://repo.anaconda.com/pkgs/msys2/win-64 https://repo.anaconda.com/pkgs/msys2/noarch package cache : D:\anaconda\pkgs C:\Users\Katharine\.conda\pkgs C:\Users\Katharine\AppData\Local\conda\conda\pkgs envs directories : D:\anaconda\envs C:\Users\Katharine\.conda\envs C:\Users\Katharine\AppData\Local\conda\conda\envs platform : win-64 user-agent : conda/4.7.10 requests/2.22.0 CPython/3.7.3 Windows/10 Windows/10.0.17134 administrator : False netrc file : None offline mode : False

安装了pandas,为什么会出现ImportError: cannot import name 'DataFrame' from 'pandas' ?

本人是刚刚跨入Python的新人小白,希望大佬给予帮助!! 安装了pandas,为什么会出现ImportError: cannot import name 'DataFrame' from 'pandas' ?

anaconda创建的虚拟环境,运行tensorflow不报错但是也没有结果?

创建的虚拟环境中安装的是python3.6.10,tensorflow1.13.1,numpy1.16.0,运行代码 ``` import tensorflow as tf # import os # os.environ['TF_CPP_MIN_LOG_LEVEL']='2' hello = tf.constant('Hello, TensorFlow!') sess = tf.Session() print(sess.run(hello)) ``` 没有报错,但是也没有结果 ![图片说明](https://img-ask.csdn.net/upload/202005/07/1588818237_727505.png)

用vscode运行anaconda环境,在调试时出错,系统把conda activate base写入了用户输入区域该怎么办?

如题。不进行调试,在终端中运行不会出错,如下图。 ![图片说明](https://img-ask.csdn.net/upload/201903/18/1552913565_471827.png) 然而运行调试后如图, ![图片说明](https://img-ask.csdn.net/upload/201903/18/1552913633_501943.png) 注意比较终端区域。 问题原因猜测:在运行调试的时候编译器在运行语句前没有进入虚拟base环境,于是在遇到激活用户输入语句时,自动输入了conda activate base ,导致程序出错。求大神帮助

重装了anaconda后安装不了tensorflow,求大佬救救我

1.重装之前我在anaconda prompt里用找可以安装的版本装好了,可以用 ,后来电脑上把当时安装的盘清空了,再用这个方法就一直装不上: 2.用anaconda navigator 手动添加新的环境,在新环境里下好了tensorflow, 可是jupyter里还是不可以用tensorflow 3.最后我用anaconda navigator 直接在root里下tensorflow,就完全下不下来, 出现这个, UnsatisfiableError: The following specifications were found to be in conflict: - anaconda==2018.12=py37_0 -> bleach==3.0.2=py37_0 - anaconda==2018.12=py37_0 -> mkl-service==1.1.2=py37hb782905_5 - anaconda==2018.12=py37_0 -> numexpr==2.6.8=py37hdce8814_0 - anaconda==2018.12=py37_0 -> scikit-learn==0.20.1=py37h343c172_0 - tensorflow Use "conda info <package>" to see the dependencies for each package.

import theano报错No such file or directory

import theano 的时候出来一长串最后这样↓ 改了path也没用 Exception: Compilation failed (return status=1): g++.exe: error: Files\Anaconda2\MinGW: No such file or directory ===================================== 详细错误代码: Problem occurred during compilation with the command line below: "C:\Program Files\Anaconda2\Scripts\g++.bat" -shared -g -IC:\Program Files\Anaconda2\MinGW -DNPY_NO_DEPRECATED_API=NPY_1_7_API_VERSION -m32 -I"C:\Program Files\Anaconda2\lib\site-packages\numpy\core\include" -I"C:\Program Files\Anaconda2\include" -I"C:\Program Files\Anaconda2\lib\site-packages\theano\gof" -L"C:\Program Files\Anaconda2\libs" -L"C:\Program Files\Anaconda2" -o C:\Users\Administrator\AppData\Local\Theano\compiledir_Windows-7-6.1.7601-SP1-x86_Family_16_Model_6_Stepping_3_AuthenticAMD-2.7.12-32\lazylinker_ext\lazylinker_ext.pyd C:\Users\Administrator\AppData\Local\Theano\compiledir_Windows-7-6.1.7601-SP1-x86_Family_16_Model_6_Stepping_3_AuthenticAMD-2.7.12-32\lazylinker_ext\mod.cpp -lpython27 ExceptionTraceback (most recent call last) <ipython-input-3-3397704bd624> in <module>() ----> 1 import theano C:\Program Files\Anaconda2\lib\site-packages\theano\__init__.pyc in <module>() 64 object2, utils) 65 ---> 66 from theano.compile import ( 67 SymbolicInput, In, 68 SymbolicOutput, Out, C:\Program Files\Anaconda2\lib\site-packages\theano\compile\__init__.py in <module>() 8 SpecifyShape, specify_shape, register_specify_shape_c_code) 9 ---> 10 from theano.compile.function_module import * 11 12 from theano.compile.mode import * C:\Program Files\Anaconda2\lib\site-packages\theano\compile\function_module.py in <module>() 19 from theano.compat import izip 20 from theano.gof import graph ---> 21 import theano.compile.mode 22 from theano.compile.io import ( 23 In, SymbolicInput, SymbolicOutput) C:\Program Files\Anaconda2\lib\site-packages\theano\compile\mode.py in <module>() 8 import theano 9 from theano import gof ---> 10 import theano.gof.vm 11 from theano.configparser import config 12 from theano.compile.ops import _output_guard C:\Program Files\Anaconda2\lib\site-packages\theano\gof\vm.py in <module>() 657 658 try: --> 659 from . import lazylinker_c 660 661 class CVM(lazylinker_c.CLazyLinker, VM): C:\Program Files\Anaconda2\lib\site-packages\theano\gof\lazylinker_c.py in <module>() 125 args = cmodule.GCC_compiler.compile_args() 126 cmodule.GCC_compiler.compile_str(dirname, code, location=loc, --> 127 preargs=args) 128 # Save version into the __init__.py file. 129 init_py = os.path.join(loc, '__init__.py') C:\Program Files\Anaconda2\lib\site-packages\theano\gof\cmodule.pyc in compile_str(module_name, src_code, location, include_dirs, lib_dirs, libs, preargs, py_module, hide_symbols) 2307 # difficult to read. 2308 raise Exception('Compilation failed (return status=%s): %s' % -> 2309 (status, compile_stderr.replace('\n', '. '))) 2310 elif config.cmodule.compilation_warning and compile_stderr: 2311 # Print errors just below the command line. . ception: Compilation failed (return status=1): g++.exe: error: Files\Anaconda2\MinGW: No such file or directory

Anaconda使用conda更新或安装报错

Win10,Anaconda3,python3.6,使用conda或者pip命令upgrade或者install都会报错 以为是因为版本冲突,Anaconda重装了也没有用,帮忙看看是什么错误啦谢谢~ ``` --conda upgrade conda Fetching package metadata ...An unexpected error has occurred. Please consider posting the following information to the conda GitHub issue tracker at: https://github.com/conda/conda/issues Current conda install: platform : win-64 conda version : 4.3.27 conda is private : False conda-env version : 4.3.27 conda-build version : 3.0.22 python version : 3.6.2.final.0 requests version : 2.18.4 root environment : C:\Anaconda3 (writable) default environment : C:\Anaconda3 envs directories : C:\Anaconda3\envs C:\Users\Yvette~1\AppData\Local\conda\conda\envs C:\Users\Yvette\.conda\envs package cache : C:\Anaconda3\pkgs C:\Users\Yvette~1\AppData\Local\conda\conda\pkgs channel URLs : https://mirrors.tuna.tsinghua.edu.cn/anaconda/pkgs/free/win-64 https://mirrors.tuna.tsinghua.edu.cn/anaconda/pkgs/free/noarch https://repo.continuum.io/pkgs/main/win-64 https://repo.continuum.io/pkgs/main/noarch https://repo.continuum.io/pkgs/free/win-64 https://repo.continuum.io/pkgs/free/noarch https://repo.continuum.io/pkgs/r/win-64 https://repo.continuum.io/pkgs/r/noarch https://repo.continuum.io/pkgs/pro/win-64 https://repo.continuum.io/pkgs/pro/noarch https://repo.continuum.io/pkgs/msys2/win-64 https://repo.continuum.io/pkgs/msys2/noarch config file : C:\Users\陈惠宇宝宝\.condarc netrc file : None offline mode : False user-agent : conda/4.3.27 requests/2.18.4 CPython/3.6.2 Windows/10 Windows/10.0.15063 administrator : False `$ C:\Anaconda3\Scripts\conda upgrade conda` Traceback (most recent call last): File "C:\Anaconda3\lib\site-packages\conda\exceptions.py", line 640, in conda_exception_handler return_value = func(*args, **kwargs) File "C:\Anaconda3\lib\site-packages\conda\cli\main.py", line 140, in _main exit_code = args.func(args, p) File "C:\Anaconda3\lib\site-packages\conda\cli\main_update.py", line 65, in execute install(args, parser, 'update') File "C:\Anaconda3\lib\site-packages\conda\cli\install.py", line 231, in install unknown=index_args['unknown'], prefix=prefix) File "C:\Anaconda3\lib\site-packages\conda\core\index.py", line 101, in get_index index = fetch_index(channel_priority_map, use_cache=use_cache) File "C:\Anaconda3\lib\site-packages\conda\core\index.py", line 120, in fetch_index repodatas = collect_all_repodata(use_cache, tasks) File "C:\Anaconda3\lib\site-packages\conda\core\repodata.py", line 75, in collect_all_repodata repodatas = _collect_repodatas_serial(use_cache, tasks) File "C:\Anaconda3\lib\site-packages\conda\core\repodata.py", line 485, in _collect_repodatas_serial for url, schan, pri in tasks] File "C:\Anaconda3\lib\site-packages\conda\core\repodata.py", line 485, in <listcomp> for url, schan, pri in tasks] File "C:\Anaconda3\lib\site-packages\conda\core\repodata.py", line 115, in func res = f(*args, **kwargs) File "C:\Anaconda3\lib\site-packages\conda\core\repodata.py", line 464, in fetch_repodata mod_etag_headers.get('_mod')) File "C:\Anaconda3\lib\site-packages\conda\core\repodata.py", line 144, in fetch_repodata_remote_request timeout=timeout) File "C:\Anaconda3\lib\site-packages\requests\sessions.py", line 521, in get return self.request('GET', url, **kwargs) File "C:\Anaconda3\lib\site-packages\requests\sessions.py", line 508, in request resp = self.send(prep, **send_kwargs) File "C:\Anaconda3\lib\site-packages\requests\sessions.py", line 618, in send r = adapter.send(request, **kwargs) File "C:\Anaconda3\lib\site-packages\requests\adapters.py", line 440, in send timeout=timeout File "C:\Anaconda3\lib\site-packages\urllib3\connectionpool.py", line 595, in urlopen self._prepare_proxy(conn) File "C:\Anaconda3\lib\site-packages\urllib3\connectionpool.py", line 816, in _prepare_proxy conn.connect() File "C:\Anaconda3\lib\site-packages\urllib3\connection.py", line 284, in connect conn = self._new_conn() File "C:\Anaconda3\lib\site-packages\urllib3\connection.py", line 141, in _new_conn (self.host, self.port), self.timeout, **extra_kw) File "C:\Anaconda3\lib\site-packages\urllib3\util\connection.py", line 51, in create_connection if host.startswith('['): AttributeError: 'NoneType' object has no attribute 'startswith' ```

执行pip install pandas_datareader出错?

C:\WINDOWS\system32>pip install pandas_datareader Collecting pandas_datareader Using cached https://files.pythonhosted.org/packages/14/52/accb990baebe0063977f26e02df36aa7eb4015ed4e86f828cd76273cd6f1/pandas_datareader-0.8.1-py2.py3-none-any.whl Requirement already satisfied: pandas>=0.21 in c:\users\administrator\appdata\local\programs\python\python35\lib\site-packages (from pandas_datareader) (0.25.2) ERROR: Package 'pandas' requires a different Python: 3.5.2 not in '>=3.5.3' ``` ```

python import 出错。

文件结构如下 test2\ src\ __init__.py a.py b.py c.py ![图片说明](https://img-ask.csdn.net/upload/201811/04/1541335128_978617.png) --------------------------------------- a.py def p(): print("12345") ----------------------------------------- #b.py from a import p def bi(): p() --------------------------------------- #c.py import src.b if __name__ == "__main__": print("wo") src.b.bi() ---------------------------------------- Traceback (most recent call last): File "/home/andy/work/mypython/test/test2/c.py", line 2, in <module> import src.b File "/home/andy/work/mypython/test/test2/src/b.py", line 2, in <module> from a import p ModuleNotFoundError: No module named 'a' 大神们,为什么说a模块找不到呢,我用的3.6 版本的Python

python使用pandas处理绘图问题

版本:python3.6、anaconda3(64bit) 电脑配置:i7 3.6HZ 8CPU/8G内存 问题描述:使用pandas成功获取SQL数据后,首先我用sql的一个测试库 只有10个数据绘制折线图成功;后用正式库里面有20W条数据,运行后 没有报警,也没有反应等了5分钟也没有。我想知道它有没有在处理,怎 么看(是前后加time语句吗?)还请大神指点 以下是引用的库 import pandas as pd import matplotlib as mb import matplotlib.pyplot as plt import pandas as pd import pymysql

2019 Python开发者日-培训

2019 Python开发者日-培训

150讲轻松搞定Python网络爬虫

150讲轻松搞定Python网络爬虫

设计模式(JAVA语言实现)--20种设计模式附带源码

设计模式(JAVA语言实现)--20种设计模式附带源码

YOLOv3目标检测实战:训练自己的数据集

YOLOv3目标检测实战:训练自己的数据集

java后台+微信小程序 实现完整的点餐系统

java后台+微信小程序 实现完整的点餐系统

三个项目玩转深度学习(附1G源码)

三个项目玩转深度学习(附1G源码)

初级玩转Linux+Ubuntu(嵌入式开发基础课程)

初级玩转Linux+Ubuntu(嵌入式开发基础课程)

2019 AI开发者大会

2019 AI开发者大会

玩转Linux:常用命令实例指南

玩转Linux:常用命令实例指南

一学即懂的计算机视觉(第一季)

一学即懂的计算机视觉(第一季)

4小时玩转微信小程序——基础入门与微信支付实战

4小时玩转微信小程序——基础入门与微信支付实战

Git 实用技巧

Git 实用技巧

Python数据清洗实战入门

Python数据清洗实战入门

使用TensorFlow+keras快速构建图像分类模型

使用TensorFlow+keras快速构建图像分类模型

实用主义学Python(小白也容易上手的Python实用案例)

实用主义学Python(小白也容易上手的Python实用案例)

程序员的算法通关课:知己知彼(第一季)

程序员的算法通关课:知己知彼(第一季)

MySQL数据库从入门到实战应用

MySQL数据库从入门到实战应用

机器学习初学者必会的案例精讲

机器学习初学者必会的案例精讲

手把手实现Java图书管理系统(附源码)

手把手实现Java图书管理系统(附源码)

极简JAVA学习营第四期(报名以后加助教微信:eduxy-1)

极简JAVA学习营第四期(报名以后加助教微信:eduxy-1)

.net core快速开发框架

.net core快速开发框架

玩转Python-Python3基础入门

玩转Python-Python3基础入门

Python数据挖掘简易入门

Python数据挖掘简易入门

微信公众平台开发入门

微信公众平台开发入门

程序员的兼职技能课

程序员的兼职技能课

Windows版YOLOv4目标检测实战:训练自己的数据集

Windows版YOLOv4目标检测实战:训练自己的数据集

HoloLens2开发入门教程

HoloLens2开发入门教程

微信小程序开发实战

微信小程序开发实战

Java8零基础入门视频教程

Java8零基础入门视频教程

相关热词 c# 局部 截图 页面 c#实现简单的文件管理器 c# where c# 取文件夹路径 c# 对比 当天 c# fir 滤波器 c# 和站 队列 c# txt 去空格 c#移除其他类事件 c# 自动截屏
立即提问