Chen168169
心想事 .chen
采纳率0%
2021-03-03 00:44

求大佬指点!!!cmake编译失败

/home/username/opencv-3.4.5/opencv_contrib-3.4.5/modules/face/test/test_bif.cpp:39:10: fatal error: test_precomp.hpp: 没有那个文件或目录
 #include "test_precomp.hpp"
          ^~~~~~~~~~~~~~~~~~~~~~~~~~~~
compilation terminated.
make[2]: *** [modules/face/CMakeFiles/opencv_test_face.dir/build.make:63:modules/face/CMakeFiles/opencv_test_face.dir/test/test_bif.cpp.o] 错误 1
make[1]: *** [CMakeFiles/Makefile2:9012:modules/face/CMakeFiles/opencv_test_face.dir/all] 错误 2
make: *** [Makefile:163:all] 错误 2

 

求大佬给我指点迷津!!!按照路径/home/username/opencv-3.4.5/opencv_contrib-3.4.5/modules/face/test查找test_precomp.hpp,发现真没有这个test_precomp.hpp文件,求问怎么解决?

  • 点赞
  • 写回答
  • 关注问题
  • 收藏
  • 复制链接分享
  • 邀请回答

2条回答

  • qq_34124780 qq_34124780 1月前

    命令前面加个sudo试试?opencv安装好像是需要root权限的

    点赞 评论 复制链接分享
  • huanhuilong 幻灰龙 1月前

    详细描述安装步骤和编译命令?

    点赞 评论 复制链接分享