mvn build

cmd命令下为什么会报这样的。。求解

mvn eclipse:eclipse

[INFO] Scanning for projects...
[ERROR] The build could not read 1 project -> [Help 1]
[ERROR]
[ERROR] The project com.cup.cstp:nfic_transaction:1.0 (E:\nfic\transaction\pom
.xml) has 1 error
[ERROR] 'dependencies.dependency.version' for org.hibernate:hibernate-proxoo
l:jar is missing. @ line 29, column 15
[ERROR]
[ERROR] To see the full stack trace of the errors, re-run Maven with the -e swit
ch.
[ERROR] Re-run Maven using the -X switch to enable full debug logging.
[ERROR]
[ERROR] For more information about the errors and possible solutions, please rea
d the following articles:
[ERROR] [Help 1] http://cwiki.apache.org/confluence/display/MAVEN/ProjectBuildin
gException

2个回答

提示缺少package,试试:

mvn eclipse:clean eclipse:eclipse -DownloadSource=true

如果还是报错,在pom中,找到org.hibernate:hibernate-proxoo 这个包,手动下载下来,手动用mvn命令打到本地maven仓库中。

pom文件贴出来。

Csdn user default icon
上传中...
上传图片
插入图片
抄袭、复制答案,以达到刷声望分或其他目的的行为,在CSDN问答是严格禁止的,一经发现立刻封号。是时候展现真正的技术了!
其他相关推荐
mvn命令错误提示,BUILD FAILURE
使用的是myeclipse2015 stable2,maven3.3.9,SDk1.7 现在在命令行下执行mvn -v 版本信息正确; 但是直接执行mvn就错误了,信息如下: C:\Users\dansan>mvn [INFO] Scanning for projects... [INFO] ------------------------------------------------------------------------ [INFO] BUILD FAILURE [INFO] ------------------------------------------------------------------------ [INFO] Total time: 0.121 s [INFO] Finished at: 2016-07-09T20:11:49+08:00 [INFO] Final Memory: 5M/152M [INFO] ------------------------------------------------------------------------ [ERROR] No goals have been specified for this build. You must specify a valid li fecycle phase or a goal in the format <plugin-prefix>:<goal> or <plugin-group-id >:<plugin-artifact-id>[:<plugin-version>]:<goal>. Available lifecycle phases are : validate, initialize, generate-sources, process-sources, generate-resources, p rocess-resources, compile, process-classes, generate-test-sources, process-test- sources, generate-test-resources, process-test-resources, test-compile, process- test-classes, test, prepare-package, package, pre-integration-test, integration- test, post-integration-test, verify, install, deploy, pre-clean, clean, post-cle an, pre-site, site, post-site, site-deploy. -> [Help 1] [ERROR] [ERROR] To see the full stack trace of the errors, re-run Maven with the -e swit ch. [ERROR] Re-run Maven using the -X switch to enable full debug logging. [ERROR] [ERROR] For more information about the errors and possible solutions, please rea d the following articles: [ERROR] [Help 1] http://cwiki.apache.org/confluence/display/MAVEN/NoGoalSpecifie dException 这个到底是什么问题,已经在网络上找了好多问题,都没有解决
mvn tomcat:run启动项目运行显示的是BUILD SUCCESS没有启动tomcat
pom.xml如下: ``` <build> <plugins> <plugin> <!-- <groupId>org.eclipse.jetty</groupId> <artifactId>jetty-maven-plugin</artifactId> <version>9.3.20.v20170531</version> --> <groupId>org.apache.tomcat.maven</groupId> <artifactId>tomcat7-maven-plugin</artifactId> <version>2.2</version> </plugin> </plugins> </build> ``` 使用mvn jetty:run没问题,屏蔽jetty后换成tomcat插件 换成mvn tomcat:run或mvn tomcat7:run 就只显示BUILD SUCCESS并没有启动tomcat ![图片说明](https://img-ask.csdn.net/upload/201706/22/1498100037_830106.jpg)
maven下载之后,在cmd输入命令,mvn报错
maven下载之后,在cmd输入命令,mvn报错。已经配置好本地仓库和镜像。 ![错误截图](https://img-ask.csdn.net/upload/201911/20/1574220070_29967.png) ``` C:\Users\Administrator>mvn [INFO] Scanning for projects... [INFO] ------------------------------------------------------------------------ [INFO] BUILD FAILURE [INFO] ------------------------------------------------------------------------ [INFO] Total time: 0.056 s [INFO] Finished at: 2019-11-20T11:13:44+08:00 [INFO] ------------------------------------------------------------------------ [ERROR] No goals have been specified for this build. You must specify a valid lifecycle phase or a goal in the format <plugin-prefix>:<goal> or <plugin-group-id>:<plugin-artifact-id>[:<plugin-version>]:<goal>. Available lifecycle phases are: validate, initialize, generate-sources, process-sources, generate-resources, process-resources, compile, process-classes, generate-test-sources, process-test-sources, generate-test-resources, process-test-resources, test-compile, process-test-classes, test, prepare-package, package, pre-integration-test, integration-test, post-integration-test, verify, install, deploy, pre-clean, clean, post-clean, pre-site, site, post-site, site-deploy. -> [Help 1] [ERROR] [ERROR] To see the full stack trace of the errors, re-run Maven with the -e switch. [ERROR] Re-run Maven using the -X switch to enable full debug logging. [ERROR] [ERROR] For more information about the errors and possible solutions, please read the following articles: [ERROR] [Help 1] http://cwiki.apache.org/confluence/display/MAVEN/NoGoalSpecifiedException C:\Users\Administrator>mvn -v Apache Maven 3.6.1 (d66c9c0b3152b2e69ee9bac180bb8fcc8e6af555; 2019-04-05T03:00:29+08:00) Maven home: D:\soft\maven\apache-maven-3.6.1\bin\.. Java version: 1.8.0_121, vendor: Oracle Corporation, runtime: D:\jdk\jre Default locale: zh_CN, platform encoding: GBK OS name: "windows 10", version: "10.0", arch: "amd64", family: "windows" ```
使用docker推送时报错 java.lang.IllegalArgumentException: Errors were discovered while reifying SystemDescriptor
我的pom文件 ![图片说明](https://img-ask.csdn.net/upload/202001/19/1579401680_899898.png) 使用打包推送命令时报错:mvn docker:build -DpushImage ![图片说明](https://img-ask.csdn.net/upload/202001/19/1579401613_530369.png)
build path中maven dependencies缺失
从svn上导出的项目 试过在.classpath文件中添加关于maven的代码,比如: <classpathentry kind="con" path="org.eclipse.m2e.MAVEN2_CLASSPATH_CONTAINER" /> 结果在build path中出现的是:org.eclipse.m2e.MAVEN2_CLASSPATH_CONTAINER 而不是maven dependencies 试过 mvn eclipse:eclipse 报错: **[ERROR]No plugin found for prefix 'eclipse' in the current project and in the plugin groups [org.apache.maven.plugins, org.codehaus.mojo] available from the repositories [local (D:\maven_library), central (https://repo.maven.apache.org/maven2)] ** 右键项目没有maven选项,run as中没有maven clean啊maven build啊这些操作 求大神拯救。。。。
jpress mvn package失败,求大神指导
报错代码如下: [INFO] Scanning for projects... [WARNING] [WARNING] Some problems were encountered while building the effective model for io.jpress:codegen:jar:1.0 [WARNING] 'version' contains an expression but should be a constant. @ io.jpress:parent:${jpress.version}, D:\Program Files\jpress\pom.xml, line 10, column 14 [WARNING] 'build.plugins.plugin.version' for org.apache.maven.plugins:maven-compiler-plugin is missing. @ io.jpress:parent:${jpress.version}, D:\Program Files\jpress\pom.xml, line 146, column 21 [WARNING] [WARNING] Some problems were encountered while building the effective model for io.jpress:jpress-commons:jar:1.0 [WARNING] 'build.plugins.plugin.version' for org.apache.maven.plugins:maven-compiler-plugin is missing. @ io.jpress:parent:${jpress.version}, D:\Program Files\jpress\pom.xml, line 146, column 21 [WARNING] [WARNING] Some problems were encountered while building the effective model for io.jpress:jpress-core:jar:1.0 [WARNING] 'build.plugins.plugin.version' for org.apache.maven.plugins:maven-compiler-plugin is missing. @ io.jpress:jpress-core:[unknown-version], D:\Program Files\jpress\jpress-core\pom.xml, line 55, column 21 [WARNING] [WARNING] Some problems were encountered while building the effective model for io.jpress:jpress-web:jar:1.0 [WARNING] 'build.plugins.plugin.version' for org.apache.maven.plugins:maven-compiler-plugin is missing. @ io.jpress:parent:${jpress.version}, D:\Program Files\jpress\pom.xml, line 146, column 21 [WARNING] [WARNING] Some problems were encountered while building the effective model for io.jpress:jpress-service-api:jar:1.0 [WARNING] 'build.plugins.plugin.version' for org.apache.maven.plugins:maven-compiler-plugin is missing. @ io.jpress:parent:${jpress.version}, D:\Program Files\jpress\pom.xml, line 146, column 21 [WARNING] [WARNING] Some problems were encountered while building the effective model for io.jpress:jpress-service-provider:jar:1.0 [WARNING] 'build.plugins.plugin.version' for org.apache.maven.plugins:maven-compiler-plugin is missing. @ io.jpress:parent:${jpress.version}, D:\Program Files\jpress\pom.xml, line 146, column 21 [WARNING] [WARNING] Some problems were encountered while building the effective model for io.jpress:jpress-model:jar:1.0 [WARNING] 'build.plugins.plugin.version' for org.apache.maven.plugins:maven-compiler-plugin is missing. @ io.jpress:parent:${jpress.version}, D:\Program Files\jpress\pom.xml, line 146, column 21 [WARNING] [WARNING] Some problems were encountered while building the effective model for io.jpress:jpress-template:jar:1.0 [WARNING] 'build.plugins.plugin.version' for org.apache.maven.plugins:maven-compiler-plugin is missing. @ io.jpress:parent:${jpress.version}, D:\Program Files\jpress\pom.xml, line 146, column 21 [WARNING] [WARNING] Some problems were encountered while building the effective model for io.jpress:module-article-model:jar:1.0 [WARNING] 'build.plugins.plugin.version' for org.apache.maven.plugins:maven-compiler-plugin is missing. @ io.jpress:parent:${jpress.version}, D:\Program Files\jpress\pom.xml, line 146, column 21 [WARNING] [WARNING] Some problems were encountered while building the effective model for io.jpress:module-article-web:jar:1.0 [WARNING] 'build.plugins.plugin.version' for org.apache.maven.plugins:maven-compiler-plugin is missing. @ io.jpress:parent:${jpress.version}, D:\Program Files\jpress\pom.xml, line 146, column 21 [WARNING] [WARNING] Some problems were encountered while building the effective model for io.jpress:module-article-service-api:jar:1.0 [WARNING] 'build.plugins.plugin.version' for org.apache.maven.plugins:maven-compiler-plugin is missing. @ io.jpress:parent:${jpress.version}, D:\Program Files\jpress\pom.xml, line 146, column 21 [WARNING] [WARNING] Some problems were encountered while building the effective model for io.jpress:module-article-service-provider:jar:1.0 [WARNING] 'build.plugins.plugin.version' for org.apache.maven.plugins:maven-compiler-plugin is missing. @ io.jpress:parent:${jpress.version}, D:\Program Files\jpress\pom.xml, line 146, column 21 [WARNING] [WARNING] Some problems were encountered while building the effective model for io.jpress:module-article:pom:1.0 [WARNING] 'build.plugins.plugin.version' for org.apache.maven.plugins:maven-compiler-plugin is missing. @ io.jpress:parent:${jpress.version}, D:\Program Files\jpress\pom.xml, line 146, column 21 [WARNING] [WARNING] Some problems were encountered while building the effective model for io.jpress:module-page-model:jar:1.0 [WARNING] 'build.plugins.plugin.version' for org.apache.maven.plugins:maven-compiler-plugin is missing. @ io.jpress:parent:${jpress.version}, D:\Program Files\jpress\pom.xml, line 146, column 21 [WARNING] [WARNING] Some problems were encountered while building the effective model for io.jpress:module-page-web:jar:1.0 [WARNING] 'build.plugins.plugin.version' for org.apache.maven.plugins:maven-compiler-plugin is missing. @ io.jpress:parent:${jpress.version}, D:\Program Files\jpress\pom.xml, line 146, column 21 [WARNING] [WARNING] Some problems were encountered while building the effective model for io.jpress:module-page-service-api:jar:1.0 [WARNING] 'build.plugins.plugin.version' for org.apache.maven.plugins:maven-compiler-plugin is missing. @ io.jpress:parent:${jpress.version}, D:\Program Files\jpress\pom.xml, line 146, column 21 [WARNING] [WARNING] Some problems were encountered while building the effective model for io.jpress:module-page-service-provider:jar:1.0 [WARNING] 'build.plugins.plugin.version' for org.apache.maven.plugins:maven-compiler-plugin is missing. @ io.jpress:parent:${jpress.version}, D:\Program Files\jpress\pom.xml, line 146, column 21 [WARNING] [WARNING] Some problems were encountered while building the effective model for io.jpress:module-page:pom:1.0 [WARNING] 'build.plugins.plugin.version' for org.apache.maven.plugins:maven-compiler-plugin is missing. @ io.jpress:parent:${jpress.version}, D:\Program Files\jpress\pom.xml, line 146, column 21 [WARNING] [WARNING] Some problems were encountered while building the effective model for io.jpress:starter:jar:1.0 [WARNING] 'build.plugins.plugin.(groupId:artifactId)' must be unique but found duplicate declaration of plugin org.apache.maven.plugins:maven-remote-resources-plugin @ io.jpress:starter:[unknown-version], D:\Program Files\jpress\starter\pom.xml, line 203, column 21 [WARNING] 'build.plugins.plugin.version' for org.apache.maven.plugins:maven-compiler-plugin is missing. @ io.jpress:starter:[unknown-version], D:\Program Files\jpress\starter\pom.xml, line 142, column 21 [WARNING] [WARNING] Some problems were encountered while building the effective model for io.jpress:starter-tomcat:war:1.0 [WARNING] 'build.plugins.plugin.version' for org.apache.maven.plugins:maven-compiler-plugin is missing. @ io.jpress:starter-tomcat:[unknown-version], D:\Program Files\jpress\starter-tomcat\pom.xml, line 164, column 21 [WARNING] 'build.plugins.plugin.version' for org.apache.maven.plugins:maven-war-plugin is missing. @ io.jpress:starter-tomcat:[unknown-version], D:\Program Files\jpress\starter-tomcat\pom.xml, line 221, column 21 [WARNING] [WARNING] Some problems were encountered while building the effective model for io.jpress:parent:pom:1.0 [WARNING] 'version' contains an expression but should be a constant. @ io.jpress:parent:${jpress.version}, D:\Program Files\jpress\pom.xml, line 10, column 14 [WARNING] 'build.plugins.plugin.version' for org.apache.maven.plugins:maven-compiler-plugin is missing. @ io.jpress:parent:${jpress.version}, D:\Program Files\jpress\pom.xml, line 146, column 21 [WARNING] [WARNING] It is highly recommended to fix these problems because they threaten the stability of your build. [WARNING] [WARNING] For this reason, future Maven versions might no longer support building such malformed projects. [WARNING] [INFO] ------------------------------------------------------------------------ [INFO] Reactor Build Order: [INFO] [INFO] parent [pom] [INFO] codegen [jar] [INFO] jpress-commons [jar] [INFO] jpress-model [jar] [INFO] jpress-service-api [jar] [INFO] jpress-core [jar] [INFO] jpress-web [jar] [INFO] jpress-service-provider [jar] [INFO] jpress-template [jar] [INFO] module-article [pom] [INFO] module-article-model [jar] [INFO] module-article-service-api [jar] [INFO] module-article-service-provider [jar] [INFO] module-article-web [jar] [INFO] module-page [pom] [INFO] module-page-model [jar] [INFO] module-page-service-api [jar] [INFO] module-page-service-provider [jar] [INFO] module-page-web [jar] [INFO] starter [jar] [INFO] starter-tomcat [war] [INFO] [INFO] --------------------------< io.jpress:parent >-------------------------- [INFO] Building parent 1.0 [1/21] [INFO] --------------------------------[ pom ]--------------------------------- [INFO] [INFO] -------------------------< io.jpress:codegen >-------------------------- [INFO] Building codegen 1.0 [2/21] [INFO] --------------------------------[ jar ]--------------------------------- [INFO] [INFO] --- maven-resources-plugin:2.6:resources (default-resources) @ codegen --- [WARNING] Using platform encoding (GBK actually) to copy filtered resources, i.e. build is platform dependent! [INFO] Copying 9 resources [INFO] skip non existing resourceDirectory D:\Program Files\jpress\codegen\src\main\resources [INFO] [INFO] --- maven-compiler-plugin:3.1:compile (default-compile) @ codegen --- [INFO] Changes detected - recompiling the module! [INFO] Compiling 7 source files to D:\Program Files\jpress\codegen\target\classes [INFO] ------------------------------------------------------------- [ERROR] COMPILATION ERROR : [INFO] ------------------------------------------------------------- [ERROR] No compiler is provided in this environment. Perhaps you are running on a JRE rather than a JDK? [INFO] 1 error [INFO] ------------------------------------------------------------- [INFO] ------------------------------------------------------------------------ [INFO] Reactor Summary: [INFO] [INFO] parent 1.0 ......................................... SUCCESS [ 0.228 s] [INFO] codegen ............................................ FAILURE [ 4.318 s] [INFO] jpress-commons ..................................... SKIPPED [INFO] jpress-model ....................................... SKIPPED [INFO] jpress-service-api ................................. SKIPPED [INFO] jpress-core ........................................ SKIPPED [INFO] jpress-web ......................................... SKIPPED [INFO] jpress-service-provider ............................ SKIPPED [INFO] jpress-template .................................... SKIPPED [INFO] module-article ..................................... SKIPPED [INFO] module-article-model ............................... SKIPPED [INFO] module-article-service-api ......................... SKIPPED [INFO] module-article-service-provider .................... SKIPPED [INFO] module-article-web ................................. SKIPPED [INFO] module-page ........................................ SKIPPED [INFO] module-page-model .................................. SKIPPED [INFO] module-page-service-api ............................ SKIPPED [INFO] module-page-service-provider ....................... SKIPPED [INFO] module-page-web .................................... SKIPPED [INFO] starter ............................................ SKIPPED [INFO] starter-tomcat 1.0 ................................. SKIPPED [INFO] ------------------------------------------------------------------------ [INFO] BUILD FAILURE [INFO] ------------------------------------------------------------------------ [INFO] Total time: 6.688 s [INFO] Finished at: 2018-10-27T17:50:59+08:00 [INFO] ------------------------------------------------------------------------ [ERROR] Failed to execute goal org.apache.maven.plugins:maven-compiler-plugin:3.1:compile (default-compile) on project codegen: Compilation failure [ERROR] No compiler is provided in this environment. Perhaps you are running on a JRE rather than a JDK? [ERROR] [ERROR] -> [Help 1] [ERROR] [ERROR] To see the full stack trace of the errors, re-run Maven with the -e switch. [ERROR] Re-run Maven using the -X switch to enable full debug logging. [ERROR] [ERROR] For more information about the errors and possible solutions, please read the following articles: [ERROR] [Help 1] http://cwiki.apache.org/confluence/display/MAVEN/MojoFailureException [ERROR] [ERROR] After correcting the problems, you can resume the build with the command [ERROR] mvn <goals> -rf :codegen mvn -version运行正常: Apache Maven 3.5.4 (1edded0938998edf8bf061f1ceb3cfdeccf443fe; 2018-06-18T02:33:14+08:00) Maven home: D:\Program Files\Apache\maven3.5.4\bin\.. Java version: 1.8.0_141, vendor: Oracle Corporation, runtime: C:\Program Files\Java\jre1.8.0_141 Default locale: zh_CN, platform encoding: GBK OS name: "windows 10", version: "10.0", arch: "amd64", family: "windows" 阿里云镜像配置没问题: <mirrors> <!-- mirror | Specifies a repository mirror site to use instead of a given repository. The repository that | this mirror serves has an ID that matches the mirrorOf element of this mirror. IDs are used | for inheritance and direct lookup purposes, and must be unique across the set of mirrors. | <mirror> <id>mirrorId</id> <mirrorOf>repositoryId</mirrorOf> <name>Human Readable Name for this Mirror.</name> <url>http://my.repository.com/repo/path</url> </mirror> --> <mirror> <id>alimaven</id> <name>aliyun maven</name> <url>http://maven.aliyun.com/nexus/content/groups/public/</url> <mirrorOf>central</mirrorOf> </mirror> </mirrors>
如何使用mvn eclipse:eclipse 将多个模块/项目 转换成eclipse项目
如题,因为POM.XML中依赖别的项目,对一个项目进行mvn eclipse:eclipse转换成eclipse项目时报错: C:\Cross\MabezSRC\mabez_src\build\buildhome\NumberNormalization>mvn eclipse:ecli pse [INFO] Scanning for projects... [ERROR] The build could not read 1 project -> [Help 1] [ERROR] [ERROR] The project com.xxx.xxx:NumberNormalizatio n:1.0 (C:\Cross\MabezSRC\mabez_src\build\buildhome\NumberNormalization\pom.xml) has 1 error [ERROR] Non-resolvable parent POM: Failure to find com.ericsson.fasttrack.dt ag.ngfa1:DtagDefs:pom:1.0 in http://repo.maven.apache.org/maven2 was cached in t he local repository, resolution will not be reattempted until the update interva l of central has elapsed or updates are forced and 'parent.relativePath' points at wrong local POM @ line 26, column 10 -> [Help 2] [ERROR] [ERROR] To see the full stack trace of the errors, re-run Maven with the -e swit ch. [ERROR] Re-run Maven using the -X switch to enable full debug logging. [ERROR] [ERROR] For more information about the errors and possible solutions, please rea d the following articles: [ERROR] [Help 1] http://cwiki.apache.org/confluence/display/MAVEN/ProjectBuildin gException [ERROR] [Help 2] http://cwiki.apache.org/confluence/display/MAVEN/UnresolvableMo delException C:\Cross\MabezSRC\mabez_src\build\buildhome\NumberNormalization>
eclipse中Maven Build出错
Maven是3.3.1,项目是用quickstart生成的。 异常: -Dmaven.multiModuleProjectDirectory system propery is not set. Check $M2_HOME environment variable and mvn script match. 请问该如何解决?
mvn help:system报错,求大神解决
[INFO] Scanning for projects... [WARNING] The POM for org.apache.maven.plugins:maven-deploy-plugin:jar:2.7 is missing, no dependency information available Downloading: http://acooly.wicp.net/nexus/content/groups/public/org/apache/maven/plugins/maven-site-plugin/3.3/maven-site-plugin-3.3.pom 还有一系列与这个类似的警告,最后build failuer
执行mvn sonar:sonar报错
[ERROR] Failed to execute goal org.sonarsource.scanner.maven:sonar-maven-plugin:3.3.0.603:sonar (default-cli) on project edu-common: Unable to register extension org.sonar.plugins.checkstyle.CheckstyleExecutor: Lorg/sonar/plugins/java/api/JavaResourceLocator;: org.sonar.plugins.java.api.JavaResourceLocator -> [Help 1] org.apache.maven.lifecycle.LifecycleExecutionException: Failed to execute goal org.sonarsource.scanner.maven:sonar-maven-plugin:3.3.0.603:sonar (default-cli) on project edu-common: Unable to register extension org.sonar.plugins.checkstyle.CheckstyleExecutor at org.apache.maven.lifecycle.internal.MojoExecutor.execute(MojoExecutor.java:212) at org.apache.maven.lifecycle.internal.MojoExecutor.execute(MojoExecutor.java:153) at org.apache.maven.lifecycle.internal.MojoExecutor.execute(MojoExecutor.java:145) at org.apache.maven.lifecycle.internal.LifecycleModuleBuilder.buildProject(LifecycleModuleBuilder.java:116) at org.apache.maven.lifecycle.internal.LifecycleModuleBuilder.buildProject(LifecycleModuleBuilder.java:80) at org.apache.maven.lifecycle.internal.builder.singlethreaded.SingleThreadedBuilder.build(SingleThreadedBuilder.java:51) at org.apache.maven.lifecycle.internal.LifecycleStarter.execute(LifecycleStarter.java:128) at org.apache.maven.DefaultMaven.doExecute(DefaultMaven.java:307) at org.apache.maven.DefaultMaven.doExecute(DefaultMaven.java:193) at org.apache.maven.DefaultMaven.execute(DefaultMaven.java:106) at org.apache.maven.cli.MavenCli.execute(MavenCli.java:863) at org.apache.maven.cli.MavenCli.doMain(MavenCli.java:288) at org.apache.maven.cli.MavenCli.main(MavenCli.java:199) at sun.reflect.NativeMethodAccessorImpl.invoke0(Native Method) at sun.reflect.NativeMethodAccessorImpl.invoke(NativeMethodAccessorImpl.java:62) at sun.reflect.DelegatingMethodAccessorImpl.invoke(DelegatingMethodAccessorImpl.java:43) at java.lang.reflect.Method.invoke(Method.java:498) at org.codehaus.plexus.classworlds.launcher.Launcher.launchEnhanced(Launcher.java:289) at org.codehaus.plexus.classworlds.launcher.Launcher.launch(Launcher.java:229) at org.codehaus.plexus.classworlds.launcher.Launcher.mainWithExitCode(Launcher.java:415) at org.codehaus.plexus.classworlds.launcher.Launcher.main(Launcher.java:356) Caused by: org.apache.maven.plugin.MojoExecutionException: Unable to register extension org.sonar.plugins.checkstyle.CheckstyleExecutor at org.sonarsource.scanner.maven.bootstrap.ExceptionHandling.handle(ExceptionHandling.java:36) at org.sonarsource.scanner.maven.bootstrap.ScannerBootstrapper.execute(ScannerBootstrapper.java:80) at org.sonarsource.scanner.maven.SonarQubeMojo.execute(SonarQubeMojo.java:139) at org.apache.maven.plugin.DefaultBuildPluginManager.executeMojo(DefaultBuildPluginManager.java:134) at org.apache.maven.lifecycle.internal.MojoExecutor.execute(MojoExecutor.java:207) ... 20 more Caused by: java.lang.IllegalStateException: Unable to register extension org.sonar.plugins.checkstyle.CheckstyleExecutor at org.sonar.core.platform.ComponentContainer.addExtension(ComponentContainer.java:248) at org.sonar.batch.bootstrap.ExtensionInstaller.doInstall(ExtensionInstaller.java:76) at org.sonar.batch.bootstrap.ExtensionInstaller.install(ExtensionInstaller.java:57) at org.sonar.batch.scan.ModuleScanContainer.addExtensions(ModuleScanContainer.java:179) at org.sonar.batch.scan.ModuleScanContainer.doBeforeStart(ModuleScanContainer.java:95) at org.sonar.core.platform.ComponentContainer.startComponents(ComponentContainer.java:140) at org.sonar.core.platform.ComponentContainer.execute(ComponentContainer.java:127) at org.sonar.batch.scan.ProjectScanContainer.scan(ProjectScanContainer.java:241) at org.sonar.batch.scan.ProjectScanContainer.scanRecursively(ProjectScanContainer.java:236) at org.sonar.batch.scan.ProjectScanContainer.doAfterStart(ProjectScanContainer.java:226) at org.sonar.core.platform.ComponentContainer.startComponents(ComponentContainer.java:142) at org.sonar.core.platform.ComponentContainer.execute(ComponentContainer.java:127) at org.sonar.batch.task.ScanTask.execute(ScanTask.java:47) at org.sonar.batch.task.TaskContainer.doAfterStart(TaskContainer.java:86) at org.sonar.core.platform.ComponentContainer.startComponents(ComponentContainer.java:142) at org.sonar.core.platform.ComponentContainer.execute(ComponentContainer.java:127) at org.sonar.batch.bootstrap.GlobalContainer.executeTask(GlobalContainer.java:106) at org.sonar.batch.bootstrapper.Batch.executeTask(Batch.java:119) at org.sonarsource.scanner.api.internal.batch.BatchIsolatedLauncher.execute(BatchIsolatedLauncher.java:63) at sun.reflect.NativeMethodAccessorImpl.invoke0(Native Method) at sun.reflect.NativeMethodAccessorImpl.invoke(NativeMethodAccessorImpl.java:62) at sun.reflect.DelegatingMethodAccessorImpl.invoke(DelegatingMethodAccessorImpl.java:43) at java.lang.reflect.Method.invoke(Method.java:498) at org.sonarsource.scanner.api.internal.IsolatedLauncherProxy.invoke(IsolatedLauncherProxy.java:60) at com.sun.proxy.$Proxy23.execute(Unknown Source) at org.sonarsource.scanner.api.EmbeddedScanner.doExecute(EmbeddedScanner.java:233) at org.sonarsource.scanner.api.EmbeddedScanner.runAnalysis(EmbeddedScanner.java:151) at org.sonarsource.scanner.maven.bootstrap.ScannerBootstrapper.execute(ScannerBootstrapper.java:77) ... 23 more Caused by: java.lang.NoClassDefFoundError: Lorg/sonar/plugins/java/api/JavaResourceLocator; at java.lang.Class.getDeclaredFields0(Native Method) at java.lang.Class.privateGetDeclaredFields(Class.java:2583) at java.lang.Class.getDeclaredFields(Class.java:1916) at org.picocontainer.injectors.AdaptingInjection$2.run(AdaptingInjection.java:217) at java.security.AccessController.doPrivileged(Native Method) at org.picocontainer.injectors.AdaptingInjection.injectionFieldAnnotated(AdaptingInjection.java:209) at org.picocontainer.injectors.AdaptingInjection.fieldAnnotatedInjectionAdapter(AdaptingInjection.java:188) at org.picocontainer.injectors.AdaptingInjection.createComponentAdapter(AdaptingInjection.java:57) at org.picocontainer.behaviors.AbstractBehaviorFactory.createComponentAdapter(AbstractBehaviorFactory.java:44) at org.picocontainer.behaviors.OptInCaching.createComponentAdapter(OptInCaching.java:45) at org.picocontainer.DefaultPicoContainer.addComponent(DefaultPicoContainer.java:536) at org.picocontainer.DefaultPicoContainer.access$300(DefaultPicoContainer.java:84) at org.picocontainer.DefaultPicoContainer$AsPropertiesPicoContainer.addComponent(DefaultPicoContainer.java:1149) at org.sonar.core.platform.ComponentContainer.addExtension(ComponentContainer.java:246) ... 50 more Caused by: java.lang.ClassNotFoundException: org.sonar.plugins.java.api.JavaResourceLocator at org.sonar.classloader.ParentFirstStrategy.loadClass(ParentFirstStrategy.java:39) at org.sonar.classloader.ClassRealm.loadClass(ClassRealm.java:87) at org.sonar.classloader.ClassRealm.loadClass(ClassRealm.java:76) ... 64 more [ERROR] [ERROR] Re-run Maven using the -X switch to enable full debug logging. [ERROR] [ERROR] For more information about the errors and possible solutions, please read the following articles: [ERROR] [Help 1] http://cwiki.apache.org/confluence/display/MAVEN/MojoExecutionException
maven打包报错,用命令打包的mvn package 接着报这个错,急等
![图片说明](https://img-ask.csdn.net/upload/201802/02/1517553010_852643.png) ![图片说明](https://img-ask.csdn.net/upload/201802/02/1517553902_211162.png) jdk用的1.8 pom.xml配置maven之后 ``` <build> <plugins> <plugin> <groupId>org.apache.maven.plugins</groupId> <artifactId>maven-compiler-plugin</artifactId> <version>3.3</version> <configuration> <source>1.8</source> <target>1.8</target> </configuration> </plugin> </plugins> </build> ``` 又报错 ![图片说明](https://img-ask.csdn.net/upload/201802/02/1517557255_958482.png) 通过 ``` <build> <plugins> <plugin> <groupId>org.apache.maven.plugins</groupId> <artifactId>maven-compiler-plugin</artifactId> <version>3.3</version> <configuration> <source>1.8</source> <target>1.8</target> <encoding>UTF-8</encoding> <compilerArguments> <verbose /> <bootclasspath>${java.home}\lib\rt.jar;${java.home}\lib\jce.jar</bootclasspath> </compilerArguments> </configuration> </plugin> </plugins> </build> ``` 解决 现在发布又出现了新问题 ![图片说明](https://img-ask.csdn.net/upload/201802/02/1517560036_768869.png)
Maven help命令报错build failure
![图片说明](https://img-ask.csdn.net/upload/201811/12/1542021051_792846.png) mvn -v成功 镜像也换过了 代理也试过了 都无法解决该问题
关于maven的问题 mvn package时出现的错误
[root@localhost storm-starter-master]# mvn -f m2-pom.xml package [INFO] Scanning for projects... Downloading: http://repo.maven.apache.org/maven2/com/theoryinpractise/clojure-maven-plugin/1.3.8/clojure-maven-plugin-1.3.8.pom [ERROR] The build could not read 1 project -> [Help 1] [ERROR] [ERROR] The project storm.starter:storm-starter:0.0.1-SNAPSHOT (/home/lmy/storm-starter-master/m2-pom.xml) has 1 error [ERROR] Unresolveable build extension: Plugin com.theoryinpractise:clojure-maven-plugin:1.3.8 or one of its dependencies could not be resolved: Failed to collect dependencies for com.theoryinpractise:clojure-maven-plugin:jar:1.3.8 (): Failed to read artifact descriptor for com.theoryinpractise:clojure-maven-plugin:jar:1.3.8: Could not transfer artifact com.theoryinpractise:clojure-maven-plugin:pom:1.3.8 from/to central (http://repo.maven.apache.org/maven2): repo.maven.apache.org: Name or service not known: Unknown host repo.maven.apache.org: Name or service not known -> [Help 2] [ERROR] [ERROR] To see the full stack trace of the errors, re-run Maven with the -e switch. [ERROR] Re-run Maven using the -X switch to enable full debug logging. [ERROR] [ERROR] For more information about the errors and possible solutions, please read the following articles: [ERROR] [Help 1] http://cwiki.apache.org/confluence/display/MAVEN/ProjectBuildingException [ERROR] [Help 2] http://cwiki.apache.org/confluence/display/MAVEN/PluginResolutionException
关于用mvn编译java程序的问题
INFO:hackathon.launcher:execute script: mvn -T 2C clean package -Dmaven.test.skip=true -f ./draenor/pom.xml [INFO] Scanning for projects... [INFO] Building with 4 threads [INFO] [INFO] ------------------------------------------------------------------------ [INFO] Building draenor 0.1.0-SNAPSHOT [INFO] ------------------------------------------------------------------------ [WARNING] ***************************************************************** [WARNING] * Your build is requesting parallel execution, but project * [WARNING] * contains the following plugin(s) that are not marked as * [WARNING] * @threadSafe to support parallel building. * [WARNING] * While this /may/ work fine, please look for plugin updates * [WARNING] * and/or request plugins be made thread-safe. * [WARNING] * If reporting an issue, report it against the plugin in * [WARNING] * question, not against maven-core * [WARNING] ***************************************************************** [WARNING] The following plugins are not marked @threadSafe in draenor: [WARNING] org.apache.maven.plugins:maven-jar-plugin:2.2 [WARNING] ***************************************************************** [INFO] [INFO] --- maven-clean-plugin:2.5:clean (default-clean) @ draenor --- [INFO] Deleting /vagrant/./draenor/target [INFO] [INFO] --- maven-resources-plugin:2.5:resources (default-resources) @ draenor --- [debug] execute contextualize 日志文件里上述警告不断出现,程序没启动起来,各位大神,上面是说什么意思啊,我的程序时在Ubuntu下跑的,用的是maven
不知道有没有大神研究openmeetings,使用的是3.0.3版本,使用ant+ivy构建依赖和项目的
ant运行build.xml过程中老出错 <untar src="${red5.server.dir}/target/red5-server-${red5.server.version}-server.tar.gz" dest="${red5.server.dir}/target" compression="gzip"/> 这句报错,好像是不能压缩到那个路径下 附上部分打印信息: [artifact:mvn] [main] INFO org.apache.maven.cli.event.ExecutionEventLogger - [artifact:mvn] [main] INFO org.apache.maven.cli.event.ExecutionEventLogger - --- maven-install-plugin:2.4:install (default-install) @ red5-server --- [artifact:mvn] [main] INFO org.apache.maven.DefaultMaven - Installing F:\J2EEMyEclipse\apache-openmeetings-3.0.3-src\build\red5\server\target\red5-server-1.0.3-RELEASE.jar to C:\Users\ZhangV\.m2\repository\org\red5\red5-server\1.0.3-RELEASE\red5-server-1.0.3-RELEASE.jar [artifact:mvn] [main] INFO org.apache.maven.DefaultMaven - Installing F:\J2EEMyEclipse\apache-openmeetings-3.0.3-src\build\red5\server\pom.xml to C:\Users\ZhangV\.m2\repository\org\red5\red5-server\1.0.3-RELEASE\red5-server-1.0.3-RELEASE.pom [artifact:mvn] [main] INFO org.apache.maven.DefaultMaven - Installing F:\J2EEMyEclipse\apache-openmeetings-3.0.3-src\build\red5\server\target\red5-server-1.0.3-RELEASE-sources.jar to C:\Users\ZhangV\.m2\repository\org\red5\red5-server\1.0.3-RELEASE\red5-server-1.0.3-RELEASE-sources.jar [artifact:mvn] [main] INFO org.apache.maven.DefaultMaven - Installing F:\J2EEMyEclipse\apache-openmeetings-3.0.3-src\build\red5\server\target\red5-server-1.0.3-RELEASE-server.tar.gz to C:\Users\ZhangV\.m2\repository\org\red5\red5-server\1.0.3-RELEASE\red5-server-1.0.3-RELEASE-server.tar.gz [artifact:mvn] [main] INFO org.apache.maven.DefaultMaven - Installing F:\J2EEMyEclipse\apache-openmeetings-3.0.3-src\build\red5\server\target\red5-server-1.0.3-RELEASE-server.zip to C:\Users\ZhangV\.m2\repository\org\red5\red5-server\1.0.3-RELEASE\red5-server-1.0.3-RELEASE-server.zip [artifact:mvn] [main] INFO org.apache.maven.DefaultMaven - Installing F:\J2EEMyEclipse\apache-openmeetings-3.0.3-src\build\red5\server\target\red5-server-1.0.3-RELEASE-javadoc.jar to C:\Users\ZhangV\.m2\repository\org\red5\red5-server\1.0.3-RELEASE\red5-server-1.0.3-RELEASE-javadoc.jar [artifact:mvn] [main] INFO org.apache.maven.cli.event.ExecutionEventLogger - ------------------------------------------------------------------------ [artifact:mvn] [main] INFO org.apache.maven.cli.event.ExecutionEventLogger - BUILD SUCCESS [artifact:mvn] [main] INFO org.apache.maven.cli.event.ExecutionEventLogger - ------ ------------------------------------------------------------------ [artifact:mvn] [main] INFO org.apache.maven.cli.event.ExecutionEventLogger - Total time: 02:54 min [artifact:mvn] [main] INFO org.apache.maven.cli.event.ExecutionEventLogger - Finished at: 2014-09-30T11:24:54+08:00 [artifact:mvn] [main] INFO org.apache.maven.cli.event.ExecutionEventLogger - Final Memory: 20M/97M [artifact:mvn] [main] INFO org.apache.maven.cli.event.ExecutionEventLogger - ------------------------------------------------------------------------ [untar] Expanding: F:\J2EEMyEclipse\apache-openmeetings-3.0.3-src\build\red5\server\target\red5-server-1.0.3-RELEASE-server.tar.gz into F:\J2EEMyEclipse\apache-openmeetings-3.0.3-src\build\red5\server\target BUILD FAILED F:\J2EEMyEclipse\apache-openmeetings-3.0.3-src\build.xml:1185: Error while expanding F:\J2EEMyEclipse\apache-openmeetings-3.0.3-src\build\red5\server\target\red5-server-1.0.3-RELEASE-server.tar.gz java.io.IOException: Error detected parsing the header Total time: 5 minutes 41 seconds
工程pom里已配置关了test, 但想命令行临时运行一下test,mvn命令是怎样的?
我的Maven工程pom.xml里已配置关了test, <plugin> <artifactId>maven-surefire-plugin</artifactId> <version>2.7.1</version> <executions> <execution> <id>default-test</id> <phase>test</phase> <goals> <goal>test</goal> </goals> </execution> </executions> <configuration> <!-- <testFailureIgnore>true</testFailureIgnore> --> <!-- <skip>true</skip> --> <skipTests>true</skipTests> </configuration> </plugin> 但我想命令行运行,临时打开test跑一下, 我用 mvn test -DskipTests=false 但仍然是skip跳过 D:\GIT_Work\iVIEW8.5\oss\xml\xmlservice\api>mvn test -DskipTests=false [INFO] Scanning for projects... [INFO] [INFO] ------------------------------------------------------------------------ [INFO] Building xmlservice-api 8.2.0-SNAPSHOT [INFO] ------------------------------------------------------------------------ [INFO] [INFO] --- maven-resources-plugin:2.5:resources (default-resources) @ xmlservice-api --- [debug] execute contextualize [INFO] Using 'UTF-8' encoding to copy filtered resources. [INFO] Copying 2 resources [INFO] [INFO] --- maven-compiler-plugin:2.5.1:compile (default-compile) @ xmlservice-api --- [INFO] Nothing to compile - all classes are up to date [INFO] [INFO] --- native2ascii-maven-plugin:1.0-beta-1:native2ascii (native2ascii) @ xmlservice-api --- [INFO] Includes: [*.properties] [INFO] Excludes: [] [INFO] Processing D:\GIT_Work\iVIEW8.5\oss\xml\xmlservice\api\target\classes\xmlservicebiz.properties [INFO] Processing D:\GIT_Work\iVIEW8.5\oss\xml\xmlservice\api\target\classes\xmlservicebiz_zh_CN.properties [INFO] [INFO] --- maven-resources-plugin:2.5:testResources (default-testResources) @ xmlservice-api --- [debug] execute contextualize [INFO] Using 'UTF-8' encoding to copy filtered resources. [INFO] Copying 4 resources [INFO] [INFO] --- maven-compiler-plugin:2.5.1:testCompile (default-testCompile) @ xmlservice-api --- [INFO] Nothing to compile - all classes are up to date [INFO] [INFO] --- maven-surefire-plugin:2.7.1:test (default-test) @ xmlservice-api --- [INFO] Tests are skipped. [INFO] ------------------------------------------------------------------------ [INFO] BUILD SUCCESS [INFO] ------------------------------------------------------------------------ [INFO] Total time: 0.939s [INFO] Finished at: Fri Sep 18 17:47:24 CST 2015 [INFO] Final Memory: 11M/371M [INFO] ------------------------------------------------------------------------ 临时打开test跑一下的mvn命令应该是怎样的呢?
Jenkins打包项目报错,JDK1.8
``` [INFO] BUILD FAILURE [INFO] ------------------------------------------------------------------------ [INFO] Total time: 6.400 s [INFO] Finished at: 2019-12-31T17:08:37+08:00 [INFO] Final Memory: 32M/117M [INFO] ------------------------------------------------------------------------ [ERROR] Failed to execute goal org.apache.maven.plugins:maven-compiler-plugin:3.8.1:compile (default-compile) on project cmdbunion_eureka: Execution default-compile of goal org.apache.maven.plugins:maven-compiler-plugin:3.8.1:compile failed: A required class was missing while executing org.apache.maven.plugins:maven-compiler-plugin:3.8.1:compile: org/codehaus/plexus/compiler/util/scan/InclusionScanException [ERROR] ----------------------------------------------------- [ERROR] realm = plugin>org.apache.maven.plugins:maven-compiler-plugin:3.8.1 [ERROR] strategy = org.codehaus.plexus.classworlds.strategy.SelfFirstStrategy [ERROR] urls[0] = file:/DATA/repo/repository/org/apache/maven/plugins/maven-compiler-plugin/3.8.1/maven-compiler-plugin-3.8.1.jar [ERROR] urls[1] = file:/DATA/repo/repository/org/codehaus/plexus/plexus-utils/1.1/plexus-utils-1.1.jar [JENKINS] Archiving /DATA/var/lib/jenkins/workspace/cmdbunion_parent/cmdbunion_eureka/pom.xml to com.travelsky/cmdbunion_eureka/0.0.1-SNAPSHOT/cmdbunion_eureka-0.0.1-SNAPSHOT.pom [ERROR] Number of foreign imports: 1 [ERROR] import: Entry[import from realm ClassRealm[maven.api, parent: null]] [ERROR] [ERROR] -----------------------------------------------------: org.codehaus.plexus.compiler.util.scan.InclusionScanException [ERROR] -> [Help 1] [ERROR] [ERROR] To see the full stack trace of the errors, re-run Maven with the -e switch. [ERROR] Re-run Maven using the -X switch to enable full debug logging. [JENKINS] Archiving /DATA/var/lib/jenkins/workspace/cmdbunion_parent/cmdbunion_titsm/pom.xml to com.travelsky/cmdbunion_titsm/0.0.1-SNAPSHOT/cmdbunion_titsm-0.0.1-SNAPSHOT.pom [ERROR] [ERROR] For more information about the errors and possible solutions, please read the following articles: [ERROR] [Help 1] http://cwiki.apache.org/confluence/display/MAVEN/PluginContainerException [ERROR] [ERROR] After correcting the problems, you can resume the build with the command [ERROR] mvn <goals> -rf :cmdbunion_eureka ``` ![图片说明](https://img-ask.csdn.net/upload/201912/31/1577783774_342114.png) ![图片说明](https://img-ask.csdn.net/upload/201912/31/1577783814_821416.png)
mvn Compilation failure 错误!初学,请高手多指教
D:\simple-weather>mvn install [INFO] Scanning for projects... [INFO] ------------------------------------------------------------------------ [INFO] Building simple-weather [INFO] task-segment: [install] [INFO] ------------------------------------------------------------------------ [INFO] [resources:resources {execution: default-resources}] [WARNING] Using platform encoding (GBK actually) to copy filtered resources, i.e . build is platform dependent! [INFO] skip non existing resourceDirectory D:\simple-weather\src\main\resources [INFO] [compiler:compile {execution: default-compile}] [INFO] Compiling 5 source files to D:\simple-weather\target\classes [INFO] ------------------------------------------------------------------------ [ERROR] BUILD FAILURE [INFO] ------------------------------------------------------------------------ [INFO] Compilation failure D:\simple-weather\src\main\java\com\fan\weather\YahooParser.java:[36,7] -source 1.3 中不支持泛型 (请使用 -source 5 或更高版本以启用泛型) Map<String,String> uris = new HashMap<String,String>(); [INFO] ------------------------------------------------------------------------ [INFO] For more information, run Maven with the -e switch [INFO] ------------------------------------------------------------------------ [INFO] Total time: 3 seconds [INFO] Finished at: Fri Oct 23 18:32:08 CST 2009 [INFO] Final Memory: 8M/14M [INFO] ------------------------------------------------------------------------
spring-boot 项目打包问题
项目之前打包是通过idea配置进行打包的。 操作步骤: 1. Project Structure => Artifacts => "+" => JAR => Empty 2. 配置好Name 和 Output directory 3. Output Layout => "+" => Module Output => "OK" 4. 点选jar => create manifest => 配置 Main class => "OK" 5. 打包 ===> Build Artifacts 最后会在指令的路径得到jar包。解压后的jar包结构如下: - license.xml - application.yml - application.properties - application-quartz.yml - application-multipart.yml - META-INF - xml - word - templates - template - static - reportTemplate - phantomjs-windows - phantomjs-linux - com 即 配置文件和com同级, 同时是个可执行的jar,并且排除了依赖包。 我希望能通过mvn package 指令进行打包得到相同效果。
动态规划入门到熟悉,看不懂来打我啊
持续更新。。。。。。 2.1斐波那契系列问题 2.2矩阵系列问题 2.3跳跃系列问题 3.1 01背包 3.2 完全背包 3.3多重背包 3.4 一些变形选讲 2.1斐波那契系列问题 在数学上,斐波纳契数列以如下被以递归的方法定义:F(0)=0,F(1)=1, F(n)=F(n-1)+F(n-2)(n&gt;=2,n∈N*)根据定义,前十项为1, 1, 2, 3...
Java学习的正确打开方式
在博主认为,对于入门级学习java的最佳学习方法莫过于视频+博客+书籍+总结,前三者博主将淋漓尽致地挥毫于这篇博客文章中,至于总结在于个人,实际上越到后面你会发现学习的最好方式就是阅读参考官方文档其次就是国内的书籍,博客次之,这又是一个层次了,这里暂时不提后面再谈。博主将为各位入门java保驾护航,各位只管冲鸭!!!上天是公平的,只要不辜负时间,时间自然不会辜负你。 何谓学习?博主所理解的学习,它是一个过程,是一个不断累积、不断沉淀、不断总结、善于传达自己的个人见解以及乐于分享的过程。
程序员必须掌握的核心算法有哪些?
由于我之前一直强调数据结构以及算法学习的重要性,所以就有一些读者经常问我,数据结构与算法应该要学习到哪个程度呢?,说实话,这个问题我不知道要怎么回答你,主要取决于你想学习到哪些程度,不过针对这个问题,我稍微总结一下我学过的算法知识点,以及我觉得值得学习的算法。这些算法与数据结构的学习大多数是零散的,并没有一本把他们全部覆盖的书籍。下面是我觉得值得学习的一些算法以及数据结构,当然,我也会整理一些看过...
Python——画一棵漂亮的樱花树(不同种樱花+玫瑰+圣诞树喔)
最近翻到一篇知乎,上面有不少用Python(大多是turtle库)绘制的树图,感觉很漂亮,我整理了一下,挑了一些我觉得不错的代码分享给大家(这些我都测试过,确实可以生成) one 樱花树 动态生成樱花 效果图(这个是动态的): 实现代码 import turtle as T import random import time # 画樱花的躯干(60,t) def Tree(branch, ...
大学四年自学走来,这些私藏的实用工具/学习网站我贡献出来了
大学四年,看课本是不可能一直看课本的了,对于学习,特别是自学,善于搜索网上的一些资源来辅助,还是非常有必要的,下面我就把这几年私藏的各种资源,网站贡献出来给你们。主要有:电子书搜索、实用工具、在线视频学习网站、非视频学习网站、软件下载、面试/求职必备网站。 注意:文中提到的所有资源,文末我都给你整理好了,你们只管拿去,如果觉得不错,转发、分享就是最大的支持了。 一、电子书搜索 对于大部分程序员...
shell脚本:备份数据库、代码上线
备份MySQL数据库 场景: 一台MySQL服务器,跑着5个数据库,在没有做主从的情况下,需要对这5个库进行备份 需求: 1)每天备份一次,需要备份所有的库 2)把备份数据存放到/data/backup/下 3)备份文件名称格式示例:dbname-2019-11-23.sql 4)需要对1天以前的所有sql文件压缩,格式为gzip 5)本地数据保留1周 6)需要把备份的数据同步到远程备份中心,假如...
如何安装 IntelliJ IDEA 最新版本——详细教程
IntelliJ IDEA 简称 IDEA,被业界公认为最好的 Java 集成开发工具,尤其在智能代码助手、代码自动提示、代码重构、代码版本管理(Git、SVN、Maven)、单元测试、代码分析等方面有着亮眼的发挥。IDEA 产于捷克,开发人员以严谨著称的东欧程序员为主。IDEA 分为社区版和付费版两个版本。 我呢,一直是 Eclipse 的忠实粉丝,差不多十年的老用户了。很早就接触到了 IDEA...
面试还搞不懂redis,快看看这40道面试题(含答案和思维导图)
Redis 面试题 1、什么是 Redis?. 2、Redis 的数据类型? 3、使用 Redis 有哪些好处? 4、Redis 相比 Memcached 有哪些优势? 5、Memcache 与 Redis 的区别都有哪些? 6、Redis 是单进程单线程的? 7、一个字符串类型的值能存储最大容量是多少? 8、Redis 的持久化机制是什么?各自的优缺点? 9、Redis 常见性...
为什么要推荐大家学习字节码?
配套视频: 为什么推荐大家学习Java字节码 https://www.bilibili.com/video/av77600176/ 一、背景 本文主要探讨:为什么要学习 JVM 字节码? 可能很多人会觉得没必要,因为平时开发用不到,而且不学这个也没耽误学习。 但是这里分享一点感悟,即人总是根据自己已经掌握的知识和技能来解决问题的。 这里有个悖论,有时候你觉得有些技术没用恰恰是...
【设计模式】单例模式的八种写法分析
网上泛滥流传单例模式的写法种类,有说7种的,也有说6种的,当然也不排除说5种的,他们说的有错吗?其实没有对与错,刨根问底,写法终究是写法,其本质精髓大体一致!因此完全没必要去追究写法的多少,有这个时间还不如跟着宜春去网吧偷耳机、去田里抓青蛙得了,一天天的....
《面试宝典》:检验是否为合格的初中级程序员的面试知识点,你都知道了吗?查漏补缺
欢迎关注文章系列,一起学习 《提升能力,涨薪可待篇》 《面试知识,工作可待篇》 《实战演练,拒绝996篇》 也欢迎关注公 众 号【Ccww笔记】,原创技术文章第一时间推出 如果此文对你有帮助、喜欢的话,那就点个赞呗,点个关注呗! 《面试知识,工作可待篇》-Java笔试面试基础知识大全 前言 是不是感觉找工作面试是那么难呢? 在找工作面试应在学习的基础进行总结面试知识点,工作也指日可待,欢...
在阿里,40岁的奋斗姿势
在阿里,40岁的奋斗姿势 在阿里,什么样的年纪可以称为老呢?35岁? 在云网络,有这样一群人,他们的平均年龄接近40,却刚刚开辟职业生涯的第二战场。 他们的奋斗姿势是什么样的呢? 洛神赋 “翩若惊鸿,婉若游龙。荣曜秋菊,华茂春松。髣髴兮若轻云之蔽月,飘飖兮若流风之回雪。远而望之,皎若太阳升朝霞;迫而察之,灼若芙蕖出渌波。” 爱洛神,爱阿里云 2018年,阿里云网络产品部门启动洛神2.0升...
【超详细分析】关于三次握手与四次挥手面试官想考我们什么?
在面试中,三次握手和四次挥手可以说是问的最频繁的一个知识点了,我相信大家也都看过很多关于三次握手与四次挥手的文章,今天的这篇文章,重点是围绕着面试,我们应该掌握哪些比较重要的点,哪些是比较被面试官给问到的,我觉得如果你能把我下面列举的一些点都记住、理解,我想就差不多了。 三次握手 当面试官问你为什么需要有三次握手、三次握手的作用、讲讲三次三次握手的时候,我想很多人会这样回答: 首先很多人会先讲下握...
压测学习总结(1)——高并发性能指标:QPS、TPS、RT、吞吐量详解
一、QPS,每秒查询 QPS:Queries Per Second意思是“每秒查询率”,是一台服务器每秒能够相应的查询次数,是对一个特定的查询服务器在规定时间内所处理流量多少的衡量标准。互联网中,作为域名系统服务器的机器的性能经常用每秒查询率来衡量。 二、TPS,每秒事务 TPS:是TransactionsPerSecond的缩写,也就是事务数/秒。它是软件测试结果的测量单位。一个事务是指一...
新程序员七宗罪
当我发表这篇文章《为什么每个工程师都应该开始考虑开发中的分析和编程技能呢?》时,我从未想到它会对读者产生如此积极的影响。那些想要开始探索编程和数据科学领域的人向我寻求建议;还有一些人问我下一篇文章的发布日期;还有许多人询问如何顺利过渡到这个职业。我非常鼓励大家继续分享我在这个旅程的经验,学习,成功和失败,以帮助尽可能多的人过渡到一个充满无数好处和机会的职业生涯。亲爱的读者,谢谢你。 -罗伯特。 ...
活到老,学到老,程序员也该如此
全文共2763字,预计学习时长8分钟 图片来源:Pixabay 此前,“网传阿里巴巴要求尽快实现P8全员35周岁以内”的消息闹得沸沸扬扬。虽然很快被阿里辟谣,但苍蝇不叮无缝的蛋,无蜜不招彩蝶蜂。消息从何而来?真相究竟怎样?我们无从而知。我们只知道一个事实:不知从何时开始,程序猿也被划在了“吃青春饭”行业之列。 饱受“996ICU”摧残后,好不容易“头秃了变强了”,即将步入为“高...
2019年Spring Boot面试都问了什么?快看看这22道面试题!
Spring Boot 面试题 1、什么是 Spring Boot? 2、Spring Boot 有哪些优点? 3、什么是 JavaConfig? 4、如何重新加载 Spring Boot 上的更改,而无需重新启动服务器? 5、Spring Boot 中的监视器是什么? 6、如何在 Spring Boot 中禁用 Actuator 端点安全性? 7、如何在自定义端口上运行 Sprin...
小白学 Python 爬虫(5):前置准备(四)数据库基础
人生苦短,我用 Python 前文传送门: 小白学 Python 爬虫(1):开篇 小白学 Python 爬虫(2):前置准备(一)基本类库的安装 小白学 Python 爬虫(3):前置准备(二)Linux基础入门 小白学 Python 爬虫(4):前置准备(三)Docker基础入门 本篇文章,我们接着介绍基础内容,数据库。 爬虫将数据爬取完成后,总要有地方存放吧,这个数据存在哪里呢? ...
面试官:关于Java性能优化,你有什么技巧
通过使用一些辅助性工具来找到程序中的瓶颈,然后就可以对瓶颈部分的代码进行优化。 一般有两种方案:即优化代码或更改设计方法。我们一般会选择后者,因为不去调用以下代码要比调用一些优化的代码更能提高程序的性能。而一个设计良好的程序能够精简代码,从而提高性能。 下面将提供一些在JAVA程序的设计和编码中,为了能够提高JAVA程序的性能,而经常采用的一些方法和技巧。 1.对象的生成和大小的调整。 J...
JavaScript 中, 5 种增加代码可读性的最佳实践
作者:Milos Protic 译者:前端小智 来源:blog.risingstack 为了保证的可读性,本文采用意译而非直译。 简介 如果咱们关注代码本身结构及可读笥,而不是只关心它是否能工作,那么咱们写代码是有一定的水准。专业开发人员将为未来的自己和“其他人”编写代码,而不仅仅只编写能应付当前工作的代码。 在此基础上,可读性高的代码可以定义为自解释的、易于人理解的、易于更改...
【图解算法面试】记一次面试:说说游戏中的敏感词过滤是如何实现的?
版权声明:本文为苦逼的码农原创。未经同意禁止任何形式转载,特别是那些复制粘贴到别的平台的,否则,必定追究。欢迎大家多多转发,谢谢。 小秋今天去面试了,面试官问了一个与敏感词过滤算法相关的问题,然而小秋对敏感词过滤算法一点也没听说过。于是,有了下下事情的发生… 面试官开怼 面试官:玩过王者荣耀吧?了解过敏感词过滤吗?,例如在游戏里,如果我们发送“你在干嘛?麻痹演员啊你?”,由于“麻痹”是一个敏感词,...
程序员需要了解的硬核知识之汇编语言(一)
之前的系列文章从 CPU 和内存方面简单介绍了一下汇编语言,但是还没有系统的了解一下汇编语言,汇编语言作为第二代计算机语言,会用一些容易理解和记忆的字母,单词来代替一个特定的指令,作为高级编程语言的基础,有必要系统的了解一下汇编语言,那么本篇文章希望大家跟我一起来了解一下汇编语言。 汇编语言和本地代码 我们在之前的文章中探讨过,计算机 CPU 只能运行本地代码(机器语言)程序,用 C 语言等高级语...
GitHub 标星 1.6w+,我发现了一个宝藏项目,作为编程新手有福了!
大家好,我是 Rocky0429,一个最近老在 GitHub 上闲逛的蒟蒻… 特别惭愧的是,虽然我很早就知道 GitHub,但是学会逛 GitHub 的时间特别晚。当时一方面是因为菜,看着这种全是英文的东西难受,不知道该怎么去玩,另一方面是一直在搞 ACM,没有做一些工程类的项目,所以想当然的以为和 GitHub 也没什么关系(当然这种想法是错误的)。 后来自己花了一个星期看完了 Pyt...
Java知识体系最强总结(2020版)
更新于2019-12-15 10:38:00 本人从事Java开发已多年,平时有记录问题解决方案和总结知识点的习惯,整理了一些有关Java的知识体系,这不是最终版,会不定期的更新。也算是记录自己在从事编程工作的成长足迹,通过博客可以促进博主与阅读者的共同进步,结交更多志同道合的朋友。特此分享给大家,本人见识有限,写的博客难免有错误或者疏忽的地方,还望各位大佬指点,在此表示感激不尽。 文章目录...
计算机专业的书普遍都这么贵,你们都是怎么获取资源的?
介绍几个可以下载编程电子书籍的网站。 1.Github Github上编程书资源很多,你可以根据类型和语言去搜索。推荐几个热门的: free-programming-books-zh_CN:58K 星的GitHub,编程语言、WEB、函数、大数据、操作系统、在线课程、数据库相关书籍应有尽有,共有几百本。 Go语言高级编程:涵盖CGO,Go汇编语言,RPC实现,Protobuf插件实现,Web框架实...
毕业5年,我问遍了身边的大佬,总结了他们的学习方法
我问了身边10个大佬,总结了他们的学习方法,原来成功都是有迹可循的。
这些软件太强了,Windows必装!尤其程序员!
Windows可谓是大多数人的生产力工具,集娱乐办公于一体,虽然在程序员这个群体中都说苹果是信仰,但是大部分不都是从Windows过来的,而且现在依然有很多的程序员用Windows。 所以,今天我就把我私藏的Windows必装的软件分享给大家,如果有一个你没有用过甚至没有听过,那你就赚了????,这可都是提升你幸福感的高效率生产力工具哦! 走起!???? NO、1 ScreenToGif 屏幕,摄像头和白板...
大学四年因为知道了这32个网站,我成了别人眼中的大神!
依稀记得,毕业那天,我们导员发给我毕业证的时候对我说“你可是咱们系的风云人物啊”,哎呀,别提当时多开心啦????,嗯,我们导员是所有导员中最帅的一个,真的???? 不过,导员说的是实话,很多人都叫我大神的,为啥,因为我知道这32个网站啊,你说强不强????,这次是绝对的干货,看好啦,走起来! PS:每个网站都是学计算机混互联网必须知道的,真的牛杯,我就不过多介绍了,大家自行探索,觉得没用的,尽管留言吐槽吧???? 社...
Fiddler+夜神模拟器进行APP抓包
Fiddler+夜神模拟器进行APP抓包 作者:霞落满天 需求:对公司APP进行抓包获取详细的接口信息,这是现在开发必备的。 工具:Fiddler抓包,夜神模拟器 模拟手机 安装APP 1.下载Fiddler https://www.telerik.com/download/fiddler Fiddler正是在这里帮助您记录计算机和Internet之间传递的所有HTTP和HTTPS通信...
相关热词 c#怎么获得线程名 c# usb 采集器 c# csv 读取 c# sort() c# 关闭io流 c# 响应函数 插入 c#面对对象的三大特性 c# 打印 等比缩放 c#弹出右键菜单 c#1如何搞成01
立即提问