在ubuntu下用make安装软件出错

第一次在ubuntu18.04用源代码安装软件,make的时候总是出错,我执行前面的
命令名问题,但是到执行make的时候,总是出错,因为是个小白,所以不知道知道是什么原因.

$] cd sumo-0.32.0

$] ./configure 

$] make 

collect2: error: ld returned 1 exit status
Makefile:461: recipe for target 'marouter' failed
make[3]: *** [marouter] Error 1
make[3]: 离开目录“/home/as/sumo-0.32.0/src/marouter”
Makefile:689: recipe for target 'all-recursive' failed
make[2]: *** [all-recursive] Error 1
make[2]: 离开目录“/home/as/sumo-0.32.0/src”
Makefile:530: recipe for target 'all' failed
make[1]: *** [all] Error 2
make[1]: 离开目录“/home/as/sumo-0.32.0/src”
Makefile:406: recipe for target 'all-recursive' failed
make: *** [all-recursive] Error 1

2个回答

需要先安装对应软件需要的扩展包

sudo apt-get install libnghttp2-dev
sudo apt-get install libxml2-dev

Csdn user default icon
上传中...
上传图片
插入图片
抄袭、复制答案,以达到刷声望分或其他目的的行为,在CSDN问答是严格禁止的,一经发现立刻封号。是时候展现真正的技术了!
立即提问
相关内容推荐