格式化日期在8.0手机报java.lang.AssertionError 5C

格式化日期在8.0手机报java.lang.AssertionError

#648 Thread-20

java.lang.AssertionError

No NameTypeIndex match for SHORT_STANDARD
1 android.icu.impl.TimeZoneNamesImpl$ZNames.getNameTypeIndex(TimeZoneNamesImpl.java:724)
2 android.icu.impl.TimeZoneNamesImpl$ZNames.getName(TimeZoneNamesImpl.java:790)
3 android.icu.impl.TimeZoneNamesImpl.getTimeZoneDisplayName(TimeZoneNamesImpl.java:183)
4 android.icu.text.TimeZoneNames.getDisplayName(TimeZoneNames.java:261)
5 java.text.SimpleDateFormat.subFormat(SimpleDateFormat.java:1296)
6 java.text.SimpleDateFormat.format(SimpleDateFormat.java:1004)
7 java.text.SimpleDateFormat.format(SimpleDateFormat.java:974)
8 java.text.DateFormat.format(DateFormat.java:341)
9 com.platform.APIClient.authenticateRequest(Unknown Source:72)
10 com.platform.APIClient.sendHttpRequest(Unknown Source:115)
11 com.platform.APIClient.sendRequest(Unknown Source:1)
12 com.platform.UserMetricsManager.makeUserMetricsRequest(Unknown Source:101)
13 com.etzwallet.presenter.activities.util.ApplicationLifecycleObserver$1.run(Unknown Source:22)
14 java.util.concurrent.ThreadPoolExecutor.runWorker(ThreadPoolExecutor.java:1162)
15 java.util.concurrent.ThreadPoolExecutor$Worker.run(ThreadPoolExecutor.java:636)
16 com.etzwallet.tools.threads.executor.PriorityThreadFactory$1.run(Unknown Source:11)
17 java.lang.Thread.run(Thread.java:764)1 android.icu.impl.TimeZoneNamesImpl$ZNames.getNameTypeIndex(TimeZoneNamesImpl.java:724)
2 android.icu.impl.TimeZoneNamesImpl$ZNames.getName(TimeZoneNamesImpl.java:790)
3 android.icu.impl.TimeZoneNamesImpl.getTimeZoneDisplayName(TimeZoneNamesImpl.java:183)
4 android.icu.text.TimeZoneNames.getDisplayName(TimeZoneNames.java:261)
5 java.text.SimpleDateFormat.subFormat(SimpleDateFormat.java:1296)
6 java.text.SimpleDateFormat.format(SimpleDateFormat.java:1004)
7 java.text.SimpleDateFormat.format(SimpleDateFormat.java:974)
8 java.text.DateFormat.format(DateFormat.java:341)
9 com.platform.APIClient.authenticateRequest(Unknown Source:72)
10 com.platform.APIClient.sendHttpRequest(Unknown Source:115)
11 com.platform.APIClient.sendRequest(Unknown Source:1)
12 com.platform.UserMetricsManager.makeUserMetricsRequest(Unknown Source:101)
13 com.etzwallet.presenter.activities.util.ApplicationLifecycleObserver$1.run(Unknown Source:22)
14 java.util.concurrent.ThreadPoolExecutor.runWorker(ThreadPoolExecutor.java:1162)
15 java.util.concurrent.ThreadPoolExecutor$Worker.run(ThreadPoolExecutor.java:636)
16 com.etzwallet.tools.threads.executor.PriorityThreadFactory$1.run(Unknown Source:11)
17 java.lang.Thread.run(Thread.java:764)

下面是代码,
private static final SimpleDateFormat DATE_FORMAT = new SimpleDateFormat("EEE, dd MMM yyyy HH:mm:ss z", Locale.US);
DATE_FORMAT.setTimeZone(TimeZone.getTimeZone("GMT"));
String httpDate = DATE_FORMAT.format(new Date());
根据 输出的提示就找到这些代码,并且报错的全部是8.0手机,并不是每台手机都报错,

shuiheliancao
shuiheliancao 解决了吗?我也碰到这个问题了
一年多之前 回复

1个回答

hanzhanfei
hanzhanfei 这篇章发之前我也看了,没有找到解决的办法, 我不知道 minSdkVersion 21 targetSdkVersion 27
一年多之前 回复
Csdn user default icon
上传中...
上传图片
插入图片
抄袭、复制答案,以达到刷声望分或其他目的的行为,在CSDN问答是严格禁止的,一经发现立刻封号。是时候展现真正的技术了!
其他相关推荐
android代码混淆后出现java.lang.AssertionError是怎么回事啊?求解决。

![图片说明](https://img-ask.csdn.net/upload/201606/01/1464751732_527327.png)

java项目进行maven install的时候 报java.lang.AssertionError 异常。急需大佬支援!!!

![图片说明](https://img-ask.csdn.net/upload/202004/20/1587381562_327413.png)![图片说明](https://img-ask.csdn.net/upload/202004/20/1587381588_577872.jpg)

CTS测试报java.lang.SecurityException

java.lang.AssertionError: Failed to successfully run device tests for com.android.cts.net.hostside: Instrumentation run failed due to 'java.lang.SecurityException' at com.android.cts.net.HostsideNetworkTests.runDeviceTests(HostsideNetworkTests.java:87) at com.android.cts.net.HostsideNetworkTests.testVpn(HostsideNetworkTests.java:74) at sun.reflect.NativeMethodAccessorImpl.invoke0(Native Method) at sun.reflect.NativeMethodAccessorImpl.invoke(NativeMethodAccessorImpl.java:57) at sun.reflect.DelegatingMethodAccessorImpl.invoke(DelegatingMethodAccessorImpl.java:43) at java.lang.reflect.Method.invoke(Method.java:606) at junit.framework.TestCase.runTest(TestCase.java:168) at junit.framework.TestCase.runBare(TestCase.java:134) at com.android.tradefed.testtype.DeviceTestResult$1.protect(DeviceTestResult.java:81) at com.android.tradefed.testtype.DeviceTestResult.runProtected(DeviceTestResult.java:56) at com.android.tradefed.testtype.DeviceTestResult.run(DeviceTestResult.java:85) at junit.framework.TestCase.run(TestCase.java:124) at com.android.tradefed.testtype.DeviceTestCase.run(DeviceTestCase.java:117) at com.android.cts.tradefed.testtype.JarHostTest$TestRunnable.run(JarHostTest.java:248) at com.android.tradefed.util.RunUtil$RunnableNotifier.run(RunUtil.java:346) 有谁知道这个要怎么看么? run cts -c com.android.cts.net.HostsideNetworkTests -m testVpn 在测VPN得时候报的错。

JAVA,Mybatis插入报断言错误

FAILED: insertCoinPresentRecord java.lang.AssertionError at com.microsoft.sqlserver.jdbc.SQLServerPreparedStatement.setObject(SQLServerPreparedStatement.java:981) at com.microsoft.sqlserver.jdbc.SQLServerPreparedStatement.setObjectNoType(SQLServerPreparedStatement.java:926) at com.microsoft.sqlserver.jdbc.SQLServerPreparedStatement.setObject(SQLServerPreparedStatement.java:935) at org.apache.commons.dbcp.DelegatingPreparedStatement.setObject(DelegatingPreparedStatement.java:169) at org.apache.commons.dbcp.DelegatingPreparedStatement.setObject(DelegatingPreparedStatement.java:169) at sun.reflect.NativeMethodAccessorImpl.invoke0(Native Method) at sun.reflect.NativeMethodAccessorImpl.invoke(Unknown Source) at sun.reflect.DelegatingMethodAccessorImpl.invoke(Unknown Source) at java.lang.reflect.Method.invoke(Unknown Source) at org.apache.ibatis.logging.jdbc.PreparedStatementLogger.invoke(PreparedStatementLogger.java:70) at com.sun.proxy.$Proxy100.setObject(Unknown Source) at org.apache.ibatis.type.ObjectTypeHandler.setNonNullParameter(ObjectTypeHandler.java:31) at org.apache.ibatis.type.BaseTypeHandler.setParameter(BaseTypeHandler.java:50) at org.apache.ibatis.type.UnknownTypeHandler.setNonNullParameter(UnknownTypeHandler.java:45) at org.apache.ibatis.type.BaseTypeHandler.setParameter(BaseTypeHandler.java:50) at org.apache.ibatis.scripting.defaults.DefaultParameterHandler.setParameters(DefaultParameterHandler.java:81) at org.apache.ibatis.executor.statement.PreparedStatementHandler.parameterize(PreparedStatementHandler.java:80) at org.apache.ibatis.executor.statement.RoutingStatementHandler.parameterize(RoutingStatementHandler.java:61) at sun.reflect.NativeMethodAccessorImpl.invoke0(Native Method) at sun.reflect.NativeMethodAccessorImpl.invoke(Unknown Source) at sun.reflect.DelegatingMethodAccessorImpl.invoke(Unknown Source) at java.lang.reflect.Method.invoke(Unknown Source) at org.apache.ibatis.plugin.Plugin.invoke(Plugin.java:62) at com.sun.proxy.$Proxy98.parameterize(Unknown Source) at org.apache.ibatis.executor.SimpleExecutor.prepareStatement(SimpleExecutor.java:74) at org.apache.ibatis.executor.SimpleExecutor.doUpdate(SimpleExecutor.java:47) at org.apache.ibatis.executor.BaseExecutor.update(BaseExecutor.java:105) at org.apache.ibatis.session.defaults.DefaultSqlSession.update(DefaultSqlSession.java:152) at org.apache.ibatis.session.defaults.DefaultSqlSession.insert(DefaultSqlSession.java:141) at sun.reflect.NativeMethodAccessorImpl.invoke0(Native Method) at sun.reflect.NativeMethodAccessorImpl.invoke(Unknown Source) at sun.reflect.DelegatingMethodAccessorImpl.invoke(Unknown Source) at java.lang.reflect.Method.invoke(Unknown Source) at org.mybatis.spring.SqlSessionTemplate$SqlSessionInterceptor.invoke(SqlSessionTemplate.java:358) at com.sun.proxy.$Proxy22.insert(Unknown Source) at org.mybatis.spring.SqlSessionTemplate.insert(SqlSessionTemplate.java:240) at org.apache.ibatis.binding.MapperMethod.execute(MapperMethod.java:51) at org.apache.ibatis.binding.MapperProxy.invoke(MapperProxy.java:52) at com.sun.proxy.$Proxy97.insertCoinPresentRecord(Unknown Source) at com.seasaw.member.dao.CoinPresentRecordDaoTest.insertCoinPresentRecord(CoinPresentRecordDaoTest.java:52) at sun.reflect.NativeMethodAccessorImpl.invoke0(Native Method) at sun.reflect.NativeMethodAccessorImpl.invoke(Unknown Source) at sun.reflect.DelegatingMethodAccessorImpl.invoke(Unknown Source) at java.lang.reflect.Method.invoke(Unknown Source) at org.testng.internal.MethodInvocationHelper.invokeMethod(MethodInvocationHelper.java:84) at org.testng.internal.MethodInvocationHelper$1.runTestMethod(MethodInvocationHelper.java:200) at org.springframework.test.context.testng.AbstractTestNGSpringContextTests.run(AbstractTestNGSpringContextTests.java:170) at sun.reflect.NativeMethodAccessorImpl.invoke0(Native Method) at sun.reflect.NativeMethodAccessorImpl.invoke(Unknown Source) at sun.reflect.DelegatingMethodAccessorImpl.invoke(Unknown Source) at java.lang.reflect.Method.invoke(Unknown Source) at org.testng.internal.MethodInvocationHelper.invokeHookable(MethodInvocationHelper.java:212) at org.testng.internal.Invoker.invokeMethod(Invoker.java:707) at org.testng.internal.Invoker.invokeTestMethod(Invoker.java:901) at org.testng.internal.Invoker.invokeTestMethods(Invoker.java:1231) at org.testng.internal.TestMethodWorker.invokeTestMethods(TestMethodWorker.java:127) at org.testng.internal.TestMethodWorker.run(TestMethodWorker.java:111) at org.testng.TestRunner.privateRun(TestRunner.java:767) at org.testng.TestRunner.run(TestRunner.java:617) at org.testng.SuiteRunner.runTest(SuiteRunner.java:334) at org.testng.SuiteRunner.runSequentially(SuiteRunner.java:329) at org.testng.SuiteRunner.privateRun(SuiteRunner.java:291) at org.testng.SuiteRunner.run(SuiteRunner.java:240) at org.testng.SuiteRunnerWorker.runSuite(SuiteRunnerWorker.java:52) at org.testng.SuiteRunnerWorker.run(SuiteRunnerWorker.java:86) at org.testng.TestNG.runSuitesSequentially(TestNG.java:1224) at org.testng.TestNG.runSuitesLocally(TestNG.java:1149) at org.testng.TestNG.run(TestNG.java:1057) at org.testng.remote.RemoteTestNG.run(RemoteTestNG.java:111) at org.testng.remote.RemoteTestNG.initAndRun(RemoteTestNG.java:204) at org.testng.remote.RemoteTestNG.main(RemoteTestNG.java:175) 插入语句单元测试的时候报了个这个错误出来,新手不是很理解啊,求助各位大神

junit4测试出错,异常

java.lang.AssertionError: Not yet implemented测试出错,这是什么问题?

Eclipse测试出现failure问题

今天想学习下JDBC,结果run as出现错误,望有大神解决 代码很简单如下: public class jdbc { @Test public void test() { System.out.println("sssadasda"); } } 错误信息: java.lang.AssertionError: Not yet implemented at org.junit.Assert.fail(Assert.java:88) at ainiyongbubian.jdbc.test(jdbc.java:11) at sun.reflect.NativeMethodAccessorImpl.invoke0(Native Method) ······ ![图片说明](https://img-ask.csdn.net/upload/201703/03/1488542365_316634.png)

java编译时发生错误,显示已过时,怎么修改

Information:java: 编译器 (1.8.0_31) 中出现异常错误。 如果在 Bug Parade 中没有找到该错误, 请在 Java Developer Connection (http://java.sun.com/webapps/bugreport) 中建立 Bug。请在报告中附上您的程序和以下诊断信息。谢谢。 Information:java: Errors occurred while compiling module 'framework' Information:javac 1.8.0_31 was used to compile java sources Information:17-6-16 09:59 - Compilation completed with 1 error and 18 warnings in 9s 338ms Error:java: java.lang.AssertionError: isSubClass R E:\JetBrains\framework\src\main\java\com\ng\framework\dao\BaseDao.java Warning:(14, 38) java: com.ng.framework.support.query中的com.ng.framework.support.query.UserDefineContext已过时 E:\JetBrains\framework\src\main\java\com\ng\framework\dao\hb\CriteriaExt.java Warning:(176, 24) java: org.hibernate.Criteria中的createCriteria(java.lang.String,java.lang.String,int,org.hibernate.criterion.Criterion)已过时 Warning:(163, 24) java: org.hibernate.Criteria中的createCriteria(java.lang.String,java.lang.String,int)已过时 Warning:(145, 24) java: org.hibernate.Criteria中的createCriteria(java.lang.String,int)已过时 Warning:(127, 24) java: org.hibernate.Criteria中的createAlias(java.lang.String,java.lang.String,int,org.hibernate.criterion.Criterion)已过时 Warning:(116, 24) java: org.hibernate.Criteria中的createAlias(java.lang.String,java.lang.String,int)已过时 Warning:(128, 15) java: org.hibernate.Criteria中的createAlias(java.lang.String,java.lang.String,int,org.hibernate.criterion.Criterion)已过时 Warning:(146, 15) java: org.hibernate.Criteria中的createCriteria(java.lang.String,int)已过时 Warning:(164, 15) java: org.hibernate.Criteria中的createCriteria(java.lang.String,java.lang.String,int)已过时 Warning:(177, 15) java: org.hibernate.Criteria中的createCriteria(java.lang.String,java.lang.String,int,org.hibernate.criterion.Criterion)已过时 E:\JetBrains\framework\src\main\java\com\ng\framework\dao\OrmProperty.java Warning:(76, 32) java: org.hibernate.metadata.ClassMetadata中的getIdentifier(java.lang.Object)已过时 E:\JetBrains\framework\src\main\java\com\ng\framework\dao\ql\proxy\ProxyFactory.java Warning:(180, 13) java: com.ng.framework.dao.ql.annotation中的com.ng.framework.dao.ql.annotation.Select已过时 Warning:(180, 50) java: com.ng.framework.dao.ql.annotation中的com.ng.framework.dao.ql.annotation.Select已过时 Warning:(201, 13) java: com.ng.framework.dao.ql.annotation中的com.ng.framework.dao.ql.annotation.Update已过时 Warning:(201, 50) java: com.ng.framework.dao.ql.annotation中的com.ng.framework.dao.ql.annotation.Update已过时 E:\JetBrains\framework\src\main\java\com\ng\framework\common\EntityAccessorDelegate.java Warning:(183, 38) java: com.ng.framework.common.EntityAccessor中的queryMapByRequest(com.ng.framework.support.query.QueryRequest)已过时 Warning:(184, 29) java: com.ng.framework.common.EntityAccessor中的queryMapByRequest(com.ng.framework.support.query.QueryRequest)已过时 E:\JetBrains\framework\src\main\java\com\ng\framework\service\BaseService.java Warning:(45, 13) java: com.ng.framework.common.EntityAccessorDelegate中的persist(E)已过时

SpringMVC的mockmvc测试时,运行JUnit时抛出异常

java.lang.NoClassDefFoundError: javax/servlet/SessionCookieConfig at org.springframework.test.context.web.AbstractGenericWebContextLoader.configureWebResources(AbstractGenericWebContextLoader.java:199) at org.springframework.test.context.web.AbstractGenericWebContextLoader.loadContext(AbstractGenericWebContextLoader.java:126) at org.springframework.test.context.web.AbstractGenericWebContextLoader.loadContext(AbstractGenericWebContextLoader.java:59) at org.springframework.test.context.support.AbstractDelegatingSmartContextLoader.delegateLoading(AbstractDelegatingSmartContextLoader.java:108) at org.springframework.test.context.support.AbstractDelegatingSmartContextLoader.loadContext(AbstractDelegatingSmartContextLoader.java:260) at org.springframework.test.context.DefaultCacheAwareContextLoaderDelegate.loadContextInternal(DefaultCacheAwareContextLoaderDelegate.java:63) at org.springframework.test.context.DefaultCacheAwareContextLoaderDelegate.loadContext(DefaultCacheAwareContextLoaderDelegate.java:83) at org.springframework.test.context.DefaultTestContext.getApplicationContext(DefaultTestContext.java:74) at org.springframework.test.context.web.ServletTestExecutionListener.setUpRequestContextIfNecessary(ServletTestExecutionListener.java:169) at org.springframework.test.context.web.ServletTestExecutionListener.prepareTestInstance(ServletTestExecutionListener.java:109) at org.springframework.test.context.TestContextManager.prepareTestInstance(TestContextManager.java:212) at org.springframework.test.context.junit4.SpringJUnit4ClassRunner.createTest(SpringJUnit4ClassRunner.java:199) at org.springframework.test.context.junit4.SpringJUnit4ClassRunner$1.runReflectiveCall(SpringJUnit4ClassRunner.java:251) at org.junit.internal.runners.model.ReflectiveCallable.run(ReflectiveCallable.java:12) at org.springframework.test.context.junit4.SpringJUnit4ClassRunner.methodBlock(SpringJUnit4ClassRunner.java:253) at org.springframework.test.context.junit4.SpringJUnit4ClassRunner.runChild(SpringJUnit4ClassRunner.java:216) at org.springframework.test.context.junit4.SpringJUnit4ClassRunner.runChild(SpringJUnit4ClassRunner.java:82) at org.junit.runners.ParentRunner$3.run(ParentRunner.java:238) at org.junit.runners.ParentRunner$1.schedule(ParentRunner.java:63) at org.junit.runners.ParentRunner.runChildren(ParentRunner.java:236) at org.junit.runners.ParentRunner.access$000(ParentRunner.java:53) at org.junit.runners.ParentRunner$2.evaluate(ParentRunner.java:229) at org.springframework.test.context.junit4.statements.RunBeforeTestClassCallbacks.evaluate(RunBeforeTestClassCallbacks.java:60) at org.springframework.test.context.junit4.statements.RunAfterTestClassCallbacks.evaluate(RunAfterTestClassCallbacks.java:67) at org.junit.runners.ParentRunner.run(ParentRunner.java:309) at org.springframework.test.context.junit4.SpringJUnit4ClassRunner.run(SpringJUnit4ClassRunner.java:162) at org.eclipse.jdt.internal.junit4.runner.JUnit4TestReference.run(JUnit4TestReference.java:50) at org.eclipse.jdt.internal.junit.runner.TestExecution.run(TestExecution.java:38) at org.eclipse.jdt.internal.junit.runner.RemoteTestRunner.runTests(RemoteTestRunner.java:459) at org.eclipse.jdt.internal.junit.runner.RemoteTestRunner.runTests(RemoteTestRunner.java:675) at org.eclipse.jdt.internal.junit.runner.RemoteTestRunner.run(RemoteTestRunner.java:382) at org.eclipse.jdt.internal.junit.runner.RemoteTestRunner.main(RemoteTestRunner.java:192) Caused by: java.lang.ClassNotFoundException: javax.servlet.SessionCookieConfig at java.net.URLClassLoader$1.run(Unknown Source) at java.security.AccessController.doPrivileged(Native Method) at java.net.URLClassLoader.findClass(Unknown Source) at java.lang.ClassLoader.loadClass(Unknown Source) at sun.misc.Launcher$AppClassLoader.loadClass(Unknown Source) at java.lang.ClassLoader.loadClass(Unknown Source) ... 32 more

java格式化问题

代码是这个样子的: [code="java"] String[] formats = { "%1$-9d", "%1$#5X", "%1$+9d", "%1$09d", "%1$,9d", "%1$(9d" }; //java中没有foreach关键字,但可以用for (type varname : iterable)实现foreach for(String format : formats) { int num = -9999999; String formated = String.format(format,num); System.out.println(formated); String output = String.format("String.format(\"%1s\",%2$d) == \"%3s\"", format, num, formated ) ; System.out.println(output); } [/code] 输出如下: -9999999 String.format("%1$-9d",-9999999) == "-9999999" 0XFF676981 String.format("%1$#5X",-9999999) == "-9999999" -9999999 String.format("%1$+9d",-9999999) == "-9999999" -09999999 String.format("%1$09d",-9999999) == "-9999999" -9,999,999 String.format("%1$,9d",-9999999) == "-9999999" (9999999) String.format("%1$(9d",-9999999) == "-9999999" 可以看到formated是正确格式化的结果,而最后的完整输出中==后面的字符串是错误的,为什么?谢谢

idea编译报错Error:java: at com.sun.tools.javac.util.Assert.error(Assert.java:133)

![图片说明](https://img-ask.csdn.net/upload/202003/16/1584361166_907993.png) ![图片说明](https://img-ask.csdn.net/upload/202003/16/1584361180_856407.png)

求助!Maven创建不了工程,出现一下问题,重装Maven也不行

![图片说明](https://img-ask.csdn.net/upload/202001/18/1579282931_331811.png)

gradle构建不成功 控制台输出如下

# gradle构建不成功 控制台输出见下 > Task :ms-contract:assemble UP-TO-DATE > Task :ms-contract:compileTestJava UP-TO-DATE > Task :ms-contract:processTestResources NO-SOURCE > Task :ms-contract:testClasses UP-TO-DATE > Task :ms-contract:test com.yunlu.contract.service.ContractServiceImplTest > testSaveSalesTeam FAILED java.lang.Exception at ContractServiceImplTest.java:56 com.yunlu.contract.service.ContractTerminateServiceImplTest > testModifyContractStatus FAILED java.lang.AssertionError at ContractTerminateServiceImplTest.java:54 com.yunlu.contract.service.ContractTerminateServiceImplTest > testTerminateAdd FAILED java.lang.AssertionError at ContractTerminateServiceImplTest.java:41 16 tests completed, 3 failed > Task :ms-contract:test FAILED FAILURE: Build failed with an exception. * What went wrong: Execution failed for task ':ms-contract:test'. > There were failing tests. See the report at: file:///data/project/ms-contract/build/reports/tests/test/index.html * Try: Run with --stacktrace option to get the stack trace. Run with --info or --debug option to get more log output. Run with --scan to get full insights. * Get more help at https://help.gradle.org Deprecated Gradle features were used in this build, making it incompatible with Gradle 5.0. Use '--warning-mode all' to show the individual deprecation warnings. See https://docs.gradle.org/4.10.2/userguide/command_line_interface.html#sec:command_line_warnings BUILD FAILED in 2m 16s 查看报告只有一个这东西 java.lang.Exception: Duplicate confirmation of competition information. 不知道什么原因,求助!!!

junit启动报错--初始化error

``` ``` ``` java.lang.Exception: No tests found matching [{ExactMatcher:fDisplayName=initialize], {ExactMatcher:fDisplayName=initialize(com.test.ProcessCoreServiceImpl)], {LeadingIdentifierMatcher:fClassName=com.test.ProcessCoreServiceImpl,fLeadingIdentifier=initialize]] from org.junit.internal.requests.ClassRequest@4e22b7dc at org.junit.internal.requests.FilterRequest.getRunner(FilterRequest.java:40) at org.eclipse.jdt.internal.junit4.runner.JUnit4TestLoader.createFilteredTest(JUnit4TestLoader.java:77) at org.eclipse.jdt.internal.junit4.runner.JUnit4TestLoader.createTest(JUnit4TestLoader.java:68) at org.eclipse.jdt.internal.junit4.runner.JUnit4TestLoader.loadTests(JUnit4TestLoader.java:43) at org.eclipse.jdt.internal.junit.runner.RemoteTestRunner.runTests(RemoteTestRunner.java:444) at org.eclipse.jdt.internal.junit.runner.RemoteTestRunner.runTests(RemoteTestRunner.java:675) at org.eclipse.jdt.internal.junit.runner.RemoteTestRunner.run(RemoteTestRunner.java:382) at org.eclipse.jd ``` t.internal.junit.runner.RemoteTestRunner.main(RemoteTestRunner.java:192) ``` ``` ![我的类](https://img-ask.csdn.net/upload/201707/11/1499742031_931047.png) 在例子中导入了junit变量。别的类里面的test标签启动好好的,包名也没有倒错。这真是诡异!!!

Sending proposal to peer1.org1.example.com failed

原来用的nodejs的sdk,现在要换成java的sdk,底层docker容器也都启动成功了 ![docker](https://img-ask.csdn.net/upload/201809/30/1538267524_410437.png) 但在IDEA中运行End2endIT例子的时候报了 Sending instantiateProposalRequest to all peers with arguments: a and b set to 100 and 200 respectively 2018-09-30 00:30:16,755 main ERROR Channel:2768 - Sending proposal to peer1.org1.example.com failed because of: gRPC failure=Status{code=UNAVAILABLE, description=Network closed for unknown reason, cause=null} java.lang.Exception: io.grpc.StatusRuntimeException: UNAVAILABLE: Network closed for unknown reason at org.hyperledger.fabric.sdk.Channel.sendProposalToPeers(Channel.java:2768) at org.hyperledger.fabric.sdk.Channel.sendInstantiationProposal(Channel.java:1540) at org.hyperledger.fabric.sdkintegration.End2endIT.runChannel(End2endIT.java:492) at org.hyperledger.fabric.sdkintegration.End2endIT.runFabricTest(End2endIT.java:208) at org.hyperledger.fabric.sdkintegration.End2endIT.setup(End2endIT.java:189) at sun.reflect.NativeMethodAccessorImpl.invoke0(Native Method) at sun.reflect.NativeMethodAccessorImpl.invoke(NativeMethodAccessorImpl.java:62) at sun.reflect.DelegatingMethodAccessorImpl.invoke(DelegatingMethodAccessorImpl.java:43) at java.lang.reflect.Method.invoke(Method.java:498) at org.junit.runners.model.FrameworkMethod$1.runReflectiveCall(FrameworkMethod.java:50) at org.junit.internal.runners.model.ReflectiveCallable.run(ReflectiveCallable.java:12) at org.junit.runners.model.FrameworkMethod.invokeExplosively(FrameworkMethod.java:47) at org.junit.internal.runners.statements.InvokeMethod.evaluate(InvokeMethod.java:17) at org.junit.internal.runners.statements.RunBefores.evaluate(RunBefores.java:26) at org.junit.runners.ParentRunner.runLeaf(ParentRunner.java:325) at org.junit.runners.BlockJUnit4ClassRunner.runChild(BlockJUnit4ClassRunner.java:78) at org.junit.runners.BlockJUnit4ClassRunner.runChild(BlockJUnit4ClassRunner.java:57) at org.junit.runners.ParentRunner$3.run(ParentRunner.java:290) at org.junit.runners.ParentRunner$1.schedule(ParentRunner.java:71) at org.junit.runners.ParentRunner.runChildren(ParentRunner.java:288) at org.junit.runners.ParentRunner.access$000(ParentRunner.java:58) at org.junit.runners.ParentRunner$2.evaluate(ParentRunner.java:268) at org.junit.runners.ParentRunner.run(ParentRunner.java:363) at org.junit.runner.JUnitCore.run(JUnitCore.java:137) at com.intellij.junit4.JUnit4IdeaTestRunner.startRunnerWithArgs(JUnit4IdeaTestRunner.java:68) at com.intellij.rt.execution.junit.IdeaTestRunner$Repeater.startRunnerWithArgs(IdeaTestRunner.java:47) at com.intellij.rt.execution.junit.JUnitStarter.prepareStreamsAndStart(JUnitStarter.java:242) at com.intellij.rt.execution.junit.JUnitStarter.main(JUnitStarter.java:70) Caused by: io.grpc.StatusRuntimeException: UNAVAILABLE: Network closed for unknown reason at io.grpc.Status.asRuntimeException(Status.java:526) at io.grpc.stub.ClientCalls$UnaryStreamToFuture.onClose(ClientCalls.java:467) at io.grpc.PartialForwardingClientCallListener.onClose(PartialForwardingClientCallListener.java:37) at io.grpc.ForwardingClientCallListener.onClose(ForwardingClientCallListener.java:23) at io.grpc.ForwardingClientCallListener$SimpleForwardingClientCallListener.onClose(ForwardingClientCallListener.java:40) at io.grpc.internal.CensusStatsModule$StatsClientInterceptor$1$1.onClose(CensusStatsModule.java:684) at io.grpc.PartialForwardingClientCallListener.onClose(PartialForwardingClientCallListener.java:37) at io.grpc.ForwardingClientCallListener.onClose(ForwardingClientCallListener.java:23) at io.grpc.ForwardingClientCallListener$SimpleForwardingClientCallListener.onClose(ForwardingClientCallListener.java:40) at io.grpc.internal.CensusTracingModule$TracingClientInterceptor$1$1.onClose(CensusTracingModule.java:391) at io.grpc.internal.ClientCallImpl.closeObserver(ClientCallImpl.java:471) at io.grpc.internal.ClientCallImpl.access$300(ClientCallImpl.java:63) at io.grpc.internal.ClientCallImpl$ClientStreamListenerImpl.close(ClientCallImpl.java:553) at io.grpc.internal.ClientCallImpl$ClientStreamListenerImpl.access$600(ClientCallImpl.java:474) at io.grpc.internal.ClientCallImpl$ClientStreamListenerImpl$1StreamClosed.runInContext(ClientCallImpl.java:591) at io.grpc.internal.ContextRunnable.run(ContextRunnable.java:37) at io.grpc.internal.SerializingExecutor.run(SerializingExecutor.java:123) at java.util.concurrent.ThreadPoolExecutor.runWorker(ThreadPoolExecutor.java:1142) at java.util.concurrent.ThreadPoolExecutor$Worker.run(ThreadPoolExecutor.java:617) at java.lang.Thread.run(Thread.java:748) 2018-09-30 00:30:16,758 main ERROR Channel:2768 - Sending proposal to peer0.org1.example.com failed because of: gRPC failure=Status{code=UNAVAILABLE, description=Network closed for unknown reason, cause=null} java.lang.Exception: io.grpc.StatusRuntimeException: UNAVAILABLE: Network closed for unknown reason at org.hyperledger.fabric.sdk.Channel.sendProposalToPeers(Channel.java:2768) at org.hyperledger.fabric.sdk.Channel.sendInstantiationProposal(Channel.java:1540) at org.hyperledger.fabric.sdkintegration.End2endIT.runChannel(End2endIT.java:492) at org.hyperledger.fabric.sdkintegration.End2endIT.runFabricTest(End2endIT.java:208) at org.hyperledger.fabric.sdkintegration.End2endIT.setup(End2endIT.java:189) at sun.reflect.NativeMethodAccessorImpl.invoke0(Native Method) at sun.reflect.NativeMethodAccessorImpl.invoke(NativeMethodAccessorImpl.java:62) at sun.reflect.DelegatingMethodAccessorImpl.invoke(DelegatingMethodAccessorImpl.java:43) at java.lang.reflect.Method.invoke(Method.java:498) at org.junit.runners.model.FrameworkMethod$1.runReflectiveCall(FrameworkMethod.java:50) at org.junit.internal.runners.model.ReflectiveCallable.run(ReflectiveCallable.java:12) at org.junit.runners.model.FrameworkMethod.invokeExplosively(FrameworkMethod.java:47) at org.junit.internal.runners.statements.InvokeMethod.evaluate(InvokeMethod.java:17) at org.junit.internal.runners.statements.RunBefores.evaluate(RunBefores.java:26) at org.junit.runners.ParentRunner.runLeaf(ParentRunner.java:325) at org.junit.runners.BlockJUnit4ClassRunner.runChild(BlockJUnit4ClassRunner.java:78) at org.junit.runners.BlockJUnit4ClassRunner.runChild(BlockJUnit4ClassRunner.java:57) at org.junit.runners.ParentRunner$3.run(ParentRunner.java:290) at org.junit.runners.ParentRunner$1.schedule(ParentRunner.java:71) at org.junit.runners.ParentRunner.runChildren(ParentRunner.java:288) at org.junit.runners.ParentRunner.access$000(ParentRunner.java:58) at org.junit.runners.ParentRunner$2.evaluate(ParentRunner.java:268) at org.junit.runners.ParentRunner.run(ParentRunner.java:363) at org.junit.runner.JUnitCore.run(JUnitCore.java:137) at com.intellij.junit4.JUnit4IdeaTestRunner.startRunnerWithArgs(JUnit4IdeaTestRunner.java:68) at com.intellij.rt.execution.junit.IdeaTestRunner$Repeater.startRunnerWithArgs(IdeaTestRunner.java:47) at com.intellij.rt.execution.junit.JUnitStarter.prepareStreamsAndStart(JUnitStarter.java:242) at com.intellij.rt.execution.junit.JUnitStarter.main(JUnitStarter.java:70) Caused by: io.grpc.StatusRuntimeException: UNAVAILABLE: Network closed for unknown reason at io.grpc.Status.asRuntimeException(Status.java:526) at io.grpc.stub.ClientCalls$UnaryStreamToFuture.onClose(ClientCalls.java:467) at io.grpc.PartialForwardingClientCallListener.onClose(PartialForwardingClientCallListener.java:37) at io.grpc.ForwardingClientCallListener.onClose(ForwardingClientCallListener.java:23) at io.grpc.ForwardingClientCallListener$SimpleForwardingClientCallListener.onClose(ForwardingClientCallListener.java:40) at io.grpc.internal.CensusStatsModule$StatsClientInterceptor$1$1.onClose(CensusStatsModule.java:684) at io.grpc.PartialForwardingClientCallListener.onClose(PartialForwardingClientCallListener.java:37) at io.grpc.ForwardingClientCallListener.onClose(ForwardingClientCallListener.java:23) at io.grpc.ForwardingClientCallListener$SimpleForwardingClientCallListener.onClose(ForwardingClientCallListener.java:40) at io.grpc.internal.CensusTracingModule$TracingClientInterceptor$1$1.onClose(CensusTracingModule.java:391) at io.grpc.internal.ClientCallImpl.closeObserver(ClientCallImpl.java:471) at io.grpc.internal.ClientCallImpl.access$300(ClientCallImpl.java:63) at io.grpc.internal.ClientCallImpl$ClientStreamListenerImpl.close(ClientCallImpl.java:553) at io.grpc.internal.ClientCallImpl$ClientStreamListenerImpl.access$600(ClientCallImpl.java:474) at io.grpc.internal.ClientCallImpl$ClientStreamListenerImpl$1StreamClosed.runInContext(ClientCallImpl.java:591) at io.grpc.internal.ContextRunnable.run(ContextRunnable.java:37) at io.grpc.internal.SerializingExecutor.run(SerializingExecutor.java:123) at java.util.concurrent.ThreadPoolExecutor.runWorker(ThreadPoolExecutor.java:1142) at java.util.concurrent.ThreadPoolExecutor$Worker.run(ThreadPoolExecutor.java:617) at java.lang.Thread.run(Thread.java:748) Received 2 instantiate proposal responses. Successful+verified: 0 . Failed: 2 Not enough endorsers for instantiate :0endorser failed with Sending proposal to peer1.org1.example.com failed because of: gRPC failure=Status{code=UNAVAILABLE, description=Network closed for unknown reason, cause=null}, on peerPeer peer1.org1.example.com url: grpc://47.104.249.104:7056 Not enough endorsers for instantiate :0endorser failed with Sending proposal to peer0.org1.example.com failed because of: gRPC failure=Status{code=UNAVAILABLE, description=Network closed for unknown reason, cause=null}, on peerPeer peer0.org1.example.com url: grpc://47.104.249.104:7051 java.lang.AssertionError: Not enough endorsers for instantiate :0endorser failed with Sending proposal to peer1.org1.example.com failed because of: gRPC failure=Status{code=UNAVAILABLE, description=Network closed for unknown reason, cause=null}. Was verified:false at org.junit.Assert.fail(Assert.java:88) at org.hyperledger.fabric.sdkintegration.End2endIT.runChannel(End2endIT.java:512) at org.hyperledger.fabric.sdkintegration.End2endIT.runFabricTest(End2endIT.java:208) at org.hyperledger.fabric.sdkintegration.End2endIT.setup(End2endIT.java:189) at sun.reflect.NativeMethodAccessorImpl.invoke0(Native Method) at sun.reflect.NativeMethodAccessorImpl.invoke(NativeMethodAccessorImpl.java:62) at sun.reflect.DelegatingMethodAccessorImpl.invoke(DelegatingMethodAccessorImpl.java:43) at java.lang.reflect.Method.invoke(Method.java:498) at org.junit.runners.model.FrameworkMethod$1.runReflectiveCall(FrameworkMethod.java:50) at org.junit.internal.runners.model.ReflectiveCallable.run(ReflectiveCallable.java:12) at org.junit.runners.model.FrameworkMethod.invokeExplosively(FrameworkMethod.java:47) at org.junit.internal.runners.statements.InvokeMethod.evaluate(InvokeMethod.java:17) at org.junit.internal.runners.statements.RunBefores.evaluate(RunBefores.java:26) at org.junit.runners.ParentRunner.runLeaf(ParentRunner.java:325) at org.junit.runners.BlockJUnit4ClassRunner.runChild(BlockJUnit4ClassRunner.java:78) at org.junit.runners.BlockJUnit4ClassRunner.runChild(BlockJUnit4ClassRunner.java:57) at org.junit.runners.ParentRunner$3.run(ParentRunner.java:290) at org.junit.runners.ParentRunner$1.schedule(ParentRunner.java:71) at org.junit.runners.ParentRunner.runChildren(ParentRunner.java:288) at org.junit.runners.ParentRunner.access$000(ParentRunner.java:58) at org.junit.runners.ParentRunner$2.evaluate(ParentRunner.java:268) at org.junit.runners.ParentRunner.run(ParentRunner.java:363) at org.junit.runner.JUnitCore.run(JUnitCore.java:137) at com.intellij.junit4.JUnit4IdeaTestRunner.startRunnerWithArgs(JUnit4IdeaTestRunner.java:68) at com.intellij.rt.execution.junit.IdeaTestRunner$Repeater.startRunnerWithArgs(IdeaTestRunner.java:47) at com.intellij.rt.execution.junit.JUnitStarter.prepareStreamsAndStart(JUnitStarter.java:242) at com.intellij.rt.execution.junit.JUnitStarter.main(JUnitStarter.java:70) 查了半天也没弄清啥原因,望各位大佬不吝赐教!!!

为什么对于密码来说 char []比 String 更受欢迎?

<div class="post-text" itemprop="text"> <p>In Swing, the password field has a <code>getPassword()</code> (returns <code>char[]</code>) method instead of the usual <code>getText()</code> (returns <code>String</code>) method. Similarly, I have come across a suggestion not to use <code>String</code> to handle passwords.</p> <p>Why does <code>String</code> pose a threat to security when it comes to passwords? It feels inconvenient to use <code>char[]</code>.</p> </div> <p>转载于:https://stackoverflow.com/questions/8881291/why-is-char-preferred-over-string-for-passwords</p>

无法解析导入 com.mysql.jdbc.ResultSet

![图片说明](https://img-ask.csdn.net/upload/201504/08/1428460673_168968.jpg)![图片说明](https://img-ask.csdn.net/upload/201504/08/1428460617_768663.jpg)![图片说明](https://img-ask.csdn.net/upload/201504/08/1428460697_532667.jpg) 新手调试一个网站后台登录程序,可是出现如图1的问题,请各位大神指导下,我已经加载了jre的包额

深夜学习maven,helloworld就卡住了哈哈,求解答junit测试类为何测试失败

package com.lesson.maven.model; public class HelloWorld{ public String sayHello(){ return "Hello World!"; } } ``` package com.lesson.maven.model; import org.junit.*; import org.junit.Assert.*; public class HelloWorldTest{ @Test public void testHello(){ Assert.assertEquals("Hello World!",new HelloWorld.sayHello()); } } ``` <?xml version="1.0" encoding="UTF-8"?> <project xmlns="http://maven.apache.org/POM/4.0.0" xmlns:xsi="http://www.w3.org/2001/XMLSchema-instance" xsi:schemaLocation="http://maven.apache.org/POM/4.0.0 http://maven.apache.org/maven-v4_0_0.xsd"> <modelVersion>4.0.0</modelVersion> <groupId>com.lesson.maven</groupId> <artifactId>maven-model</artifactId> <version>0.0.1SNAPSHOT</version> <dependencies> <dependency> <groupId>junit</groupId> <artifactId>junit</artifactId> <version>4.10</version> </dependency> </dependencies> </project> 运行成功截图: ![图片说明](https://img-ask.csdn.net/upload/201912/01/1575211588_499837.png) 测试失败截图: ![图片说明](https://img-ask.csdn.net/upload/201912/01/1575211610_879507.png) 求解惑,不胜感激!

无法在线程中创建未调用 Looper.prepare 的处理程序()

<div class="post-text" itemprop="text"> <p>What does the following exception mean; how can I fix it?</p> <p>This is the code:</p> <pre><code>Toast toast = Toast.makeText(mContext, "Something", Toast.LENGTH_SHORT); </code></pre> <p>This is the exception:</p> <pre class="lang-none prettyprint-override"><code>java.lang.RuntimeException: Can't create handler inside thread that has not called Looper.prepare() at android.os.Handler.&lt;init&gt;(Handler.java:121) at android.widget.Toast.&lt;init&gt;(Toast.java:68) at android.widget.Toast.makeText(Toast.java:231) </code></pre> </div> <p>转载于:https://stackoverflow.com/questions/3875184/cant-create-handler-inside-thread-that-has-not-called-looper-prepare</p>

python下pip安装总是报 AssertionError

PS C:\WINDOWS\system32> pip install sys Collecting sys Using cached sys-0.9.tar.gz Complete output from command python setup.py egg_info: Traceback (most recent call last): File "<string>", line 1, in <module> File "c:\users\ynf19\appdata\local\temp\pip-build-9qorpr\sys\setup.py", line 1, in <module> raise AssertionError("This package must not be installed from pypi") AssertionError: This package must not be installed from pypi ![图片说明](https://img-ask.csdn.net/upload/201612/28/1482937136_286505.png)

2019 AI开发者大会

2019 AI开发者大会(AI ProCon 2019)是由中国IT社区CSDN主办的AI技术与产业年度盛会。多年经验淬炼,如今蓄势待发:2019年9月6-7日,大会将有近百位中美顶尖AI专家、知名企业代表以及千余名AI开发者齐聚北京,进行技术解读和产业论证。我们不空谈口号,只谈技术,诚挚邀请AI业内人士一起共铸人工智能新篇章!

实现简单的文件系统

实验内容: 通过对具体的文件存储空间的管理、文件的物理结构、目录结构和文件操作的实现,加深对文件系统内部功能和实现过程的理解。 要求: 1.在内存中开辟一个虚拟磁盘空间作为文件存储器,在其上实现一个简

MIPS单周期CPU-组成原理实验-华中科技大学

使用logisim布线完成的MIPS单周期CPU,可支持28条指令。跑马灯的代码已经装入了寄存器,可以直接开启时钟运行。

2019数学建模A题高压油管的压力控制 省一论文即代码

2019数学建模A题高压油管的压力控制省一完整论文即详细C++和Matlab代码,希望对同学们有所帮助

基于QT和OpenCV的五子棋实现源码

一个简单的五子棋应用,基于QT和OpenCV的实现源码,通过相邻棋子判断是否获胜,不包含人工智能算法,适合新手入门

Git 实用技巧

这几年越来越多的开发团队使用了Git,掌握Git的使用已经越来越重要,已经是一个开发者必备的一项技能;但很多人在刚开始学习Git的时候会遇到很多疑问,比如之前使用过SVN的开发者想不通Git提交代码为什么需要先commit然后再去push,而不是一条命令一次性搞定; 更多的开发者对Git已经入门,不过在遇到一些代码冲突、需要恢复Git代码时候就不知所措,这个时候哪些对 Git掌握得比较好的少数人,就像团队中的神一样,在队友遇到 Git 相关的问题的时候用各种流利的操作来帮助队友于水火。 我去年刚加入新团队,发现一些同事对Git的常规操作没太大问题,但对Git的理解还是比较生疏,比如说分支和分支之间的关联关系、合并代码时候的冲突解决、提交代码前未拉取新代码导致冲突问题的处理等,我在协助处理这些问题的时候也记录各种问题的解决办法,希望整理后通过教程帮助到更多对Git操作进阶的开发者。 本期教程学习方法分为“掌握基础——稳步进阶——熟悉协作”三个层次。从掌握基础的 Git的推送和拉取开始,以案例进行演示,分析每一个步骤的操作方式和原理,从理解Git 工具的操作到学会代码存储结构、演示不同场景下Git遇到问题的不同处理方案。循序渐进让同学们掌握Git工具在团队协作中的整体协作流程。 在教程中会通过大量案例进行分析,案例会模拟在工作中遇到的问题,从最基础的代码提交和拉取、代码冲突解决、代码仓库的数据维护、Git服务端搭建等。为了让同学们容易理解,对Git简单易懂,文章中详细记录了详细的操作步骤,提供大量演示截图和解析。在教程的最后部分,会从提升团队整体效率的角度对Git工具进行讲解,包括规范操作、Gitlab的搭建、钩子事件的应用等。 为了让同学们可以利用碎片化时间来灵活学习,在教程文章中大程度降低了上下文的依赖,让大家可以在工作之余进行学习与实战,并同时掌握里面涉及的Git不常见操作的相关知识,理解Git工具在工作遇到的问题解决思路和方法,相信一定会对大家的前端技能进阶大有帮助。

实用主义学Python(小白也容易上手的Python实用案例)

原价169,限时立减100元! 系统掌握Python核心语法16点,轻松应对工作中80%以上的Python使用场景! 69元=72讲+源码+社群答疑+讲师社群分享会&nbsp; 【哪些人适合学习这门课程?】 1)大学生,平时只学习了Python理论,并未接触Python实战问题; 2)对Python实用技能掌握薄弱的人,自动化、爬虫、数据分析能让你快速提高工作效率; 3)想学习新技术,如:人工智能、机器学习、深度学习等,这门课程是你的必修课程; 4)想修炼更好的编程内功,优秀的工程师肯定不能只会一门语言,Python语言功能强大、使用高效、简单易学。 【超实用技能】 从零开始 自动生成工作周报 职场升级 豆瓣电影数据爬取 实用案例 奥运冠军数据分析 自动化办公:通过Python自动化分析Excel数据并自动操作Word文档,最终获得一份基于Excel表格的数据分析报告。 豆瓣电影爬虫:通过Python自动爬取豆瓣电影信息并将电影图片保存到本地。 奥运会数据分析实战 简介:通过Python分析120年间奥运会的数据,从不同角度入手分析,从而得出一些有趣的结论。 【超人气老师】 二两 中国人工智能协会高级会员 生成对抗神经网络研究者 《深入浅出生成对抗网络:原理剖析与TensorFlow实现》一书作者 阿里云大学云学院导师 前大型游戏公司后端工程师 【超丰富实用案例】 0)图片背景去除案例 1)自动生成工作周报案例 2)豆瓣电影数据爬取案例 3)奥运会数据分析案例 4)自动处理邮件案例 5)github信息爬取/更新提醒案例 6)B站百大UP信息爬取与分析案例 7)构建自己的论文网站案例

深度学习原理+项目实战+算法详解+主流框架(套餐)

深度学习系列课程从深度学习基础知识点开始讲解一步步进入神经网络的世界再到卷积和递归神经网络,详解各大经典网络架构。实战部分选择当下最火爆深度学习框架PyTorch与Tensorflow/Keras,全程实战演示框架核心使用与建模方法。项目实战部分选择计算机视觉与自然语言处理领域经典项目,从零开始详解算法原理,debug模式逐行代码解读。适合准备就业和转行的同学们加入学习! 建议按照下列课程顺序来进行学习 (1)掌握深度学习必备经典网络架构 (2)深度框架实战方法 (3)计算机视觉与自然语言处理项目实战。(按照课程排列顺序即可)

C/C++跨平台研发从基础到高阶实战系列套餐

一 专题从基础的C语言核心到c++ 和stl完成基础强化; 二 再到数据结构,设计模式完成专业计算机技能强化; 三 通过跨平台网络编程,linux编程,qt界面编程,mfc编程,windows编程,c++与lua联合编程来完成应用强化 四 最后通过基于ffmpeg的音视频播放器,直播推流,屏幕录像,

三个项目玩转深度学习(附1G源码)

从事大数据与人工智能开发与实践约十年,钱老师亲自见证了大数据行业的发展与人工智能的从冷到热。事实证明,计算机技术的发展,算力突破,海量数据,机器人技术等,开启了第四次工业革命的序章。深度学习图像分类一直是人工智能的经典任务,是智慧零售、安防、无人驾驶等机器视觉应用领域的核心技术之一,掌握图像分类技术是机器视觉学习的重中之重。针对现有线上学习的特点与实际需求,我们开发了人工智能案例实战系列课程。打造:以项目案例实践为驱动的课程学习方式,覆盖了智能零售,智慧交通等常见领域,通过基础学习、项目案例实践、社群答疑,三维立体的方式,打造最好的学习效果。

Java基础知识面试题(2020最新版)

文章目录Java概述何为编程什么是Javajdk1.5之后的三大版本JVM、JRE和JDK的关系什么是跨平台性?原理是什么Java语言有哪些特点什么是字节码?采用字节码的最大好处是什么什么是Java程序的主类?应用程序和小程序的主类有何不同?Java应用程序与小程序之间有那些差别?Java和C++的区别Oracle JDK 和 OpenJDK 的对比基础语法数据类型Java有哪些数据类型switc...

Python界面版学生管理系统

前不久上传了一个控制台版本的学生管理系统,这个是Python界面版学生管理系统,这个是使用pycharm开发的一个有界面的学生管理系统,基本的增删改查,里面又演示视频和完整代码,有需要的伙伴可以自行下

Vue.js 2.0之全家桶系列视频课程

基于新的Vue.js 2.3版本, 目前新全的Vue.js教学视频,让你少走弯路,直达技术前沿! 1. 包含Vue.js全家桶(vue.js、vue-router、axios、vuex、vue-cli、webpack、ElementUI等) 2. 采用笔记+代码案例的形式讲解,通俗易懂

linux“开发工具三剑客”速成攻略

工欲善其事,必先利其器。Vim+Git+Makefile是Linux环境下嵌入式开发常用的工具。本专题主要面向初次接触Linux的新手,熟练掌握工作中常用的工具,在以后的学习和工作中提高效率。

JAVA初级工程师面试36问(完结)

第三十一问: 说一下线程中sleep()和wait()区别? 1 . sleep()是让正在执行的线程主动让出CPU,当时间到了,在回到自己的线程让程序运行。但是它并没有释放同步资源锁只是让出。 2.wait()是让当前线程暂时退让出同步资源锁,让其他线程来获取到这个同步资源在调用notify()方法,才会让其解除wait状态,再次参与抢资源。 3. sleep()方法可以在任何地方使用,而wait()只能在同步方法或同步块使用。 ...

java jdk 8 帮助文档 中文 文档 chm 谷歌翻译

JDK1.8 API 中文谷歌翻译版 java帮助文档 JDK API java 帮助文档 谷歌翻译 JDK1.8 API 中文 谷歌翻译版 java帮助文档 Java最新帮助文档 本帮助文档是使用谷

我以为我对Mysql事务很熟,直到我遇到了阿里面试官

太惨了,面试又被吊打

智鼎(附答案).zip

并不是完整题库,但是有智鼎在线2019年9、10、11三个月的试题,有十七套以上题目,普通的网申行测题足以对付,可以在做题时自己总结一些规律,都不是很难

Visual Assist X 破解补丁

vs a's'sixt插件 支持vs2008-vs2019 亲测可以破解,希望可以帮助到大家

150讲轻松搞定Python网络爬虫

【为什么学爬虫?】 &nbsp; &nbsp; &nbsp; &nbsp;1、爬虫入手容易,但是深入较难,如何写出高效率的爬虫,如何写出灵活性高可扩展的爬虫都是一项技术活。另外在爬虫过程中,经常容易遇到被反爬虫,比如字体反爬、IP识别、验证码等,如何层层攻克难点拿到想要的数据,这门课程,你都能学到! &nbsp; &nbsp; &nbsp; &nbsp;2、如果是作为一个其他行业的开发者,比如app开发,web开发,学习爬虫能让你加强对技术的认知,能够开发出更加安全的软件和网站 【课程设计】 一个完整的爬虫程序,无论大小,总体来说可以分成三个步骤,分别是: 网络请求:模拟浏览器的行为从网上抓取数据。 数据解析:将请求下来的数据进行过滤,提取我们想要的数据。 数据存储:将提取到的数据存储到硬盘或者内存中。比如用mysql数据库或者redis等。 那么本课程也是按照这几个步骤循序渐进的进行讲解,带领学生完整的掌握每个步骤的技术。另外,因为爬虫的多样性,在爬取的过程中可能会发生被反爬、效率低下等。因此我们又增加了两个章节用来提高爬虫程序的灵活性,分别是: 爬虫进阶:包括IP代理,多线程爬虫,图形验证码识别、JS加密解密、动态网页爬虫、字体反爬识别等。 Scrapy和分布式爬虫:Scrapy框架、Scrapy-redis组件、分布式爬虫等。 通过爬虫进阶的知识点我们能应付大量的反爬网站,而Scrapy框架作为一个专业的爬虫框架,使用他可以快速提高我们编写爬虫程序的效率和速度。另外如果一台机器不能满足你的需求,我们可以用分布式爬虫让多台机器帮助你快速爬取数据。 &nbsp; 从基础爬虫到商业化应用爬虫,本套课程满足您的所有需求! 【课程服务】 专属付费社群+每周三讨论会+1v1答疑

JavaWEB商城项目(包括数据库)

功能描述:包括用户的登录注册,以及个人资料的修改.商品的分类展示,详情,加入购物车,生成订单,到银行支付等!另外还有收货地址的和我的收藏等常用操作.环境(JDK 1.7 ,mysql 5.5,Ecli

Python数据挖掘简易入门

&nbsp; &nbsp; &nbsp; &nbsp; 本课程为Python数据挖掘方向的入门课程,课程主要以真实数据为基础,详细介绍数据挖掘入门的流程和使用Python实现pandas与numpy在数据挖掘方向的运用,并深入学习如何运用scikit-learn调用常用的数据挖掘算法解决数据挖掘问题,为进一步深入学习数据挖掘打下扎实的基础。

一学即懂的计算机视觉(第一季)

图像处理和计算机视觉的课程大家已经看过很多,但总有“听不透”,“用不了”的感觉。课程致力于创建人人都能听的懂的计算机视觉,通过生动、细腻的讲解配合实战演练,让学生真正学懂、用会。 【超实用课程内容】 课程内容分为三篇,包括视觉系统构成,图像处理基础,特征提取与描述,运动跟踪,位姿估计,三维重构等内容。课程理论与实战结合,注重教学内容的可视化和工程实践,为人工智能视觉研发及算法工程师等相关高薪职位就业打下坚实基础。 【课程如何观看?】 PC端:https://edu.csdn.net/course/detail/26281 移动端:CSDN 学院APP(注意不是CSDN APP哦) 本课程为录播课,课程2年有效观看时长,但是大家可以抓紧时间学习后一起讨论哦~ 【学员专享增值服务】 源码开放 课件、课程案例代码完全开放给你,你可以根据所学知识,自行修改、优化 下载方式:电脑登录https://edu.csdn.net/course/detail/26281,点击右下方课程资料、代码、课件等打包下载

软件测试2小时入门

本课程内容系统、全面、简洁、通俗易懂,通过2个多小时的介绍,让大家对软件测试有个系统的理解和认识,具备基本的软件测试理论基础。 主要内容分为5个部分: 1 软件测试概述,了解测试是什么、测试的对象、原则、流程、方法、模型;&nbsp; 2.常用的黑盒测试用例设计方法及示例演示;&nbsp; 3 常用白盒测试用例设计方法及示例演示;&nbsp; 4.自动化测试优缺点、使用范围及示例‘;&nbsp; 5.测试经验谈。

初级玩转Linux+Ubuntu(嵌入式开发基础课程)

课程主要面向嵌入式Linux初学者、工程师、学生 主要从一下几方面进行讲解: 1.linux学习路线、基本命令、高级命令 2.shell、vi及vim入门讲解 3.软件安装下载、NFS、Samba、FTP等服务器配置及使用

2019 Python开发者日-培训

本次活动将秉承“只讲技术,拒绝空谈”的理念,邀请十余位身处一线的Python技术专家,重点围绕Web开发、自动化运维、数据分析、人工智能等技术模块,分享真实生产环境中使用Python应对IT挑战的真知灼见。此外,针对不同层次的开发者,大会还安排了深度培训实操环节,为开发者们带来更多深度实战的机会。

快速入门Android开发 视频 教程 android studio

这是一门快速入门Android开发课程,顾名思义是让大家能快速入门Android开发。 学完能让你学会如下知识点: Android的发展历程 搭建Java开发环境 搭建Android开发环境 Android Studio基础使用方法 Android Studio创建项目 项目运行到模拟器 项目运行到真实手机 Android中常用控件 排查开发中的错误 Android中请求网络 常用Android开发命令 快速入门Gradle构建系统 项目实战:看美图 常用Android Studio使用技巧 项目签名打包 如何上架市场

机器学习初学者必会的案例精讲

通过六个实际的编码项目,带领同学入门人工智能。这些项目涉及机器学习(回归,分类,聚类),深度学习(神经网络),底层数学算法,Weka数据挖掘,利用Git开源项目实战等。

4小时玩转微信小程序——基础入门与微信支付实战

这是一个门针对零基础学员学习微信小程序开发的视频教学课程。课程采用腾讯官方文档作为教程的唯一技术资料来源。杜绝网络上质量良莠不齐的资料给学员学习带来的障碍。 视频课程按照开发工具的下载、安装、使用、程序结构、视图层、逻辑层、微信小程序等几个部分组织课程,详细讲解整个小程序的开发过程

相关热词 c# 不能序列化继承类 c# char* 调用 c# 开发dll模板 c#添加控件到工具箱 c#控制台组合数 编程计算猴子吃桃问题c# c# wpf 背景透明 随机抽取号码软件c# c# 开发环境 c# 属性和字段
立即提问