运行批处理文件时遇到“IndentationError: unexpected indent”的错误

用python写的一段代码,从视频里学的,运行了教程里写的代码也是一样的错误,请教大神们是哪里出了问题呢?

python D:/Python/Anacoda/envs/TensorFlow/tensorflow-master/tensorflow/examples/image_retraining/retrain.py ^
--bottleneck_dir bottleneck ^
--how_many_training_steps 200 ^
--model_dir D:/Python/Anacoda/envs/TensorFlow/inception_model ^
--output_graph output_graph.pb ^
--output_labels output_labels.txt ^
--image_dir data/train/
pause

2个回答

后来在做别的代码时发现anaconda自带的spyder里用不了tensorflow,遂重新下载,通过anaconda prompt打开spyder,之后可以运行了。

提示是缩进错误,看下你的代码,特别是你混合使用空格和tab的情况,可能会有缩进不对但是没有发现

weixin_44422262
泗水之弦 我当时百度到这个问题都是说缩进的,但是批处理文件写的时候好像没见到需要什么缩进
6 个月之前 回复
weixin_44422262
泗水之弦 这个是批处理文件,我不太懂里面的格式,但是我直接下载的别人的代码,视频里老师运行都是可以的
6 个月之前 回复
Csdn user default icon
上传中...
上传图片
插入图片
抄袭、复制答案,以达到刷声望分或其他目的的行为,在CSDN问答是严格禁止的,一经发现立刻封号。是时候展现真正的技术了!
其他相关推荐
TensorFlow 运行官方文档中文版 简单例子出现:IndentationError:unexpected indent
例如 >>>  a = tf.constant(10)   File "", line 1     a = tf.constant(10)     ^ IndentationError: unexpected indent 原因: 1.对于此错误,最常见的原因是,的确没有对齐 2. 当前python脚本代码的所有字符都显示出来看看有没有啥特殊的字符。 可以用
Python每日小结(十三)之 unexpected indent
      本文讲一下常见的IndentatinoError: unexpected indent。      在写代码时,尤其是在复制粘贴一段代码时,常常会遇到上面的这种错误,主要原因是原始代码用的缩进方式与我们后面修改时的缩进方式不一致造成的。这个时候一些可以查看缩进方式的编辑器就很有帮助了,比如Sublime Text:      仔细观察上面的图,最后一行前面先有几个小点,然后才是一段一段...
【Python】关于递进错误indentationerror
虽然众所周知,Python里面的条件结构if与循环结构for是没有括号的{},对于是否在结构体的内的语句识别,主要利用句子前的递进关系,判断语句是否在结构体内,如果一旦出现递进不一致的问题,Python就会出现indentationerror的递进报错,这属于非程序范畴的,主要是没有好好排版的问题,但是,一些就算排好版的程序,也会出现这样情况,主要是递进的字符看起来一致,实质不一致,一个Pytho
ajax使用过程中遇到Unexpected token :错误原因
Unexpected token : 有可能是误写成 $.ajax(function(){ }) 应该是$.ajax({ })
运行Java程序时 常遇到的错误
Error 找不到或无法加载主类 xx.class Windows DOS下操作常见错误,用命令操作时无需添加 .class 结尾
运行VS2008时遇到一个错误
估计是装了个什么软件,现在一运行VS2008就提示“无法定位序数442于动态链接库OLEAUT32.dll”错误,然后说找不到组件,让我重新安装此应用程序,之后程序就自动关闭,请问有什么办法可以解决?只能重装?rn
运行Java web时遇到的错误
Several ports (8005, 8080, 8009) required by Tomcat v8.0 Server at localhost are already in use. The server may already be running in another process, or a system process may be using the port. To start this server you will need to stop the other process o
连接mysql时unexpected T_ENCAPSED_AND_WHITESPACE错误
$m_dblink=mysql_connect("xxx","user","passwore",true)or die('Could not connect database in host');rnmysql_select_db("check",$m_dblink) or die('Could not select database');rnmysql_query("SET NAMES UTF8",$m_dblink);rn$query="SELECT a.qa,a.svn_url,a.notifylist,b.tablename,b.file,b.level,b.description FROM result as b,svnurl_check_list AS a WHERE a.line=\"search\" and a.line = b.linern and b.result=\"fail\";rnecho $query,PHP_EOL;rn$result = mysql_query($query,$m_dblink) or die('uery failed:' );rn$count = mysql_num_rows($result);rnfor($index=0; $index < $count; $index++)rn $row = mysql_fetch_array($result, MYSQL_ASSOC);rn //$tablename= $row['tablename'];//这就是出错的那行rn print_r($row);rn //echo " tablename:$tablename";rnrnmysql_free_result($result);rnmysql_close($m_dblink);rnrn报了下面的错误:rnPHP Parse error: syntax error, unexpected T_ENCAPSED_AND_WHITESPACE, expecting T_STRING or T_VARIABLE or T_NUM_STRING in line 36rn但出错的那行是注释掉了的呀rn原因到底在哪里呢
python常见编译错误:IndentationError缩进错误
Python语言是一款对缩进非常敏感的语言,最长见的编译错误莫过于tab和空格的混用,或者缩进不对所产生的错误,这些错误是很难用肉眼来辨别的。     在编译时会出现这样的错误:IndentationError:expected an indented block 说明此处需要缩进,你只要在出现错误的那一行,按空格或Tab(但不能混用)键缩进就行。(如果上一行以“:”结尾,那么下一行需要空格缩进
java开发时遇到的错误
java开发时遇到的错误(汇总,持续更新) 1. 各种莫名其妙的错误,但是 看意思自己确实做了 比如:找不到main方法呀,但是确定已经写了 解决方式 保存一下看看! 2. (不影响运行)XML首行报错: Referenced file contains errors (http://www.springframework.org/schema/beans/spring- beans-4.3.xs...
创建进程时遇到的错误~
一个基于对话框的MFC程序,已经在对话框类里声明了rnDWORD WINAPI ThreadProcEvent(LPVOID pParam);rn在cpp里的创建语句如下:rn[code]rnhThreadEvent = CreateThread(NULL,rn 0,rn (LPTHREAD_START_ROUTINE)ThreadProcEvent,rn &dwParam,rn 0,rn &dwThreadID);rn[/code]rnrn结果报错:error C2440: 'type cast' : cannot convert from '' to 'unsigned long (__stdcall *)(void *)'rn已经包含了process.h。
爬虫时遇到的错误
根据微博关键字爬取微博内容的时候,url需要注意 这样可以 url = &amp;quot;https://m.weibo.cn/api/container/getIndex?containerid=100103type%3D1%26q%3D{}&amp;amp;amp;page_type=searchall&amp;amp;amp;page={}&amp;quot; #keyword是关键字,page是页数 response = requests.get(url...
还原时遇到的错误
还原语句:rnRESTORE DATABASE FSDBNRrnFROM DISK = 'C:\backupdat'rnWITH rnMOVE 'DBBK.DAT' TO 'E:\Program Files\Microsoft Sql Server\MSSQL\DATA\DB.MDF',rnMOVE 'DBBKLOG.DAT' TO 'E:\Program Files\Microsoft Sql Server\MSSQL\DATA\DBLOG.LDF',rnREPLACErnrnrn报错:(从企业管理器里做错误一样,)rnServer: Msg 5149, Level 16, State 1, Line 1rnMODIFY FILE encountered operating system error 112(error not found) while attempting to expand the physical file.rnServer: Msg 3158, Level 16, State 1, Line 1rnCould not create one or more files. Consider using the WITH MOVE option to identify valid locations.rnServer: Msg 3013, Level 16, State 1, Line 1rnRESTORE DATABASE is terminating abnormally.rnrnrn什么原因造成的呢?
unexpected T_STRING 错误
初学php,出现unexpected T_STRING ,可能是语法错误,请大家帮忙看看rnrnif ($strWhere!="0")rn$strSQL="select * from contract where " ." $strWhere;rnelsern$strSQL="select * from contract where isDel==\"0\""; 提示该行出错rnrnrn$strResult= "项目序号" 该行也是同样的错误提示
数据读取时遇到错误
一个C#写的同步程序,把数据从Informix同步到Oracle中,经常遇到如下的错误提示,如何有效解决?rnrnSystem.Data.Odbc.OdbcException: ERROR [HY000] [Informix][Informix ODBC Driver][Informix]Could not do a physical-order read to fetch next row. sqlerrm(img_file) at System.Data.Odbc.OdbcConnection.HandleError(OdbcHandle hrHandle, RetCode retcode) at System.Data.Odbc.OdbcDataReader.Read() at Vmi.Form1.DB_Group_Syn(String Sql, String Vmi_T_Name, String Vmi_I_Name, String IO, String Imr)
SSH时遇到的错误
[color=#FF0000]rnorg.springframework.beans.factory.BeanCreationException: Error creating bean with name 'goodsDao': Injection of persistence fields failed; nested exception is org.springframework.beans.factory.BeanCreationException: Error creating bean with name 'entityManagerFactory' defined in class path resource [beans.xml]: Invocation of init method failed; nested exception is java.lang.IllegalArgumentException: Cannot find class [org.hibernate.ejb.HibernatePersistence]rn at org.springframework.orm.jpa.support.PersistenceAnnotationBeanPostProcessor.postProcessAfterInstantiation(PersistenceAnnotationBeanPostProcessor.java:311)rn at org.springframework.beans.factory.support.AbstractAutowireCapableBeanFactory.populateBean(AbstractAutowireCapableBeanFactory.java:959)rn at org.springframework.beans.factory.support.AbstractAutowireCapableBeanFactory.doCreateBean(AbstractAutowireCapableBeanFactory.java:472)rn at org.springframework.beans.factory.support.AbstractAutowireCapableBeanFactory$1.run(AbstractAutowireCapableBeanFactory.java:409)rn at java.security.AccessController.doPrivileged(Native Method)rn at org.springframework.beans.factory.support.AbstractAutowireCapableBeanFactory.createBean(AbstractAutowireCapableBeanFactory.java:380)rn at org.springframework.beans.factory.support.AbstractBeanFactory$1.getObject(AbstractBeanFactory.java:264)rn at org.springframework.beans.factory.support.DefaultSingletonBeanRegistry.getSingleton(DefaultSingletonBeanRegistry.java:222)rn at org.springframework.beans.factory.support.AbstractBeanFactory.doGetBean(AbstractBeanFactory.java:261)rn at org.springframework.beans.factory.support.AbstractBeanFactory.getBean(AbstractBeanFactory.java:185)rn at org.springframework.beans.factory.support.AbstractBeanFactory.getBean(AbstractBeanFactory.java:164)rn at org.springframework.beans.factory.support.DefaultListableBeanFactory.preInstantiateSingletons(DefaultListableBeanFactory.java:429)rn at org.springframework.context.support.AbstractApplicationContext.finishBeanFactoryInitialization(AbstractApplicationContext.java:728)rn at org.springframework.context.support.AbstractApplicationContext.refresh(AbstractApplicationContext.java:380)rn at org.springframework.context.support.ClassPathXmlApplicationContext.(ClassPathXmlApplicationContext.java:139)rn at org.springframework.context.support.ClassPathXmlApplicationContext.(ClassPathXmlApplicationContext.java:83)rn at com.page.junit.GoodsTest.test(GoodsTest.java:15)rn at sun.reflect.NativeMethodAccessorImpl.invoke0(Native Method)rn at sun.reflect.NativeMethodAccessorImpl.invoke(NativeMethodAccessorImpl.java:39)rn at sun.reflect.DelegatingMethodAccessorImpl.invoke(DelegatingMethodAccessorImpl.java:25)rn at java.lang.reflect.Method.invoke(Method.java:597)rn at org.junit.runners.model.FrameworkMethod$1.runReflectiveCall(FrameworkMethod.java:44)rn at org.junit.internal.runners.model.ReflectiveCallable.run(ReflectiveCallable.java:15)rn at org.junit.runners.model.FrameworkMethod.invokeExplosively(FrameworkMethod.java:41)rn at org.junit.internal.runners.statements.InvokeMethod.evaluate(InvokeMethod.java:20)rn at org.junit.runners.BlockJUnit4ClassRunner.runChild(BlockJUnit4ClassRunner.java:70)rn at org.junit.runners.BlockJUnit4ClassRunner.runChild(BlockJUnit4ClassRunner.java:44)rn at org.junit.runners.ParentRunner$3.run(ParentRunner.java:193)rn at org.junit.runners.ParentRunner$1.runChild(ParentRunner.java:52)rn at org.junit.runners.ParentRunner.runChildren(ParentRunner.java:191)rn at org.junit.runners.ParentRunner.access$000(ParentRunner.java:42)rn at org.junit.runners.ParentRunner$2.evaluate(ParentRunner.java:184)rn at org.junit.runners.ParentRunner.run(ParentRunner.java:246)rn at org.eclipse.jdt.internal.junit4.runner.JUnit4TestReference.run(JUnit4TestReference.java:49)rn at org.eclipse.jdt.internal.junit.runner.TestExecution.run(TestExecution.java:38)rn at org.eclipse.jdt.internal.junit.runner.RemoteTestRunner.runTests(RemoteTestRunner.java:467)rn at org.eclipse.jdt.internal.junit.runner.RemoteTestRunner.runTests(RemoteTestRunner.java:683)rn at org.eclipse.jdt.internal.junit.runner.RemoteTestRunner.run(RemoteTestRunner.java:390)rn at org.eclipse.jdt.internal.junit.runner.RemoteTestRunner.main(RemoteTestRunner.java:197)rnCaused by: org.springframework.beans.factory.BeanCreationException: Error creating bean with name 'entityManagerFactory' defined in class path resource [beans.xml]: Invocation of init method failed; nested exception is java.lang.IllegalArgumentException: Cannot find class [org.hibernate.ejb.HibernatePersistence]rn at org.springframework.beans.factory.support.AbstractAutowireCapableBeanFactory.initializeBean(AbstractAutowireCapableBeanFactory.java:1338)rn at org.springframework.beans.factory.support.AbstractAutowireCapableBeanFactory.doCreateBean(AbstractAutowireCapableBeanFactory.java:473)rn at org.springframework.beans.factory.support.AbstractAutowireCapableBeanFactory$1.run(AbstractAutowireCapableBeanFactory.java:409)rn at java.security.AccessController.doPrivileged(Native Method)rn at org.springframework.beans.factory.support.AbstractAutowireCapableBeanFactory.createBean(AbstractAutowireCapableBeanFactory.java:380)rn at org.springframework.beans.factory.support.AbstractBeanFactory$1.getObject(AbstractBeanFactory.java:264)rn at org.springframework.beans.factory.support.DefaultSingletonBeanRegistry.getSingleton(DefaultSingletonBeanRegistry.java:222)rn at org.springframework.beans.factory.support.AbstractBeanFactory.doGetBean(AbstractBeanFactory.java:261)rn at org.springframework.beans.factory.support.AbstractBeanFactory.getBean(AbstractBeanFactory.java:185)rn at org.springframework.beans.factory.support.AbstractBeanFactory.getBean(AbstractBeanFactory.java:164)rn at org.springframework.orm.jpa.support.PersistenceAnnotationBeanPostProcessor.findDefaultEntityManagerFactory(PersistenceAnnotationBeanPostProcessor.java:507)rn at org.springframework.orm.jpa.support.PersistenceAnnotationBeanPostProcessor.findEntityManagerFactory(PersistenceAnnotationBeanPostProcessor.java:473)rn at org.springframework.orm.jpa.support.PersistenceAnnotationBeanPostProcessor$PersistenceElement.resolveEntityManager(PersistenceAnnotationBeanPostProcessor.java:599)rn at org.springframework.orm.jpa.support.PersistenceAnnotationBeanPostProcessor$PersistenceElement.getResourceToInject(PersistenceAnnotationBeanPostProcessor.java:570)rn at org.springframework.beans.factory.annotation.InjectionMetadata$InjectedElement.inject(InjectionMetadata.java:180)rn at org.springframework.beans.factory.annotation.InjectionMetadata.injectFields(InjectionMetadata.java:105)rn at org.springframework.orm.jpa.support.PersistenceAnnotationBeanPostProcessor.postProcessAfterInstantiation(PersistenceAnnotationBeanPostProcessor.java:308)rn ... 38 morernCaused by: java.lang.IllegalArgumentException: Cannot find class [org.hibernate.ejb.HibernatePersistence]rn at org.springframework.util.ClassUtils.resolveClassName(ClassUtils.java:233)rn at org.springframework.orm.jpa.LocalContainerEntityManagerFactoryBean.createNativeEntityManagerFactory(LocalContainerEntityManagerFactoryBean.java:211)rn at org.springframework.orm.jpa.AbstractEntityManagerFactoryBean.afterPropertiesSet(AbstractEntityManagerFactoryBean.java:291)rn at org.springframework.beans.factory.support.AbstractAutowireCapableBeanFactory.invokeInitMethods(AbstractAutowireCapableBeanFactory.java:1369)rn at org.springframework.beans.factory.support.AbstractAutowireCapableBeanFactory.initializeBean(AbstractAutowireCapableBeanFactory.java:1335)rn ... 54 morernCaused by: java.lang.ClassNotFoundException: org.hibernate.ejb.HibernatePersistencern at java.net.URLClassLoader$1.run(URLClassLoader.java:200)rn at java.security.AccessController.doPrivileged(Native Method)rn at java.net.URLClassLoader.findClass(URLClassLoader.java:188)rn at java.lang.ClassLoader.loadClass(ClassLoader.java:307)rn at sun.misc.Launcher$AppClassLoader.loadClass(Launcher.java:301)rn at java.lang.ClassLoader.loadClass(ClassLoader.java:252)rn at org.springframework.util.ClassUtils.forName(ClassUtils.java:211)rn at org.springframework.util.ClassUtils.resolveClassName(ClassUtils.java:230)rn ... 58 morernrnrn[/color]rnrn什么包没导????
hql 错误 unexpected token: (
碰见了个问题,求大家帮忙解决rnrn2011-03-03 14:52:00 [STDOUT]-[INFO]-[152] ________hql = from is_static t,(select max(s.st_checkmark) checkmark,s.st_loginid from is_static s where s.st_loginid in (select m.ma_pid from is_machine m where 1=1 ) group by s.st_loginid ) a where t.st_loginid = a.st_loginid and t.st_checkmark = a.checkmark rnrn2011-03-03 14:52:00 [PARSER]-[ERROR]-[33] line 1:18: unexpected token: (rnrn2011-03-03 14:52:00 [WorkConditionManagerCommand]-[INFO]-[1789] java.lang.IllegalArgumentException: org.hibernate.hql.ast.QuerySyntaxException: unexpected token: ( near line 1, column 18 [from is_static t,(select max(s.st_checkmark) checkmark,s.st_loginid from is_static s where s.st_loginid in (select m.ma_pid from is_machine m where 1=1 ) group by s.st_loginid ) a where t.st_loginid = a.st_loginid and t.st_checkmark = a.checkmark ]rnrnsql里面可以执行,但是这里报"("问题!!rn
python3入门——条件语句、循环语句( unexpected indent意外缩进)
1.标准if条件语句 1.1语法格式 if expression:    if_suite 1.2用法: 如果expression表达式的值非0或者为布尔值true,则执行if_suite代码块 2.if ...else条件语句 2.1语法格式 if expression:    if_suite else:   else_suite 2.2用法 如果expressi...
unexpected error encountered错误
win7上写的程序在xp上运行出现这个错误,是什么问题?rn[img=http://i108.photobucket.com/albums/n36/gamenpc/1.jpg][/img]
《python》IndentationError类的语法错误
python的代码简洁,有着非常严格的缩进问题,强制用户缩进不仅让代码排版更美观,也可以养成良好的习惯。新手刚学python,不熟练,出现的问题会经常多,缩进类的语法错误经常出现,主要还是要写代码,形成自己的Style。原因有几个: 自己粗心大意, 代码没对齐,而且这种问题很难看出来,所以要在平时养成良好的编码习惯。 混用空格键和tab键。 不熟悉编辑器的编码风格,各家各有特点。 经常要折腾半天才能
运行存储过程时的错误?
我用的是Oracle数据库,用Dbexpress控件连接数据库。存储过程在ORACLE的SQL PLUS运行没有错误,可是在DLEPHI环境下运行的时候却报错误“必须说明标识符get_guestid",其中get_guestid是存储过程的名字。我在Delphi的SQLStoredProc中,已经设置了SqlConnection和StoredProcName。请问如何解决这个错误”必须说明标识符get_guestid“?拜托大家帮帮忙啊。以下是存储过程的代码rnCREATE OR REPLACE PROCEDURE "CHENYONG"."GET_GUESTID" (ReturnId rn out varchar2)rn asrn temp_date chenyong.new_roomguestid.date1%type;rn temp_count chenyong.new_roomguestid.count1%type;rn temp_GuestId varchar2(14);rnbeginrn SELECT chenyong.new_roomguestid.date1,chenyong.new_roomguestid.count1 into temp_date,temp_count FROM chenyong.new_roomguestid;rn if (to_date(temp_date)!=to_date(sysdate)) thenrn UPDATE chenyong.new_roomguestid SET chenyong.new_roomguestid.count1 = 1,chenyong.new_roomguestid.date1=to_date(sysdate);rn elsern UPDATE chenyong.new_roomguestid SET chenyong.new_roomguestid.count1=(count1+ 1);rn end if;rn SELECT chenyong.new_roomguestid.date1, chenyong.new_roomguestid.count1 into temp_date, temp_count FROM chenyong.new_roomguestid;rn temp_GuestId:='KF'||to_char(to_date(sysdate),'YYYYMMDD')||lpad(temp_count,4,'0');rn ReturnId:=temp_GuestId;rnend get_guestid;
运行jsp文件时的错误.
请问,我行jsp时,出现了此种情况,如何解决啊?rnHTTP Status 500 - rnrn--------------------------------------------------------------------------------rnrntype Exception reportrnrnmessage rnrndescription The server encountered an internal error () that prevented it from fulfilling this request.rnrnexception rnrnorg.apache.jasper.JasperException: Unable to compile class for JSPrn org.apache.jasper.compiler.DefaultErrorHandler.javacError(DefaultErrorHandler.java:97)rn org.apache.jasper.compiler.ErrorDispatcher.javacError(ErrorDispatcher.java:346)rn org.apache.jasper.compiler.Compiler.generateClass(Compiler.java:414)rn org.apache.jasper.compiler.Compiler.compile(Compiler.java:472)rn org.apache.jasper.compiler.Compiler.compile(Compiler.java:451)rn org.apache.jasper.compiler.Compiler.compile(Compiler.java:439)rn org.apache.jasper.JspCompilationContext.compile(JspCompilationContext.java:511)rn org.apache.jasper.servlet.JspServletWrapper.service(JspServletWrapper.java:295)rn org.apache.jasper.servlet.JspServlet.serviceJspFile(JspServlet.java:292)rn org.apache.jasper.servlet.JspServlet.service(JspServlet.java:236)rn javax.servlet.http.HttpServlet.service(HttpServlet.java:802)rnrnrnroot cause rnrnUnable to find a javac compiler;rncom.sun.tools.javac.Main is not on the classpath.rnPerhaps JAVA_HOME does not point to the JDKrn org.apache.tools.ant.taskdefs.compilers.CompilerAdapterFactory.getCompiler(CompilerAdapterFactory.java:106)rn org.apache.tools.ant.taskdefs.Javac.compile(Javac.java:935)rn org.apache.tools.ant.taskdefs.Javac.execute(Javac.java:764)rn org.apache.jasper.compiler.Compiler.generateClass(Compiler.java:382)rn org.apache.jasper.compiler.Compiler.compile(Compiler.java:472)rn org.apache.jasper.compiler.Compiler.compile(Compiler.java:451)rn org.apache.jasper.compiler.Compiler.compile(Compiler.java:439)rn org.apache.jasper.JspCompilationContext.compile(JspCompilationContext.java:511)rn org.apache.jasper.servlet.JspServletWrapper.service(JspServletWrapper.java:295)rn org.apache.jasper.servlet.JspServlet.serviceJspFile(JspServlet.java:292)rn org.apache.jasper.servlet.JspServlet.service(JspServlet.java:236)rn javax.servlet.http.HttpServlet.service(HttpServlet.java:802)rnrn我的jsp只是写了些简单的语句,未设计java语法,觉得很奇怪.
运行automake时的错误
运行automake时出现下面的错误rnconfigure.in: required file `./install-sh' not foundrnconfigure.in: required file `./missing' not foundrnMakefile.am: required file `./depcomp' not foundrnrn请高手帮忙解答一下,谢谢rn
Tomcat运行中遇到的错误
这段时间研究jsp动态页面,本人是用Myeclipse写的程序,用Myeclipse中内置的Tomcat服务器运行的jsp文件。本人白板,这个问题是servlet中配置时遇到的一个问题。 六月 02, 2018 9:56:01 上午 org.apache.catalina.core.ContainerBase addChildInternal 严重: ContainerBase....
LoadRunner 遇到错误继续运行
1.Ciontinue on error遇到错误继续运行 2.fail open transactions on lr_error_message执行到事务中调用的lr_error_message()函数时将事务的结果置为failed 3.generate snaipshot on error对错误进行快照
Python Indent
把Python Indent文件夹和Python Indent.dll放在notepad++安装目录的plugins文件夹下 3. 重启notepad++ 4. 依次点击 插件--Python Indent--Enable
Mac nginx运行遇到的错误
(1)Mac运行nginx的错误 nginx: [emerg] bind() to 0.0.0.0:80 failed (48: Address already in use) 原因:80端口被占用,(可能因为未成功关闭一些服务,如nginx服务等) 解决方法: sudo nginx -s stop(或者:sudo nginx -s quit),然后重新启动(sudo nginx
爬虫运行遇到的一些错误
对方服务器积极拒绝连接-------------把默认浏览器的局域网设置中自动检测勾选上,或者代理服务器换一下 spider not found-------------爬虫中的name=“爬虫文件名” crawed 0 pages--------------start_urls检查一下 telnet console listening on127.0.0.1    ----------设置...
python 运行遇到的错误收集整理
1、AttributeError: 'tuple' object has no attribute 'major': 详细:File &quot;/usr/lib/python2.6/site-packages/datx/util.py&quot;, line 11, in convert             if sys.version_info.major &amp;gt;= 3: 解决:版本问题,升级到版本3,...
批处理文件隐藏运行程序
批处理文件隐藏运行程序!隐藏运行程序!!!
delphi如何运行批处理文件
编译完程序后 运行WinExec('d:\out.bat',SW_SHOWNORMAL);后out.bat中的内容根据编译的程序变化 但是却没有运行批处理文件 想请教下 rnWinExec('d:\out.bat',SW_SHOWNORMAL);rn可以吗?rnWinExec(pchar('d:\out.bat'),SW_SHOWNORMAL);可以吗?rnShellExecute呢 该怎么用呢rnrn
运行批处理文件出现乱码
现象如下: 分析:字符编码的问题 解决:将文件另存为ANSI格式,右击点击批处理文件编辑,如果是记事本,则如下图所示 如果使用Notepad++则从以下地方更改: 修改后再次运行,正常了: ...
Windows 建立、运行批处理文件
如题
有关批处理文件运行的问题
各位朋友,请教大家一个问题:rn如何让批处理文件在运行的时候不出现DOS界面呢?rn谢谢!
win7系统运行批处理文件
win7系统、win8系统、win10系统,用批处理注册控件时,在批处理文件开头加上cd /d %~dp0,注册控件时需要用管理员运行
win 7运行批处理文件
win 7如何运行批处理文件,我运行过之后,一直提示不是内部命令或者外部命令,也不是可执行的批处理文件rn我以管理员身份运行的,各位帮帮忙啊,无奈了···
c#运行批处理文件
现在我希望使用C#通过点击按钮,运行两个批处理文件,该批处理文件可以在各自的目录里正常运行,但C#调用时出现如下图结果,我使用的调用方法是论坛里介绍的System.Diagnostics.Process.Start("C:\\a.bat");rn[img=https://img-bbs.csdn.net/upload/201606/29/1467190138_441372.jpg][/img]rn[img=https://img-bbs.csdn.net/upload/201606/29/1467190145_732737.jpg][/img]rn均显示未找到文件,不知造成这种情况的具体原因,求教解决方法。
静默运行bat批处理文件
静默运行批处理文件,如bat脚本,只需要将其中的绝对路径加以修改即可
系统自动运行批处理文件。
winxp,有以下批处理文件:rnC:\Documents and Settings\Sun\Cookies\~Delbat01.batrn每隔2分钟20秒左右,执行一批,一批执行5次,即产生5个cmd.exe,执行完毕后cmd.exe进程自动退出。rn批处理内容如下:rn[code=INIFile]del "C:\Documents and Settings\Sun\Cookies\*sogou*.txt"rndel "C:\Documents and Settings\Sun\Cookies\~Delbat01.bat"[/code]rn其中“Sun”为当前用户。rnrn该批处理文件删除后约15秒即重新生成。rn系统进程已经用IceSword清理过,没有不明进程;用360安全卫士检查系统服务项,已将非系统服务全部禁用。rn360安全卫士木马扫描、恶意软件扫描均无发现;卡巴斯基6,最新病毒库扫描,未发现任何问题。rnrn请高手帮忙分析,谢谢。
在VC中运行批处理文件
如何在VC中运行批处理文件???rnrn我用VC做了一个程序,用来控制各个程序的启动和停止;我遇到的问题是这个程序不能开启复杂一点的批处理文件,我用的方法是CreateProcess(),请问各位大侠该用什么方法?小弟在此多谢了!!!
相关热词 c# 标准差 计算 c#siki第五季 c#入门推荐书 c# 解码海康数据流 c# xml的遍历循环 c# 取 查看源码没有的 c#解决高并发 委托 c#日期转化为字符串 c# 显示问号 c# 字典对象池