com6339663
华光流年
2019-03-14 18:02

RK3328平台android8.1编译报错

5
  • android-studio
  • android

-fPIC -no-canonical-prefixes -U_FORTIFY_SOURCE -D_FORTIFY_SOURCE=2 -fstack-protector -D__STDC_FORMAT_MACROS -D__STDC_CONSTANT_MACROS -O2 -g -fno-strict-aliasing --gcc-toolchain=prebuilts/gcc/linux-x86/host/x86_64-linux-glibc2.15-4.8 --sysroot prebuilts/gcc/linux-x86/host/x86_64-linux-glibc2.15-4.8/sysroot -fstack-protector-strong -m64 -DANDROID -fmessage-length=0 -W -Wall -Wno-unused -Winit-self -Wpointer-arith -DNDEBUG -UDEBUG -fdebug-prefix-map=/proc/self/cwd= -D__compiler_offsetof=__builtin_offsetof -Werror=int-conversion -Wno-reserved-id-macro -Wno-format-pedantic -Wno-unused-command-line-argument -fcolor-diagnostics -Wno-expansion-to-defined -fdebug-prefix-map=\$PWD/= -target x86_64-linux-gnu -Bprebuilts/gcc/linux-x86/host/x86_64-linux-glibc2.15-4.8/x86_64-linux/bin -Wsign-promo -Wno-inconsistent-missing-override -Wno-null-dereference -D_LIBCPP_ENABLE_THREAD_SAFETY_ANNOTATIONS -Wno-thread-safety-negative -isystem prebuilts/gcc/linux-x86/host/x86_64-linux-glibc2.15-4.8/x86_64-linux/include/c++/4.8 -isystem prebuilts/gcc/linux-x86/host/x86_64-linux-glibc2.15-4.8/x86_64-linux/include/c++/4.8/backward -isystem prebuilts/gcc/linux-x86/host/x86_64-linux-glibc2.15-4.8/x86_64-linux/include/c++/4.8/x86_64-linux -std=gnu++14 -Wall -Werror -fPIE -D_USING_LIBCXX -DANDROID_STRICT -nostdinc++ -Werror=int-to-pointer-cast -Werror=pointer-to-int-cast -Werror=address-of-temporary -Werror=return-type -MD -MF out/host/linux-x86/obj/EXECUTABLES/validatekeymaps_intermediates/Main.d -o out/host/linux-x86/obj/EXECUTABLES/validatekeymaps_intermediates/Main.o frameworks/base/tools/validatekeymaps/Main.cpp"
Traceback (most recent call last):
File "prebuilts/clang/host/linux-x86/clang-4053586/bin/clang++", line 4, in
import shlex
ImportError: No module named shlex
[ 0% 29/76723] host C++: conscrypt_ge...nts/src/gen/cpp/generate_constants.cpp
FAILED: out/host/linux-x86/obj/EXECUTABLES/conscrypt_generate_constants_intermediates/constants/src/gen/cpp/generate_constants.o
/bin/bash -c "PWD=/proc/self/cwd prebuilts/clang/host/linux-x86/clang-4053586/bin/clang++ -I external/conscrypt -I out/host/linux-x86/obj/EXECUTABLES/conscrypt_generate_constants_intermediates -I out/host/linux-x86/gen/EXECUTABLES/conscrypt_generate_constants_intermediates -I libnativehelper/include_deprecated \$(cat out/host/linux-x86/obj/EXECUTABLES/conscrypt_generate_constants_intermediates/import_includes) -I system/core/include -I system/media/audio/include -I hardware/libhardware/include -I hardware/libhardware_legacy/include -I hardware/ril/include -I libnativehelper/include -I frameworks/native/include -I frameworks/native/opengl/include -I frameworks/av/include -c -fno-exceptions -Wno-multichar -Wa,--noexecstack -fPIC -no-canonical-prefixes -U_FORTIFY_SOURCE -D_FORTIFY_SOURCE=2 -fstack-protector -D__STDC_FORMAT_MACROS -D__STDC_CONSTANT_MACROS -O2 -g -fno-strict-aliasing --gcc-toolchain=prebuilts/gcc/linux-x86/host/x86_64-linux-glibc2.15-4.8 --sysroot prebuilts/gcc/linux-x86/host/x86_64-linux-glibc2.15-4.8/sysroot -fstack-protector-strong -m64 -DANDROID -fmessage-length=0 -W -Wall -Wno-unused -Winit-self -Wpointer-arith -DNDEBUG -UDEBUG -fdebug-prefix-map=/proc/self/cwd= -D__compiler_offsetof=__builtin_offsetof -Werror=int-conversion -Wno-reserved-id-macro -Wno-format-pedantic -Wno-unused-command-line-argument -fcolor-diagnostics -Wno-expansion-to-defined -fdebug-prefix-map=\$PWD/= -target x86_64-linux-gnu -Bprebuilts/gcc/linux-x86/host/x86_64-linux-glibc2.15-4.8/x86_64-linux/bin -Wsign-promo -Wno-inconsistent-missing-override -Wno-null-dereference -D_LIBCPP_ENABLE_THREAD_SAFETY_ANNOTATIONS -Wno-thread-safety-negative -isystem prebuilts/gcc/linux-x86/host/x86_64-linux-glibc2.15-4.8/x86_64-linux/include/c++/4.8 -isystem prebuilts/gcc/linux-x86/host/x86_64-linux-glibc2.15-4.8/x86_64-linux/include/c++/4.8/backward -isystem prebuilts/gcc/linux-x86/host/x86_64-linux-glibc2.15-4.8/x86_64-linux/include/c++/4.8/x86_64-linux -std=gnu++14 -fPIE -D_USING_LIBCXX -nostdinc++ -Werror=int-to-pointer-cast -Werror=pointer-to-int-cast -Werror=address-of-temporary -Werror=return-type -MD -MF out/host/linux-x86/obj/EXECUTABLES/conscrypt_generate_constants_intermediates/constants/src/gen/cpp/generate_constants.d -o out/host/linux-x86/obj/EXECUTABLES/conscrypt_generate_constants_intermediates/constants/src/gen/cpp/generate_constants.o external/conscrypt/constants/src/gen/cpp/generate_constants.cpp"
Traceback (most recent call last):
File "prebuilts/clang/host/linux-x86/clang-4053586/bin/clang++", line 4, in
import shlex
ImportError: No module named shlex
[ 0% 30/76723] host C++: protoc-gen-j...tools/streaming_proto/string_utils.cpp
FAILED: out/host/linux-x86/obj/EXECUTABLES/protoc-gen-javastream_intermediates/string_utils.o
/bin/bash -c "PWD=/proc/self/cwd prebuilts/clang/host/linux-x86/clang-4053586/bin/clang++ -I frameworks/base/tools/streaming_proto -I out/host/linux-x86/obj/EXECUTABLES/protoc-gen-javastream_intermediates -I out/host/linux-x86/gen/EXECUTABLES/protoc-gen-javastream_intermediates -I libnativehelper/include_deprecated \$(cat out/host/linux-x86/obj/EXECUTABLES/protoc-gen-javastream_intermediates/import_includes) -I system/core/include -I system/media/audio/include -I hardware/libhardware/include -I hardware/libhardware_legacy/include -I hardware/ril/include -I libnativehelper/include -I frameworks/native/include -I frameworks/native/opengl/include -I frameworks/av/include -c -fno-exceptions -Wno-multichar -Wa,--noexecstack -fPIC -no-canonical-prefixes -U_FORTIFY_SOURCE -D_FORTIFY_SOURCE=2 -fstack-protector -D__STDC_FORMAT_MACROS -D__STDC_CONSTANT_MACROS -O2 -g -fno-strict-aliasing --gcc-toolchain=prebuilts/gcc/linux-x86/host/x86_64-linux-glibc2.15-4.8 --sysroot prebuilts/gcc/linux-x86/host/x86_64-linux-glibc2.15-4.8/sysroot -fstack-protector-strong -m64 -DANDROID -fmessage-length=0 -W -Wall -Wno-unused -Winit-self -Wpointer-arith -DNDEBUG -UDEBUG -fdebug-prefix-map=/proc/self/cwd= -D__compiler_offsetof=__builtin_offsetof -Werror=int-conversion -Wno-reserved-id-macro -Wno-format-pedantic -Wno-unused-command-line-argument -fcolor-diagnostics -Wno-expansion-to-defined -fdebug-prefix-map=\$PWD/= -target x86_64-linux-gnu -Bprebuilts/gcc/linux-x86/host/x86_64-linux-glibc2.15-4.8/x86_64-linux/bin -Wsign-promo -Wno-inconsistent-missing-override -Wno-null-dereference -D_LIBCPP_ENABLE_THREAD_SAFETY_ANNOTATIONS -Wno-thread-safety-negative -isystem prebuilts/gcc/linux-x86/host/x86_64-linux-glibc2.15-4.8/x86_64-linux/include/c++/4.8 -isystem prebuilts/gcc/linux-x86/host/x86_64-linux-glibc2.15-4.8/x86_64-linux/include/c++/4.8/backward -isystem prebuilts/gcc/linux-x86/host/x86_64-linux-glibc2.15-4.8/x86_64-linux/include/c++/4.8/x86_64-linux -std=gnu++14 -fPIE -D_USING_LIBCXX -DANDROID_STRICT -nostdinc++ -Werror=int-to-pointer-cast -Werror=pointer-to-int-cast -Werror=address-of-temporary -Werror=return-type -MD -MF out/host/linux-x86/obj/EXECUTABLES/protoc-gen-javastream_intermediates/string_utils.d -o out/host/linux-x86/obj/EXECUTABLES/protoc-gen-javastream_intermediates/string_utils.o frameworks/base/tools/streaming_proto/string_utils.cpp"
Traceback (most recent call last):
File "prebuilts/clang/host/linux-x86/clang-4053586/bin/clang++", line 4, in
import shlex
ImportError: No module named shlex
[ 0% 49/76723] build out/target/common/obj/all-event-log-tags.txt
ninja: build stopped: subcommand failed.
17:38:37 ninja failed with: exit status 1
make: *** [run_soong_ui] Error 1
jda@jda-ubut12-ser:rk3328_8.1_box_190306$

  • 点赞
  • 回答
  • 收藏
  • 复制链接分享

1条回答