编译ss5时出错Makefile:32: recipe for target 'ss5' failed

没什么c币奖励。。。
系统:Fedora23x64
gcc环境安装好了
执行./configure时没报错(我看来)


checking for gcc... gcc
checking for C compiler default output file name... a.out
checking whether the C compiler works... yes
checking whether we are cross compiling... no
checking for suffix of executables...
checking for suffix of object files... o
checking whether we are using the GNU C compiler... yes
checking whether gcc accepts -g... yes
checking for gcc option to accept ISO C89... none needed
checking for a BSD-compatible install... /usr/bin/install -c
checking for main in -ldl... yes
checking for main in -lldap... yes
checking for main in -lpam... yes
checking for main in -lpam_misc... yes
checking for main in -lpthread... yes
checking for main in -lssl... yes
checking how to run the C preprocessor... gcc -E
checking for grep that handles long lines and -e... /usr/bin/grep
checking for egrep... /usr/bin/grep -E
checking for ANSI C header files... yes
checking for sys/wait.h that is POSIX.1 compatible... yes
checking for sys/types.h... yes
checking for sys/stat.h... yes
checking for stdlib.h... yes
checking for string.h... yes
checking for memory.h... yes
checking for strings.h... yes
checking for inttypes.h... yes
checking for stdint.h... yes
checking for unistd.h... yes
checking arpa/inet.h usability... yes
checking arpa/inet.h presence... yes
checking for arpa/inet.h... yes
checking fcntl.h usability... yes
checking fcntl.h presence... yes
checking for fcntl.h... yes
checking netdb.h usability... yes
checking netdb.h presence... yes
checking for netdb.h... yes
checking netinet/in.h usability... yes
checking netinet/in.h presence... yes
checking for netinet/in.h... yes
checking for stdlib.h... (cached) yes
checking for string.h... (cached) yes
checking sys/ioctl.h usability... yes
checking sys/ioctl.h presence... yes
checking for sys/ioctl.h... yes
checking sys/socket.h usability... yes
checking sys/socket.h presence... yes
checking for sys/socket.h... yes
checking sys/time.h usability... yes
checking sys/time.h presence... yes
checking for sys/time.h... yes
checking syslog.h usability... yes
checking syslog.h presence... yes
checking for syslog.h... yes
checking for unistd.h... (cached) yes
checking security/pam_misc.h usability... yes
checking security/pam_misc.h presence... yes
checking for security/pam_misc.h... yes
checking security/pam_appl.h usability... yes
checking security/pam_appl.h presence... yes
checking for security/pam_appl.h... yes
checking for an ANSI C-conforming const... yes
checking for inline... inline
checking for pid_t... yes
checking whether time.h and sys/time.h may both be included... yes
checking vfork.h usability... no
checking vfork.h presence... no
checking for vfork.h... no
checking for fork... yes
checking for vfork... yes
checking for working fork... yes
checking for working vfork... (cached) yes
checking whether gcc needs -traditional... no
checking for stdlib.h... (cached) yes
checking for GNU libc compatible realloc... yes
checking sys/select.h usability... yes
checking sys/select.h presence... yes
checking for sys/select.h... yes
checking for sys/socket.h... (cached) yes
checking types of arguments for select... int,fd_set *,struct timeval *
checking for strftime... yes
checking for bzero... yes
checking for gethostbyname... yes
checking for gettimeofday... yes
checking for inet_ntoa... yes
checking for memset... yes
checking for select... yes
checking for socket... yes
checking for strdup... yes
checking for strtol... yes
configure: creating ./config.status
config.status: creating Makefile
config.status: creating modules/Makefile
config.status: creating modules/mod_authen/Makefile
config.status: creating modules/mod_author/Makefile
config.status: creating modules/mod_balance/Makefile
config.status: creating modules/mod_bandwidth/Makefile
config.status: creating modules/mod_dump/Makefile
config.status: creating modules/mod_filter/Makefile
config.status: creating modules/mod_log/Makefile
config.status: creating modules/mod_proxy/Makefile
config.status: creating modules/mod_socks4/Makefile
config.status: creating modules/mod_socks5/Makefile
config.status: creating modules/mod_statistics/Makefile
config.status: creating common/Makefile
config.status: creating src/Makefile
config.status: creating include/config.h
config.status: include/config.h is unchanged

但是make就报错了

collect2: error: ld returned 1 exit status
Makefile:32: recipe for target 'ss5' failed
make[1]: *** [ss5] Error 1
make[1]: Leaving directory '/root/ss5-3.8.9/src'
Makefile:31: recipe for target 'src' failed
make: *** [src] Error 2

不知道我们是,求da'l

1个回答

这是c语言,只不过有的没学的高深

Csdn user default icon
上传中...
上传图片
插入图片
抄袭、复制答案,以达到刷声望分或其他目的的行为,在CSDN问答是严格禁止的,一经发现立刻封号。是时候展现真正的技术了!
其他相关推荐
caffe编译时出现make: protoc:命令未找到
make all -j8 时出现下面问题: ``` PROTOC src/caffe/proto/caffe.proto make: protoc:命令未找到 Makefile:629: recipe for target '.build_release/src/caffe/proto/caffe.pb.cc' failed make: *** [.build_release/src/caffe/proto/caffe.pb.cc] Error 127 make: *** 正在等待未完成的任务.... ```
为什么在ubuntu中eclipse编译c程序时makefile文件报错"recipe for target failed"
第一次给ubuntu装eclipse for c/c++。也装了CDT,建立空项目编译时还会有这个报错
紧急求助!!ubuntu16.04 caffe make clean报错!!
我的系统ubuntu16.04,昨天make 了一下没马上清,今天开机在caffe根目录下水make clean 发现报错 rm:无法删除 ".build_release" : 不允许操作 makefile:660:recipe for target "clean" failed make:[clean] error 1 (ignored) rm:无法删除 "build ": 不允许操作 makefile:660:recipe for target "clean" failed make:[clean] error 1 (ignored) rm:无法删除 "distribute": 不允许操作 makefile:660:recipe for target "clean" failed make:[clean] error 1 (ignored) 我什么文件都没改呀!以前一直正常。 跪求各位大侠赐教!! 请问“输出目录”或“输出文件夹”在哪个位置,本人小白请楼下大侠指点,多谢!
rtems编译出错recipe for 'libcrypt_a-crypt.o' failed
windows:64bit vmware上安装fedora21,64位 参考csdn各种大神们的成功经验,安装好ARM的交叉编译工具,又通过git://git.rtems.org/rtems.git得到最新的源码,编译时突然出现以下问题,请教各位高手该如何解决? Making all in libcrypt gmake[5]: Entering directory '/root/rtemsPro/rtemsSRC/rtems/buildcsb337/arm-rtems4.11/c/csb337/cpukit/libcrypt' arm-rtems4.11-gcc --pipe -DHAVE_CONFIG_H -I.. -I../../cpukit/../../../csb337/lib/include -mcpu=arm920 -O2 -g -Wall -Wmissing-prototypes -Wimplicit-function-declaration -Wstrict-prototypes -Wnested-externs -MT libcrypt_a-crypt.o -MD -MP -MF .deps/libcrypt_a-crypt.Tpo -c -o libcrypt_a-crypt.o `test -f 'crypt.c' || echo '../../../../../../c/src/../../cpukit/libcrypt/'`crypt.c In file included from ../../../../../../c/src/../../cpukit/libcrypt/crypt.c:32:0: ../../cpukit/../../../csb337/lib/include/crypt.h:70:55: error: expected ')' before 'int' void _crypt_b64_from_24bit(uint8_t, uint8_t, uint8_t, int, int *, char **); ^ Makefile:427: recipe for target 'libcrypt_a-crypt.o' failed gmake[5]: *** [libcrypt_a-crypt.o] Error 1 gmake[5]: Leaving directory '/root/rtemsPro/rtemsSRC/rtems/buildcsb337/arm-rtems4.11/c/csb337/cpukit/libcrypt' Makefile:964: recipe for target 'all-recursive' failed gmake[4]: *** [all-recursive] Error 1 gmake[4]: Leaving directory '/root/rtemsPro/rtemsSRC/rtems/buildcsb337/arm-rtems4.11/c/csb337/cpukit' Makefile:691: recipe for target 'all' failed gmake[3]: *** [all] Error 2 gmake[3]: Leaving directory '/root/rtemsPro/rtemsSRC/rtems/buildcsb337/arm-rtems4.11/c/csb337/cpukit' Makefile:487: recipe for target 'all-recursive' failed gmake[2]: *** [all-recursive] Error 1 gmake[2]: Leaving directory '/root/rtemsPro/rtemsSRC/rtems/buildcsb337/arm-rtems4.11/c/csb337' Makefile:348: recipe for target 'all-recursive' failed gmake[1]: *** [all-recursive] Error 1 gmake[1]: Leaving directory '/root/rtemsPro/rtemsSRC/rtems/buildcsb337/arm-rtems4.11/c' Makefile:472: recipe for target 'all-recursive' failed make: *** [all-recursive] Error 1 [root@localhost buildcsb337]#
Makefile:48: recipe for target 'htpasswd' failed make[2]: *** [htpasswd] Error 1
我在安装apache2...时输入make语句时,出现上述错误,环境ubuntu16.04 哪位高手帮一下忙
linux内核编译时出错 不知道怎么弄
scripts/kconfig/conf -s arch/mips/Kconfig CHK include/linux/version.h CHK include/linux/utsrelease.h SYMLINK include/asm -> include/asm-mips CALL scripts/checksyscalls.sh CHK include/linux/compile.h /opt/linux-2.6.32/scripts/gen_initramfs_list.sh: Cannot open '/mnt/ramdisk.tiny4/' /opt/linux-2.6.32/usr/Makefile:64: recipe for target 'usr/initramfs_data.cpio.gz' failed make[1]: *** [usr/initramfs_data.cpio.gz] Error 1 Makefile:878: recipe for target 'usr' failed make: *** [usr] Error 2
关于qt5.6.0编译源码桌面版出现的问题
使用来自官网的qt-everywhere-opensource-src-5.6.0.tar.gz 第一步。/configure 第二部 make 出现啦 Project ERROR: Unknown module(s) in QT: quick Makefile:47: recipe for target 'sub-textureandlight-make_first' failed make[4]: *** [sub-textureandlight-make_first] Error 3 make[4]: Leaving directory '/home/jay/qt-x11/qtcanvas3d/examples/canvas3d/canvas3d' Makefile:42: recipe for target 'sub-canvas3d-make_first' failed make[3]: *** [sub-canvas3d-make_first] Error 2 make[3]: Leaving directory '/home/jay/qt-x11/qtcanvas3d/examples/canvas3d' Makefile:42: recipe for target 'sub-canvas3d-make_first' failed make[2]: *** [sub-canvas3d-make_first] Error 2 make[2]: Leaving directory '/home/jay/qt-x11/qtcanvas3d/examples' Makefile:69: recipe for target 'sub-examples-make_first' failed make[1]: *** [sub-examples-make_first] Error 2 make[1]: Leaving directory '/home/jay/qt-x11/qtcanvas3d' Makefile:349: recipe for target 'module-qtcanvas3d-make_first' failed make: *** [module-qtcanvas3d-make_first] Error 2 如何解决
服务器无root权限配置caffe安装snappy时make出错
根据教程https://blog.csdn.net/jiajinrang93/article/details/80337513,安装snappy进行make时报错,cmake版本为3.5.1.请问这要怎样解决?? ``` CMakeFiles/snappy_unittest.dir/snappy_unittest.cc.o:(.rodata._ZTIN6snappy31Snappy_ReadPastEndOfBuffer_TestE[_ZTIN6snappy31Snappy_ReadPastEndOfBuffer_TestE]+0x10): more undefined references to `typeinfo for testing::Test' follow collect2: error: ld returned 1 exit status CMakeFiles/snappy_unittest.dir/build.make:122: recipe for target 'snappy_unittest' failed make[2]: *** [snappy_unittest] Error 1 CMakeFiles/Makefile2:104: recipe for target 'CMakeFiles/snappy_unittest.dir/all' failed make[1]: *** [CMakeFiles/snappy_unittest.dir/all] Error 2 Makefile:138: recipe for target 'all' failed make: *** [all] Error 2 ```
linux内核编译时出错 求大佬指导
root@yu-virtual-machine:/opt/linux-2.6.32# make scripts/kconfig/conf -s arch/mips/Kconfig CHK include/linux/version.h CHK include/linux/utsrelease.h SYMLINK include/asm -> include/asm-mips CALL scripts/checksyscalls.sh CHK include/linux/compile.h GEN usr/initramfs_data.cpio AS usr/initramfs_data.o LD usr/built-in.o CC drivers/mtd/nand/nand_base.o drivers/mtd/nand/nand_base.c: In function 'nand_scan_tail': drivers/mtd/nand/nand_base.c:2821: error: implicit declaration of function 'pr_warn' scripts/Makefile.build:229: recipe for target 'drivers/mtd/nand/nand_base.o' failed make[3]: *** [drivers/mtd/nand/nand_base.o] Error 1 scripts/Makefile.build:365: recipe for target 'drivers/mtd/nand' failed make[2]: *** [drivers/mtd/nand] Error 2 scripts/Makefile.build:365: recipe for target 'drivers/mtd' failed make[1]: *** [drivers/mtd] Error 2 Makefile:878: recipe for target 'drivers' failed make: *** [drivers] Error 2 求大佬指导
Ubuntu编译内核时make menuconfig出错的问题
在编译内核时遇到了如下问题,小白想知道这要怎么解决呢 root@ubuntu:/usr/src/linux-2.6.32.60# make menuconfig HOSTCC scripts/basic/fixdep /usr/bin/ld: cannot find -lgcc_s collect2: error: ld returned 1 exit status scripts/Makefile.host:118: recipe for target 'scripts/basic/fixdep' failed make[1]: *** [scripts/basic/fixdep] Error 1 Makefile:381: recipe for target 'scripts_basic' failed make: *** [scripts_basic] Error 2
在ubuntu下用make安装软件出错
第一次在ubuntu18.04用源代码安装软件,make的时候总是出错,我执行前面的 命令名问题,但是到执行make的时候,总是出错,因为是个小白,所以不知道知道是什么原因. ``` $] cd sumo-0.32.0 $] ./configure $] make collect2: error: ld returned 1 exit status Makefile:461: recipe for target 'marouter' failed make[3]: *** [marouter] Error 1 make[3]: 离开目录“/home/as/sumo-0.32.0/src/marouter” Makefile:689: recipe for target 'all-recursive' failed make[2]: *** [all-recursive] Error 1 make[2]: 离开目录“/home/as/sumo-0.32.0/src” Makefile:530: recipe for target 'all' failed make[1]: *** [all] Error 2 make[1]: 离开目录“/home/as/sumo-0.32.0/src” Makefile:406: recipe for target 'all-recursive' failed make: *** [all-recursive] Error 1 ```
虚拟机Linux系统下编译esp8266程序出错
错误信息提示如下: make[1]: xt-xcc: Command not found ../../Makefile:321: recipe for target '.output/eagle/debug/obj/user_main.o' failed make[1]: *** [.output/eagle/debug/obj/user_main.o] Error 127 make[1]: Leaving directory '/mnt/hgfs/share/gokit-soc-esp8266/app/user' ../Makefile:307: recipe for target '.subdirs' failed make: *** [.subdirs] Error 2 程序用的是机智云官方程序,求教
内核编译执行make menuconfig时出现的问题
一开始的问题是这样的 HOSTCC scripts/basic/fixdep * * Unable to find the ncurses package. * Install ncurses (ncurses-devel or libncurses-dev * depending on your distribution). * scripts/kconfig/Makefile:208: recipe for target 'scripts/kconfig/mconf-cfg' failed make[1]: *** [scripts/kconfig/mconf-cfg] Error 1 Makefile:552: recipe for target 'menuconfig' failed make: *** [menuconfig] Error 2 后来在百度上找到的办法是缺少ncurses的库,需要输入apt-get install libncurses5-de安装缺缺少失的库。然后问题变成了 root@ubuntu:/home/electronic/kernel/linux-5.1.10# make menuconfig UPD scripts/kconfig/mconf-cfg HOSTCC scripts/kconfig/mconf.o HOSTCC scripts/kconfig/lxdialog/checklist.o HOSTCC scripts/kconfig/lxdialog/inputbox.o HOSTCC scripts/kconfig/lxdialog/menubox.o HOSTCC scripts/kconfig/lxdialog/textbox.o HOSTCC scripts/kconfig/lxdialog/util.o HOSTCC scripts/kconfig/lxdialog/yesno.o HOSTCC scripts/kconfig/confdata.o HOSTCC scripts/kconfig/expr.o LEX scripts/kconfig/lexer.lex.c /bin/sh: 1: flex: not found scripts/Makefile.lib:194: recipe for target 'scripts/kconfig/lexer.lex.c' failed make[1]: *** [scripts/kconfig/lexer.lex.c] Error 127 Makefile:552: recipe for target 'menuconfig' failed make: *** [menuconfig] Error 2 然后再百度的解决方法是apt-get install bison -y,问题又是这样 LEX scripts/kconfig/lexer.lex.c /bin/sh: 1: flex: not found scripts/Makefile.lib:194: recipe for target 'scripts/kconfig/lexer.lex.c' failed make[1]: *** [scripts/kconfig/lexer.lex.c] Error 127 Makefile:552: recipe for target 'menuconfig' failed make: *** [menuconfig] Error 2 之后也没有其他的解决方法。 作为一个初学linux的大学生,搞不懂,看着头疼。求大佬指点
ubuntu下 qt5.4 源码编译问题
从官网下载了qt-everywhere-opensource-src-5.6.2压缩包 解压后 执行./configure 成功后 执行make 出现以下错误 Project ERROR: Unknown module(s) in QT: dbus Project ERROR: Unknown module(s) in QT: quick Makefile:47: recipe for target 'sub-textureandlight-make_first' failed make[3]: *** [sub-textureandlight-make_first] Error 3 make[3]: Leaving directory '/home/jay/qt-x11/qtcanvas3d/examples/canvas3d' Makefile:42: recipe for target 'sub-canvas3d-make_first' failed make[2]: *** [sub-canvas3d-make_first] Error 2 make[2]: Leaving directory '/home/jay/qt-x11/qtcanvas3d/examples' Makefile:69: recipe for target 'sub-examples-make_first' failed make[1]: *** [sub-examples-make_first] Error 2 make[1]: Leaving directory '/home/jay/qt-x11/qtcanvas3d' Makefile:349: recipe for target 'module-qtcanvas3d-make_first' failed make: *** [module-qtcanvas3d-make_first] Error 2 如何解决这个问题
ubuntu 安装配置c++的opencv 报错
我在ubuntu 上打算安装和配置c++的Opencv, 下载了opencv3.1.0版本的代码,然后也手动的下载了ippicv_linux_20151201.tgz。创建build文件夹后Cmake命令已经可以编译过去了。 但是在执行make命令的时候,经常会报错: ``` [ 15%] Building CXX object modules/core/CMakeFiles/opencv_core.dir/opencl_kernels_core.cpp.o [ 15%] Linking CXX shared library ../../lib/libopencv_core.so /usr/bin/ld: CMakeFiles/opencv_core.dir/src/va_intel.cpp.o: relocation R_X86_64_32 against `.rodata' can not be used when making a shared object; recompile with -fPIC CMakeFiles/opencv_core.dir/src/va_intel.cpp.o: 无法添加符号: 错误的值 collect2: error: ld returned 1 exit status modules/core/CMakeFiles/opencv_core.dir/build.make:1382: recipe for target 'lib/libopencv_core.so.3.1.0' failed make[2]: *** [lib/libopencv_core.so.3.1.0] Error 1 CMakeFiles/Makefile2:1420: recipe for target 'modules/core/CMakeFiles/opencv_core.dir/all' failed make[1]: *** [modules/core/CMakeFiles/opencv_core.dir/all] Error 2 Makefile:160: recipe for target 'all' failed make: *** [all] Error 2 ``` 有时候在33%进度的时候报这个错误,有时候就在15%时候报。我整整试了一整天,查遍了各种解决方法都无济于事。请大侠们帮忙解决下吧。跪谢。 是否有直接加载已经编译好的库的方式,可以快速实现配置,因为我急需要用Opencv实现代码。感谢各位大侠了。
在ubuntu上编译openjdk,出现以下错误,前后搜了两天,实在无法解决。
make[5]: *** [linux_amd64_compiler2/debug] Error 2 make[5]: Leaving directory '/home/zhang5788/jvm/openjdk/build/linux-amd64-debug/hotspot/outputdir' Makefile:191: recipe for target 'generic_build2' failed make[4]: *** [generic_build2] Error 2 make[4]: Leaving directory '/home/zhang5788/jvm/openjdk/hotspot/make' Makefile:151: recipe for target 'jvmg' failed make[3]: *** [jvmg] Error 2 make[3]: Leaving directory '/home/zhang5788/jvm/openjdk/hotspot/make' make/hotspot-rules.gmk:111: recipe for target 'hotspot-build' failed make[2]: *** [hotspot-build] Error 2 make[2]: Leaving directory '/home/zhang5788/jvm/openjdk' Makefile:262: recipe for target 'generic_debug_build' failed make[1]: *** [generic_debug_build] Error 2 make[1]: Leaving directory '/home/zhang5788/jvm/openjdk' Makefile:272: recipe for target 'build_debug_image' failed make: *** [build_debug_image] Error 2 [1]+ Done make sanity 环境是 ubuntu 16.04 openjdk7 oracle jdk 1.7jdk1.7.0_79
编译内核出现kernel/timeconst.pl line 373
我是用的fedora 23 64位系统 编译内核linux-2.6.38 出现如下错误: Can't use 'defined(@array)' (Maybe you should just omit the defined()?) at kernel/timeconst.pl line 373. /opt/ARM/mini6410/linux/linux-2.6.38/kernel/Makefile:140: recipe for target 'kernel/timeconst.h' failed make[1]: *** [kernel/timeconst.h] Error 255 Makefile:916: recipe for target 'kernel' failed make: *** [kernel] Error 2 请教如何解决?
linux C++ cmake编译通过,链接的时候出错
今天跑一个老师给的代码,安装了shark、boost和opencv,编译该通过了,但是链接的时候报错,错误如下: /usr/bin/ld: CMakeFiles/test.dir/classifier.cc.o: undefined reference to symbol 'cblas_dgemm' /usr/lib/atlas-base/atlas/libblas.so.3: error adding symbols: DSO missing from command line collect2: error: ld returned 1 exit status src/CMakeFiles/test.dir/build.make:302: recipe for target 'src/test' failed make[2]: *** [src/test] Error 1 CMakeFiles/Makefile2:85: recipe for target 'src/CMakeFiles/test.dir/all' failed make[1]: *** [src/CMakeFiles/test.dir/all] Error 2 Makefile:83: recipe for target 'all' failed make: *** [all] Error 2 百度谷歌了好久实在不知道怎么解决,请问有木有大神指导怎么解决= =
windows环境下codeblocks17.12 用cmake配置opencv3.4.7出现如下错误
试了好多次了,参考了不少博主的文章编译,还是有错 ``` F:/mingw64/bin/../lib/gcc/x86_64-w64-mingw32/7.3.0/../../../../x86_64-w64-mingw32/bin/ld.exe: i386 architecture of input file `CMakeFiles\opencv_core.dir/objects.a(vs_version.rc.obj)' is incompatible with i386:x86-64 output collect2.exe: error: ld returned 1 exit status modules\core\CMakeFiles\opencv_core.dir\build.make:1843: recipe for target 'bin/libopencv_core340.dll' failed mingw32-make[2]: *** [bin/libopencv_core340.dll] Error 1 CMakeFiles\Makefile2:1686: recipe for target 'modules/core/CMakeFiles/opencv_core.dir/all' failed mingw32-make[1]: *** [modules/core/CMakeFiles/opencv_core.dir/all] Error 2 Makefile:161: recipe for target 'all' failed mingw32-make: *** [all] Error 2 ```
爬虫福利二 之 妹子图网MM批量下载
爬虫福利一:27报网MM批量下载    点击 看了本文,相信大家对爬虫一定会产生强烈的兴趣,激励自己去学习爬虫,在这里提前祝:大家学有所成! 目标网站:妹子图网 环境:Python3.x 相关第三方模块:requests、beautifulsoup4 Re:各位在测试时只需要将代码里的变量 path 指定为你当前系统要保存的路径,使用 python xxx.py 或IDE运行即可。
Java学习的正确打开方式
在博主认为,对于入门级学习java的最佳学习方法莫过于视频+博客+书籍+总结,前三者博主将淋漓尽致地挥毫于这篇博客文章中,至于总结在于个人,实际上越到后面你会发现学习的最好方式就是阅读参考官方文档其次就是国内的书籍,博客次之,这又是一个层次了,这里暂时不提后面再谈。博主将为各位入门java保驾护航,各位只管冲鸭!!!上天是公平的,只要不辜负时间,时间自然不会辜负你。 何谓学习?博主所理解的学习,它
大学四年自学走来,这些私藏的实用工具/学习网站我贡献出来了
大学四年,看课本是不可能一直看课本的了,对于学习,特别是自学,善于搜索网上的一些资源来辅助,还是非常有必要的,下面我就把这几年私藏的各种资源,网站贡献出来给你们。主要有:电子书搜索、实用工具、在线视频学习网站、非视频学习网站、软件下载、面试/求职必备网站。 注意:文中提到的所有资源,文末我都给你整理好了,你们只管拿去,如果觉得不错,转发、分享就是最大的支持了。 一、电子书搜索 对于大部分程序员...
linux系列之常用运维命令整理笔录
本博客记录工作中需要的linux运维命令,大学时候开始接触linux,会一些基本操作,可是都没有整理起来,加上是做开发,不做运维,有些命令忘记了,所以现在整理成博客,当然vi,文件操作等就不介绍了,慢慢积累一些其它拓展的命令,博客不定时更新 顺便拉下票,我在参加csdn博客之星竞选,欢迎投票支持,每个QQ或者微信每天都可以投5票,扫二维码即可,http://m234140.nofollow.ax.
比特币原理详解
一、什么是比特币 比特币是一种电子货币,是一种基于密码学的货币,在2008年11月1日由中本聪发表比特币白皮书,文中提出了一种去中心化的电子记账系统,我们平时的电子现金是银行来记账,因为银行的背后是国家信用。去中心化电子记账系统是参与者共同记账。比特币可以防止主权危机、信用风险。其好处不多做赘述,这一层面介绍的文章很多,本文主要从更深层的技术原理角度进行介绍。 二、问题引入 假设现有4个人...
程序员接私活怎样防止做完了不给钱?
首先跟大家说明一点,我们做 IT 类的外包开发,是非标品开发,所以很有可能在开发过程中会有这样那样的需求修改,而这种需求修改很容易造成扯皮,进而影响到费用支付,甚至出现做完了项目收不到钱的情况。 那么,怎么保证自己的薪酬安全呢? 我们在开工前,一定要做好一些证据方面的准备(也就是“讨薪”的理论依据),这其中最重要的就是需求文档和验收标准。一定要让需求方提供这两个文档资料作为开发的基础。之后开发
网页实现一个简单的音乐播放器(大佬别看。(⊙﹏⊙))
今天闲着无事,就想写点东西。然后听了下歌,就打算写个播放器。 于是乎用h5 audio的加上js简单的播放器完工了。 欢迎 改进 留言。 演示地点跳到演示地点 html代码如下`<!DOCTYPE html> <html> <head> <title>music</title> <meta charset="utf-8"&gt
Python十大装B语法
Python 是一种代表简单思想的语言,其语法相对简单,很容易上手。不过,如果就此小视 Python 语法的精妙和深邃,那就大错特错了。本文精心筛选了最能展现 Python 语法之精妙的十个知识点,并附上详细的实例代码。如能在实战中融会贯通、灵活使用,必将使代码更为精炼、高效,同时也会极大提升代码B格,使之看上去更老练,读起来更优雅。 1. for - else 什么?不是 if 和 else 才
数据库优化 - SQL优化
前面一篇文章从实例的角度进行数据库优化,通过配置一些参数让数据库性能达到最优。但是一些“不好”的SQL也会导致数据库查询变慢,影响业务流程。本文从SQL角度进行数据库优化,提升SQL运行效率。 判断问题SQL 判断SQL是否有问题时可以通过两个表象进行判断: 系统级别表象 CPU消耗严重 IO等待严重 页面响应时间过长
2019年11月中国大陆编程语言排行榜
2019年11月2日,我统计了某招聘网站,获得有效程序员招聘数据9万条。针对招聘信息,提取编程语言关键字,并统计如下: 编程语言比例 rank pl_ percentage 1 java 33.62% 2 c/c++ 16.42% 3 c_sharp 12.82% 4 javascript 12.31% 5 python 7.93% 6 go 7.25% 7
通俗易懂地给女朋友讲:线程池的内部原理
餐厅的约会 餐盘在灯光的照耀下格外晶莹洁白,女朋友拿起红酒杯轻轻地抿了一小口,对我说:“经常听你说线程池,到底线程池到底是个什么原理?”我楞了一下,心里想女朋友今天是怎么了,怎么突然问出这么专业的问题,但做为一个专业人士在女朋友面前也不能露怯啊,想了一下便说:“我先给你讲讲我前同事老王的故事吧!” 大龄程序员老王 老王是一个已经北漂十多年的程序员,岁数大了,加班加不动了,升迁也无望,于是拿着手里
经典算法(5)杨辉三角
杨辉三角 是经典算法,这篇博客对它的算法思想进行了讲解,并有完整的代码实现。
腾讯算法面试题:64匹马8个跑道需要多少轮才能选出最快的四匹?
昨天,有网友私信我,说去阿里面试,彻底的被打击到了。问了为什么网上大量使用ThreadLocal的源码都会加上private static?他被难住了,因为他从来都没有考虑过这个问题。无独有偶,今天笔者又发现有网友吐槽了一道腾讯的面试题,我们一起来看看。 腾讯算法面试题:64匹马8个跑道需要多少轮才能选出最快的四匹? 在互联网职场论坛,一名程序员发帖求助到。二面腾讯,其中一个算法题:64匹
面试官:你连RESTful都不知道我怎么敢要你?
面试官:了解RESTful吗? 我:听说过。 面试官:那什么是RESTful? 我:就是用起来很规范,挺好的 面试官:是RESTful挺好的,还是自我感觉挺好的 我:都挺好的。 面试官:… 把门关上。 我:… 要干嘛?先关上再说。 面试官:我说出去把门关上。 我:what ?,夺门而去 文章目录01 前言02 RESTful的来源03 RESTful6大原则1. C-S架构2. 无状态3.统一的接
JDK12 Collectors.teeing 你真的需要了解一下
前言 在 Java 12 里面有个非常好用但在官方 JEP 没有公布的功能,因为它只是 Collector 中的一个小改动,它的作用是 merge 两个 collector 的结果,这句话显得很抽象,老规矩,我们先来看个图(这真是一个不和谐的图????): 管道改造经常会用这个小东西,通常我们叫它「三通」,它的主要作用就是将 downstream1 和 downstre...
为啥国人偏爱Mybatis,而老外喜欢Hibernate/JPA呢?
关于SQL和ORM的争论,永远都不会终止,我也一直在思考这个问题。昨天又跟群里的小伙伴进行了一番讨论,感触还是有一些,于是就有了今天这篇文。 声明:本文不会下关于Mybatis和JPA两个持久层框架哪个更好这样的结论。只是摆事实,讲道理,所以,请各位看官勿喷。 一、事件起因 关于Mybatis和JPA孰优孰劣的问题,争论已经很多年了。一直也没有结论,毕竟每个人的喜好和习惯是大不相同的。我也看
SQL-小白最佳入门sql查询一
不要偷偷的查询我的个人资料,即使你再喜欢我,也不要这样,真的不好;
项目中的if else太多了,该怎么重构?
介绍 最近跟着公司的大佬开发了一款IM系统,类似QQ和微信哈,就是聊天软件。我们有一部分业务逻辑是这样的 if (msgType = "文本") { // dosomething } else if(msgType = "图片") { // doshomething } else if(msgType = "视频") { // doshomething } else { // doshom...
【图解经典算法题】如何用一行代码解决约瑟夫环问题
约瑟夫环问题算是很经典的题了,估计大家都听说过,然后我就在一次笔试中遇到了,下面我就用 3 种方法来详细讲解一下这道题,最后一种方法学了之后保证让你可以让你装逼。 问题描述:编号为 1-N 的 N 个士兵围坐在一起形成一个圆圈,从编号为 1 的士兵开始依次报数(1,2,3…这样依次报),数到 m 的 士兵会被杀死出列,之后的士兵再从 1 开始报数。直到最后剩下一士兵,求这个士兵的编号。 1、方...
致 Python 初学者
欢迎来到“Python进阶”专栏!来到这里的每一位同学,应该大致上学习了很多 Python 的基础知识,正在努力成长的过程中。在此期间,一定遇到了很多的困惑,对未来的学习方向感到迷茫。我非常理解你们所面临的处境。我从2007年开始接触 python 这门编程语言,从2009年开始单一使用 python 应对所有的开发工作,直至今天。回顾自己的学习过程,也曾经遇到过无数的困难,也曾经迷茫过、困惑过。开办这个专栏,正是为了帮助像我当年一样困惑的 Python 初学者走出困境、快速成长。希望我的经验能真正帮到你
“狗屁不通文章生成器”登顶GitHub热榜,分分钟写出万字形式主义大作
一、垃圾文字生成器介绍 最近在浏览GitHub的时候,发现了这样一个骨骼清奇的雷人项目,而且热度还特别高。 项目中文名:狗屁不通文章生成器 项目英文名:BullshitGenerator 根据作者的介绍,他是偶尔需要一些中文文字用于GUI开发时测试文本渲染,因此开发了这个废话生成器。但由于生成的废话实在是太过富于哲理,所以最近已经被小伙伴们给玩坏了。 他的文风可能是这样的: 你发现,...
程序员:我终于知道post和get的区别
是一个老生常谈的话题,然而随着不断的学习,对于以前的认识有很多误区,所以还是需要不断地总结的,学而时习之,不亦说乎
GitHub标星近1万:只需5秒音源,这个网络就能实时“克隆”你的声音
作者 | Google团队 译者 | 凯隐 编辑 | Jane 出品 | AI科技大本营(ID:rgznai100) 本文中,Google 团队提出了一种文本语音合成(text to speech)神经系统,能通过少量样本学习到多个不同说话者(speaker)的语音特征,并合成他们的讲话音频。此外,对于训练时网络没有接触过的说话者,也能在不重新训练的情况下,仅通过未知...
《程序人生》系列-这个程序员只用了20行代码就拿了冠军
你知道的越多,你不知道的越多 点赞再看,养成习惯GitHub上已经开源https://github.com/JavaFamily,有一线大厂面试点脑图,欢迎Star和完善 前言 这一期不算《吊打面试官》系列的,所有没前言我直接开始。 絮叨 本来应该是没有这期的,看过我上期的小伙伴应该是知道的嘛,双十一比较忙嘛,要值班又要去帮忙拍摄年会的视频素材,还得搞个程序员一天的Vlog,还要写BU...
加快推动区块链技术和产业创新发展,2019可信区块链峰会在京召开
11月8日,由中国信息通信研究院、中国通信标准化协会、中国互联网协会、可信区块链推进计划联合主办,科技行者协办的2019可信区块链峰会将在北京悠唐皇冠假日酒店开幕。   区块链技术被认为是继蒸汽机、电力、互联网之后,下一代颠覆性的核心技术。如果说蒸汽机释放了人类的生产力,电力解决了人类基本的生活需求,互联网彻底改变了信息传递的方式,区块链作为构造信任的技术有重要的价值。   1...
程序员把地府后台管理系统做出来了,还有3.0版本!12月7号最新消息:已在开发中有github地址
第一幕:缘起 听说阎王爷要做个生死簿后台管理系统,我们派去了一个程序员…… 996程序员做的梦: 第一场:团队招募 为了应对地府管理危机,阎王打算找“人”开发一套地府后台管理系统,于是就在地府总经办群中发了项目需求。 话说还是中国电信的信号好,地府都是满格,哈哈!!! 经常会有外行朋友问:看某网站做的不错,功能也简单,你帮忙做一下? 而这次,面对这样的需求,这个程序员...
网易云6亿用户音乐推荐算法
网易云音乐是音乐爱好者的集聚地,云音乐推荐系统致力于通过 AI 算法的落地,实现用户千人千面的个性化推荐,为用户带来不一样的听歌体验。 本次分享重点介绍 AI 算法在音乐推荐中的应用实践,以及在算法落地过程中遇到的挑战和解决方案。 将从如下两个部分展开: AI算法在音乐推荐中的应用 音乐场景下的 AI 思考 从 2013 年 4 月正式上线至今,网易云音乐平台持续提供着:乐屏社区、UGC...
【技巧总结】位运算装逼指南
位算法的效率有多快我就不说,不信你可以去用 10 亿个数据模拟一下,今天给大家讲一讲位运算的一些经典例子。不过,最重要的不是看懂了这些例子就好,而是要在以后多去运用位运算这些技巧,当然,采用位运算,也是可以装逼的,不信,你往下看。我会从最简单的讲起,一道比一道难度递增,不过居然是讲技巧,那么也不会太难,相信你分分钟看懂。 判断奇偶数 判断一个数是基于还是偶数,相信很多人都做过,一般的做法的代码如下...
【管理系统课程设计】美少女手把手教你后台管理
【文章后台管理系统】URL设计与建模分析+项目源码+运行界面 栏目管理、文章列表、用户管理、角色管理、权限管理模块(文章最后附有源码) 1. 这是一个什么系统? 1.1 学习后台管理系统的原因 随着时代的变迁,现如今各大云服务平台横空出世,市面上有许多如学生信息系统、图书阅读系统、停车场管理系统等的管理系统,而本人家里就有人在用烟草销售系统,直接在网上完成挑选、购买与提交收货点,方便又快捷。 试想,若没有烟草销售系统,本人家人想要购买烟草,还要独自前往药...
4G EPS 第四代移动通信系统
目录 文章目录目录4G 与 LTE/EPCLTE/EPC 的架构E-UTRANE-UTRAN 协议栈eNodeBEPCMMES-GWP-GWHSSLTE/EPC 协议栈概览 4G 与 LTE/EPC 4G,即第四代移动通信系统,提供了 3G 不能满足的无线网络宽带化,主要提供数据(上网)业务。而 LTE(Long Term Evolution,长期演进技术)是电信领域用于手机及数据终端的高速无线通...
相关热词 c# 输入ip c# 乱码 报表 c#选择结构应用基本算法 c# 收到udp包后回包 c#oracle 头文件 c# 序列化对象 自定义 c# tcp 心跳 c# ice连接服务端 c# md5 解密 c# 文字导航控件
立即提问