android studio升级到3.4,gradle更新到5.1.1出现Could not get unknown property 'bootClasspath'....

把studio升级到3.4 gradle更新到5.1.1。在编译时出现:
Could not get unknown property 'bootClasspath' for object of type org.gradle.api.tasks.compile.CompileOptions 的提示,从没遇到这样的问题,网上也很少有解决的方法,没有有大神知道该怎么处理?

2个回答

The CompileOptions.bootClasspath property has been removed — use CompileOptions.bootstrapClasspath instead.

#Tinker版本号
TINKER_VERSION=1.9.2
升级之后问题解决

Csdn user default icon
上传中...
上传图片
插入图片
抄袭、复制答案,以达到刷声望分或其他目的的行为,在CSDN问答是严格禁止的,一经发现立刻封号。是时候展现真正的技术了!
其他相关推荐
Android Studio2.3.3gradle Failed to resolve
![图片说明](https://img-ask.csdn.net/upload/201707/26/1501055102_678890.png) 按照步骤安装了Studio 创建一个新项目就报错了,第三方以来导入不了,试过各种 maven镜像都不行
Android studio加载项目出现Could not find com.android.tools.build:gradle:4.10.1
Android studio加载项目出现Could not find com.android.tools.build:gradle:4.10.1 ![图片说明](https://img-ask.csdn.net/upload/201911/05/1572944856_31543.jpg) 实在是不知道怎么解决了,这个问题已经困扰我好久了,哪位大神可以帮忙解决一下,万分感谢。 repositories中的代码库是jcenter{ url'http://jcenter.bintray.com'},已经把项目build.gradle,将其中的classpath 'com.android.tools.build:gradle:4.10.1'改为classpath 'com.android.tools.build:gradle:2.3.2'了,但是还是报错 ![图片说明](https://img-ask.csdn.net/upload/201911/06/1573034916_778380.png) 用浏览器打开代码库地址,可以找到2.3.2版本信息,但是地址会自动变为https ![图片说明](https://img-ask.csdn.net/upload/201911/06/1573035170_400923.png) 将代码库的地址改为https以后,又会报别的错 ![图片说明](https://img-ask.csdn.net/upload/201911/06/1573035255_577090.png)
关于Android studio 3.5的找不到gradle插件版本问题
## 本人萌新,最近导入了别人的一个安卓项目准备参考,鉴于的该项目第三方依赖包较多,然后就在build.gradle中添加了阿里云的镜像网址。 于是我就发现了个问题贴图。 ![图片说明](https://img-ask.csdn.net/upload/202002/03/1580740569_363940.png) 可以看出他说阿里的那个仓库中没有这个插件,我就纳闷然后我去阿里仓库中找了一下。这是有的啊,怎么会找不到啊。 ![图片说明](https://img-ask.csdn.net/upload/202002/03/1580740727_482551.png) 我查阅了诸多资料,第一条就是在build.gradle中加上google(),加上去的确编译成功了,可是下载第三方依赖包的速度依然是惨不忍睹,有的人说用已有的gradle插件,具体在C:\Program Files\Android\Android Studio\gradle\m2repository\com\android\tools\build\gradle 可是我在C:\Program Files\Android\Android Studio\下根本没有发现gradle文件夹呀![图片说明](https://img-ask.csdn.net/upload/202002/03/1580741004_135416.png) 希望有大牛能帮我解决!!已经困扰我三天了!!
Android Studio 3.5.2 / 3.5.3 cocos2d-x 3.17.2 android编译问题
先上环境 Java:Java1.8.60 SDK:API -> android-28 Tools -> 26.1.1 NDK:android-ndk-r16b cocos官方说是以android-ndk-r16b测试的,所以我用了这个 ANT:1.10.7 Python:2.7.9 Android studio :3.5.3 cocos2d-x:cocos2d-x 3.17.2 好吧,就这些了,首先我用cocos new创建项目 用Android studio 3.5.3 打开项目,OK,测试成功!如图 <br><br> ![图片说明](https://img-ask.csdn.net/upload/201912/13/1576218933_195606.png) <br><br> 能编译成功中途也遇到了各种坑,先不说这个,再说一说后续开发的问题 比如:<br><br> ![图片说明](https://img-ask.csdn.net/upload/201912/13/1576219089_983324.png) <br><br> 上图就是我自己重新创建了一个MainScene的场景,在HelloWorldScene.cpp中引用这个类,并实例化,如图:<br><br> ![图片说明](https://img-ask.csdn.net/upload/201912/13/1576219341_669768.png) <br><br> 在HelloWorldScene::init()中创建一个sc的MainScene指针 <br><br> ![图片说明](https://img-ask.csdn.net/upload/201912/13/1576219348_260859.png) <br><br> 以上代码在VS2015 编译通过,或者创建一个按钮点击事件中创建MainScene场景,并replaceScene函数替换当前场景,VS编译没有问题,但android studio提示MsinScene::createScene()未定义!!! <br><br> ![图片说明](https://img-ask.csdn.net/upload/201912/13/1576219705_649754.png) <br><br> 说到这里,肯定有人会说,你应该是Android.mk没有包含cpp文件吧?<br><br> ![图片说明](https://img-ask.csdn.net/upload/201912/13/1576219788_453715.png) <br><br> 到底是哪里出了错误,为什么要这样对我啊 我在MainScene文件中定义其他的类或者继承类却能通过,如下:<br><br> ![图片说明](https://img-ask.csdn.net/upload/201912/13/1576220195_583121.png)![图片说明](https://img-ask.csdn.net/upload/201912/13/1576220201_747295.png)![图片说明](https://img-ask.csdn.net/upload/201912/13/1576220208_452735.png) <br><br> ![图片说明](https://img-ask.csdn.net/upload/201912/13/1576220308_238647.png) <br><br> 为什么会这样? 定义其他类都没有问题,Scene就搞不了事情了,救命~~啊 <br><br><br> 我自己搞定了,编译发现gradle.properties 中的编译模式是Cmake,并不是NDK-Build模式,如下:<br> PROP_BUILD_TYPE=cmake<br> 所以Android.mk文件包含ccp是没有用的,只能在项目根目录的CMakeLists.txt文件里包含cpp文件就可以了,如下图:<br><br> ![图片说明](https://img-ask.csdn.net/upload/201912/13/1576229813_129581.png) <br><br>纠结好久的问题终于解决了,希望能帮到别人<br> 我用的工具是:<br> android studio 3.5.3<br> cocos2d-x 3.17.2<br> NDK r16b<br> SDK API 28 <br> SDK build tools 26.1.1<br> apache ant 1.10.7 <br> python 2.7.9<br> java jdk1.8.0_91<br> Visual studio 2015 社区版<br>
升级android gradle 版本到3.5后打包报错 com.android.tools.r8.CompilationFailedException: Compilation failed to complete
升级android gradle 版本到3.5后打包报错,编译是没问题的 但是打签名包时报错,有没有遇到这个问题的大佬麻烦指点一下 ![图片说明](https://img-ask.csdn.net/upload/201910/07/1570462599_316228.jpg)
Error:Could not find com.android.tools.build:gradle-core:2.3.3. Searched in the following locations:
新导入项目报这个错误: Error:Could not find com.android.tools.build:gradle-core:2.3.3. Searched in the following locations: https://repo1.maven.org/maven2/com/android/tools/build/gradle-core/2.3.3/gradle-core-2.3.3.pom https://repo1.maven.org/maven2/com/android/tools/build/gradle-core/2.3.3/gradle-core-2.3.3.jar Required by: project :library > com.android.tools.build:gradle:2.3.3。 图片: ![图片说明](https://img-ask.csdn.net/upload/201908/30/1567134273_698972.png) ![图片说明](https://img-ask.csdn.net/upload/201908/30/1567134287_697402.png)
android studio怎么在build.gradle的脚本中使用自带的task
在接入一个开源项目fat-aar时,由于这个项目长时间没有人维护, 使用的android gradle插件版本太低,有一些语法发生变化,同时有的自带任务 也消失了。想要在gradle的groovy脚本内饮用android studio右侧gradle窗口中的 assembleDebug任务 ```Groovy task hello { doLast{ println "hello" } } hello.dependsOn assembleDebug ``` ![图片说明](https://img-ask.csdn.net/upload/201906/30/1561862613_357584.png) 却提示 ```Groovy Could not get unknown property 'validateSigningDebug' for project ':app' of type org.gradle.api.Project ``` 但是assemble任务就可以 ``` task hello { doLast{ println "hello" } } hello.dependsOn assemble ``` ![图片说明](https://img-ask.csdn.net/upload/201906/30/1561862666_889293.png) 另外,我执行```./gradlew tasks --all```是能够看到所有列出来的自带任务的。我怎么才能在脚本中使用这些自带的变量呢? PS: ``` tasks.findByName("assembleDebug") tasks.findByName("app:assembleDebug") tasks.getByPath("apop:validateSigningDebug") tasks.getByName("validateSigningDebug") ``` 这些接口都试过了,得到的都是null,打印tasks中的所有task,也没有assembleDebug和other目录下面的其他task。 求助~~~不胜感激
Android Studio Gradle project sync failed,Configure project:app 前出现红叹号
Android Studio Gradle project sync failed,Configure project:app 前出现红叹号 ![图片说明](https://img-ask.csdn.net/upload/201905/13/1557746272_155433.jpg) 提示为 ``` org.gradle.api.ProjectConfigurationException: A problem occurred configuring project ':app' at java.util.concurrent.ThreadPoolExecutor.runWorker(ThreadPoolExecutor.java:1142) at java.util.concurrent.ThreadPoolExecutor$Worker.run(ThreadPoolExecutor.java:617) at org.gradle.internal.concurrent.ThreadFactoryImpl$ManagedThreadRunnable.run(ThreadFactoryImpl.java:55) at java.lang.Thread.run(Thread.java:745) Caused by: com.android.builder.errors.EvalIssueException: Failed to install the following Android SDK packages as some licences have not been accepted. build-tools;28.0.2 Android SDK Build-Tools 28.0.2 To build this project, accept the SDK license agreements and install the missing components using the Android Studio SDK Manager. Alternatively, to transfer the license agreements from one workstation to another, see http://d.android.com/r/studio-ui/export-licenses.html Using Android SDK: D:\Android\SDK at com.android.build.gradle.internal.SdkHandler.initTarget(SdkHandler.java:194) at com.android.build.gradle.BasePlugin.ensureTargetSetup(BasePlugin.java:980) at com.android.build.gradle.BasePlugin.createAndroidTasks(BasePlugin.java:752) at com.android.build.gradle.BasePlugin.lambda$null$4(BasePlugin.java:690) at com.android.builder.profile.ThreadRecorder.record(ThreadRecorder.java:81) at com.android.build.gradle.BasePlugin.lambda$createTasks$5(BasePlugin.java:686) at org.gradle.internal.event.BroadcastDispatch$ActionInvocationHandler.dispatch(BroadcastDispatch.java:91) at org.gradle.internal.event.BroadcastDispatch$ActionInvocationHandler.dispatch(BroadcastDispatch.java:80) at org.gradle.internal.event.AbstractBroadcastDispatch.dispatch(AbstractBroadcastDispatch.java:42) at org.gradle.internal.event.BroadcastDispatch$SingletonDispatch.dispatch(BroadcastDispatch.java:230) at org.gradle.internal.event.BroadcastDispatch$SingletonDispatch.dispatch(BroadcastDispatch.java:149) at org.gradle.internal.event.AbstractBroadcastDispatch.dispatch(AbstractBroadcastDispatch.java:58) at org.gradle.internal.event.BroadcastDispatch$CompositeDispatch.dispatch(BroadcastDispatch.java:324) at org.gradle.internal.event.BroadcastDispatch$CompositeDispatch.dispatch(BroadcastDispatch.java:234) at org.gradle.internal.event.ListenerBroadcast.dispatch(ListenerBroadcast.java:140) at org.gradle.internal.event.ListenerBroadcast.dispatch(ListenerBroadcast.java:37) at org.gradle.internal.dispatch.ProxyDispatchAdapter$DispatchingInvocationHandler.invoke(ProxyDispatchAdapter.java:93) at com.sun.proxy.$Proxy27.afterEvaluate(Unknown Source) at org.gradle.configuration.project.LifecycleProjectEvaluator.notifyAfterEvaluate(LifecycleProjectEvaluator.java:76) ... 85 more ```
Android studio 3.1.3 初始化项目 build 失败问题
本机环境:mac 10.12.6 . Android Studio 3.1.3 代理已测试可连结youtube.com ![图片说明](https://img-ask.csdn.net/upload/201807/07/1530931982_394881.png) build.gradle ``` apply plugin: 'com.android.application' android { compileSdkVersion 28 defaultConfig { applicationId "com.example.hubs.ok" minSdkVersion 19 targetSdkVersion 28 versionCode 1 versionName "1.0" testInstrumentationRunner "android.support.test.runner.AndroidJUnitRunner" } buildTypes { release { minifyEnabled false proguardFiles getDefaultProguardFile('proguard-android.txt'), 'proguard-rules.pro' } } buildToolsVersion '28.0.1' compileOptions { sourceCompatibility JavaVersion.VERSION_1_8 targetCompatibility JavaVersion.VERSION_1_8 } } dependencies { implementation fileTree(include: ['*.jar'], dir: 'libs') implementation 'com.android.support:appcompat-v7:28.0.0-alpha3' implementation 'com.android.support.constraint:constraint-layout:1.1.2' testImplementation 'junit:junit:4.12' androidTestImplementation 'com.android.support.test:runner:1.0.2' androidTestImplementation 'com.android.support.test.espresso:espresso-core:3.0.2' } ``` 点击编译时一直卡在Download .... ![图片说明](https://img-ask.csdn.net/upload/201807/07/1530932031_62049.png) 命令行里gradlew build 也一直卡在这 ![图片说明](https://img-ask.csdn.net/upload/201807/07/1530932050_488694.png) 本地curl -i 是可以访问链接的 ![图片说明](https://img-ask.csdn.net/upload/201807/07/1530932079_448161.png) 到底是什么原因呢...崩溃了....哪些同学遇到过这个情况?谢谢。
Android studio打包的APK不能在Android5.1上安装
可以连接真机测试,但是打包出来的APK不能在真机上安装,请问会是哪方面的影响? Android studio 升级到最新版本,打包出来的APK不能在Android5.1上运行 下面是对应的gradle和build对应的内容 ``` apply plugin: 'com.android.application' android { compileSdkVersion 25 buildToolsVersion "27.0.3" ``` ``` distributionBase=GRADLE_USER_HOME distributionPath=wrapper/dists zipStoreBase=GRADLE_USER_HOME zipStorePath=wrapper/dists distributionUrl=https\://services.gradle.org/distributions/gradle-4.4-all.zip ``` ``` buildscript { repositories { google() jcenter() } dependencies { classpath 'com.android.tools.build:gradle:3.1.2' // NOTE: Do not place your application dependencies here; they belong // in the individual module build.gradle files } } ``` ``` <?xml version="1.0" encoding="utf-8"?> <manifest xmlns:android="http://schemas.android.com/apk/res/android" package="com.example.demo" android:versionCode="1" android:versionName="1.1"> <uses-sdk android:minSdkVersion="20" android:targetSdkVersion="25" /> ```
android studio 5.0以下编译不成功
android studio classpath 'com.android.tools.build:gradle:2.0.0' 这能编译成功5.0以上的,以下的都编译不成功 bulid。gradle: compileSdkVersion 23 buildToolsVersion "23.0.1" defaultConfig { minSdkVersion 14 targetSdkVersion 23 versionCode 1 versionName "1" } 如果将.build:gradle:2.0.0 改成1.2.3的话连5.0都编译不成功了 编译失败的原因是导包重复 Error:Execution failed for task ':app:transformClassesWithDexForDebug'. > com.android.build.api.transform.TransformException: com.android.ide.common.process.ProcessException: java.util.concurrent.ExecutionException: com.android.ide.common.process.ProcessException: org.gradle.process.internal.ExecException: Process 'command 'D:\Program Files\Java\jdk1.7\bin\java.exe'' finished with non-zero exit value 2 跪求大牛帮忙解答。。。
AS升级到3.0.1 项目里Databinding报错
* Exception is: org.gradle.execution.TaskSelectionException: Task 'compileDebug' is ambiguous in root project 'cashloan-android'. Candidates are: 'compileDebugAidl', 'compileDebugAndroidTestAidl', 'compileDebugAndroidTestJavaWithJavac', 'compileDebugAndroidTestNdk', 'compileDebugAndroidTestRenderscript', 'compileDebugAndroidTestShaders', 'compileDebugAndroidTestSources', 'compileDebugJavaWithJavac', 'compileDebugNdk', 'compileDebugRenderscript', 'compileDebugShaders', 'compileDebugSources', 'compileDebugUnitTestJavaWithJavac', 'compileDebugUnitTestSources'. at org.gradle.execution.TaskSelector.getSelection(TaskSelector.java:116) at org.gradle.execution.TaskSelector.getSelection(TaskSelector.java:81) at org.gradle.execution.commandline.CommandLineTaskParser.parseTasks(CommandLineTaskParser.java:42) at org.gradle.execution.TaskNameResolvingBuildConfigurationAction.configure(TaskNameResolvingBuildConfigurationAction.java:44) at org.gradle.execution.DefaultBuildConfigurationActionExecuter.configure(DefaultBuildConfigurationActionExecuter.java:48) at org.gradle.execution.DefaultBuildConfigurationActionExecuter.access$000(DefaultBuildConfigurationActionExecuter.java:25) at org.gradle.execution.DefaultBuildConfigurationActionExecuter$1.proceed(DefaultBuildConfigurationActionExecuter.java:54) at org.gradle.execution.DefaultTasksBuildExecutionAction.configure(DefaultTasksBuildExecutionAction.java:44) at org.gradle.execution.DefaultBuildConfigurationActionExecuter.configure(DefaultBuildConfigurationActionExecuter.java:48) at org.gradle.execution.DefaultBuildConfigurationActionExecuter.access$000(DefaultBuildConfigurationActionExecuter.java:25) at org.gradle.execution.DefaultBuildConfigurationActionExecuter$1.proceed(DefaultBuildConfigurationActionExecuter.java:54) at org.gradle.execution.ExcludedTaskFilteringBuildConfigurationAction.configure(ExcludedTaskFilteringBuildConfigurationAction.java:47) at org.gradle.execution.DefaultBuildConfigurationActionExecuter.configure(DefaultBuildConfigurationActionExecuter.java:48) at org.gradle.execution.DefaultBuildConfigurationActionExecuter.select(DefaultBuildConfigurationActionExecuter.java:36) at org.gradle.initialization.DefaultGradleLauncher$CalculateTaskGraph.run(DefaultGradleLauncher.java:265) at org.gradle.internal.progress.DefaultBuildOperationExecutor$RunnableBuildOperationWorker.execute(DefaultBuildOperationExecutor.java:336) at org.gradle.internal.progress.DefaultBuildOperationExecutor$RunnableBuildOperationWorker.execute(DefaultBuildOperationExecutor.java:328) at org.gradle.internal.progress.DefaultBuildOperationExecutor.execute(DefaultBuildOperationExecutor.java:197) at org.gradle.internal.progress.DefaultBuildOperationExecutor.run(DefaultBuildOperationExecutor.java:107) at org.gradle.initialization.DefaultGradleLauncher.constructTaskGraph(DefaultGradleLauncher.java:173) at org.gradle.initialization.DefaultGradleLauncher.doBuildStages(DefaultGradleLauncher.java:128) at org.gradle.initialization.DefaultGradleLauncher.executeTasks(DefaultGradleLauncher.java:107) at org.gradle.internal.invocation.GradleBuildController$1.call(GradleBuildController.java:78) at org.gradle.internal.invocation.GradleBuildController$1.call(GradleBuildController.java:75) at org.gradle.internal.work.DefaultWorkerLeaseService.withLocks(DefaultWorkerLeaseService.java:152) at org.gradle.internal.invocation.GradleBuildController.doBuild(GradleBuildController.java:100) at org.gradle.internal.invocation.GradleBuildController.run(GradleBuildController.java:75) at org.gradle.tooling.internal.provider.ExecuteBuildActionRunner.run(ExecuteBuildActionRunner.java:28) at org.gradle.launcher.exec.ChainingBuildActionRunner.run(ChainingBuildActionRunner.java:35) at org.gradle.tooling.internal.provider.ValidatingBuildActionRunner.run(ValidatingBuildActionRunner.java:32) at org.gradle.launcher.exec.RunAsBuildOperationBuildActionRunner$1.run(RunAsBuildOperationBuildActionRunner.java:43) at org.gradle.internal.progress.DefaultBuildOperationExecutor$RunnableBuildOperationWorker.execute(DefaultBuildOperationExecutor.java:336) at org.gradle.internal.progress.DefaultBuildOperationExecutor$RunnableBuildOperationWorker.execute(DefaultBuildOperationExecutor.java:328) at org.gradle.internal.progress.DefaultBuildOperationExecutor.execute(DefaultBuildOperationExecutor.java:197) at org.gradle.internal.progress.DefaultBuildOperationExecutor.run(DefaultBuildOperationExecutor.java:107) at org.gradle.launcher.exec.RunAsBuildOperationBuildActionRunner.run(RunAsBuildOperationBuildActionRunner.java:40) at org.gradle.tooling.internal.provider.SubscribableBuildActionRunner.run(SubscribableBuildActionRunner.java:51) at org.gradle.launcher.exec.InProcessBuildActionExecuter.execute(InProcessBuildActionExecuter.java:45) at org.gradle.launcher.exec.InProcessBuildActionExecuter.execute(InProcessBuildActionExecuter.java:29) at org.gradle.launcher.exec.BuildTreeScopeBuildActionExecuter.execute(BuildTreeScopeBuildActionExecuter.java:39) at org.gradle.launcher.exec.BuildTreeScopeBuildActionExecuter.execute(BuildTreeScopeBuildActionExecuter.java:25) at org.gradle.tooling.internal.provider.ContinuousBuildActionExecuter.execute(ContinuousBuildActionExecuter.java:71) at org.gradle.tooling.internal.provider.ContinuousBuildActionExecuter.execute(ContinuousBuildActionExecuter.java:45) at org.gradle.tooling.internal.provider.ServicesSetupBuildActionExecuter.execute(ServicesSetupBuildActionExecuter.java:51) at org.gradle.tooling.internal.provider.ServicesSetupBuildActionExecuter.execute(ServicesSetupBuildActionExecuter.java:32) at org.gradle.tooling.internal.provider.GradleThreadBuildActionExecuter.execute(GradleThreadBuildActionExecuter.java:36) at org.gradle.tooling.internal.provider.GradleThreadBuildActionExecuter.execute(GradleThreadBuildActionExecuter.java:25) at org.gradle.tooling.internal.provider.ParallelismConfigurationBuildActionExecuter.execute(ParallelismConfigurationBuildActionExecuter.java:43) at org.gradle.tooling.internal.provider.ParallelismConfigurationBuildActionExecuter.execute(ParallelismConfigurationBuildActionExecuter.java:29) at org.gradle.tooling.internal.provider.StartParamsValidatingActionExecuter.execute(StartParamsValidatingActionExecuter.java:64) at org.gradle.tooling.internal.provider.StartParamsValidatingActionExecuter.execute(StartParamsValidatingActionExecuter.java:29) at org.gradle.tooling.internal.provider.SessionFailureReportingActionExecuter.execute(SessionFailureReportingActionExecuter.java:55) at org.gradle.tooling.internal.provider.SessionFailureReportingActionExecuter.execute(SessionFailureReportingActionExecuter.java:42) at org.gradle.tooling.internal.provider.SetupLoggingActionExecuter.execute(SetupLoggingActionExecuter.java:58) at org.gradle.tooling.internal.provider.SetupLoggingActionExecuter.execute(SetupLoggingActionExecuter.java:33) at org.gradle.launcher.daemon.server.exec.ExecuteBuild.doBuild(ExecuteBuild.java:67) at org.gradle.launcher.daemon.server.exec.BuildCommandOnly.execute(BuildCommandOnly.java:36) at org.gradle.launcher.daemon.server.api.DaemonCommandExecution.proceed(DaemonCommandExecution.java:120) at org.gradle.launcher.daemon.server.exec.WatchForDisconnection.execute(WatchForDisconnection.java:37) at org.gradle.launcher.daemon.server.api.DaemonCommandExecution.proceed(DaemonCommandExecution.java:120) at org.gradle.launcher.daemon.server.exec.ResetDeprecationLogger.execute(ResetDeprecationLogger.java:26) at org.gradle.launcher.daemon.server.api.DaemonCommandExecution.proceed(DaemonCommandExecution.java:120) at org.gradle.launcher.daemon.server.exec.RequestStopIfSingleUsedDaemon.execute(RequestStopIfSingleUsedDaemon.java:34) at org.gradle.launcher.daemon.server.api.DaemonCommandExecution.proceed(DaemonCommandExecution.java:120) at org.gradle.launcher.daemon.server.exec.ForwardClientInput$2.call(ForwardClientInput.java:74) at org.gradle.launcher.daemon.server.exec.ForwardClientInput$2.call(ForwardClientInput.java:72) at org.gradle.util.Swapper.swap(Swapper.java:38) at org.gradle.launcher.daemon.server.exec.ForwardClientInput.execute(ForwardClientInput.java:72) at org.gradle.launcher.daemon.server.api.DaemonCommandExecution.proceed(DaemonCommandExecution.java:120) at org.gradle.launcher.daemon.server.exec.LogAndCheckHealth.execute(LogAndCheckHealth.java:55) at org.gradle.launcher.daemon.server.api.DaemonCommandExecution.proceed(DaemonCommandExecution.java:120) at org.gradle.launcher.daemon.server.exec.LogToClient.doBuild(LogToClient.java:62) at org.gradle.launcher.daemon.server.exec.BuildCommandOnly.execute(BuildCommandOnly.java:36) at org.gradle.launcher.daemon.server.api.DaemonCommandExecution.proceed(DaemonCommandExecution.java:120) at org.gradle.launcher.daemon.server.exec.EstablishBuildEnvironment.doBuild(EstablishBuildEnvironment.java:82) at org.gradle.launcher.daemon.server.exec.BuildCommandOnly.execute(BuildCommandOnly.java:36) at org.gradle.launcher.daemon.server.api.DaemonCommandExecution.proceed(DaemonCommandExecution.java:120) at org.gradle.launcher.daemon.server.exec.StartBuildOrRespondWithBusy$1.run(StartBuildOrRespondWithBusy.java:50) at org.gradle.launcher.daemon.server.DaemonStateCoordinator$1.run(DaemonStateCoordinator.java:297) at org.gradle.internal.concurrent.ExecutorPolicy$CatchAndRecordFailures.onExecute(ExecutorPolicy.java:63) at org.gradle.internal.concurrent.ManagedExecutorImpl$1.run(ManagedExecutorImpl.java:46) at org.gradle.internal.concurrent.ThreadFactoryImpl$ManagedThreadRunnable.run(ThreadFactoryImpl.java:55) ![图片说明](https://img-ask.csdn.net/upload/201908/07/1565167925_925733.png) ![图片说明](https://img-ask.csdn.net/upload/201908/07/1565167518_141331.png) ![图片说明](https://img-ask.csdn.net/upload/201908/07/1565167553_712451.png) 各位 大神 帮帮忙
Android Studio 2.1 gradle 2.10报错
Configuration on demand is an incubating feature. Incremental java compilation is an incubating feature. :app:preBuild UP-TO-DATE :app:preDebugBuild UP-TO-DATE :app:checkDebugManifest :app:preReleaseBuild UP-TO-DATE :app:prepareComAndroidSupportAnimatedVectorDrawable2330Library UP-TO-DATE :app:prepareComAndroidSupportAppcompatV72330Library UP-TO-DATE :app:prepareComAndroidSupportSupportV42330Library UP-TO-DATE :app:prepareComAndroidSupportSupportVectorDrawable2330Library UP-TO-DATE :app:prepareDebugDependencies :app:compileDebugAidl UP-TO-DATE :app:compileDebugRenderscript UP-TO-DATE :app:generateDebugBuildConfig UP-TO-DATE :app:mergeDebugShaders UP-TO-DATE :app:compileDebugShaders UP-TO-DATE :app:generateDebugAssets UP-TO-DATE :app:mergeDebugAssets UP-TO-DATE :app:generateDebugResValues UP-TO-DATE :app:generateDebugResources UP-TO-DATE :app:mergeDebugResources UP-TO-DATE :app:processDebugManifest :app:processDebugResources :app:generateDebugSources :app:preDebugAndroidTestBuild UP-TO-DATE :app:prepareDebugAndroidTestDependencies :app:compileDebugAndroidTestAidl UP-TO-DATE :app:processDebugAndroidTestManifest UP-TO-DATE :app:compileDebugAndroidTestRenderscript UP-TO-DATE :app:generateDebugAndroidTestBuildConfig UP-TO-DATE :app:mergeDebugAndroidTestShaders UP-TO-DATE :app:compileDebugAndroidTestShaders UP-TO-DATE :app:generateDebugAndroidTestAssets UP-TO-DATE :app:mergeDebugAndroidTestAssets UP-TO-DATE :app:generateDebugAndroidTestResValues UP-TO-DATE :app:generateDebugAndroidTestResources UP-TO-DATE :app:mergeDebugAndroidTestResources UP-TO-DATE :app:processDebugAndroidTestResources UP-TO-DATE :app:generateDebugAndroidTestSources UP-TO-DATE :app:mockableAndroidJar UP-TO-DATE :app:preDebugUnitTestBuild UP-TO-DATE 求大神帮帮忙。。。。
Android studio3.4.4 修改完项目之后必须rebuild project编译之后运行才会有效果
Instant Run 我已经关掉了. app的build.gradle里面的sourceSets设置我也看了没问题。 请问可能是什么原因
Android Studio升到2.3后出现问题
Error:Server sent an unsupported extension: type_35 Error:A problem occurred configuring root project 'vsapp2-1'. > Could not resolve all dependencies for configuration ':classpath'. > Could not resolve org.greenrobot:greendao-gradle-plugin:3.2.0. Required by: project : > Could not resolve org.greenrobot:greendao-gradle-plugin:3.2.0. > Could not get resource 'https://jcenter.bintray.com/org/greenrobot/greendao-gradle-plugin/3.2.0/greendao-gradle-plugin-3.2.0.pom'. > Could not HEAD 'https://jcenter.bintray.com/org/greenrobot/greendao-gradle-plugin/3.2.0/greendao-gradle-plugin-3.2.0.pom'. > Server sent an unsupported extension: type_35 > Could not resolve com.tencent.bugly:tinker-support:1.0.8. Required by: project : > Could not resolve com.tencent.bugly:tinker-support:1.0.8. > Could not get resource 'https://jcenter.bintray.com/com/tencent/bugly/tinker-support/1.0.8/tinker-support-1.0.8.pom'. > Could not HEAD 'https://jcenter.bintray.com/com/tencent/bugly/tinker-support/1.0.8/tinker-support-1.0.8.pom'. > Server sent an unsupported extension: type_35
android studio编译项目时遇到这个问题。
Caused by: java.lang.NoClassDefFoundError: Could not initialize class com.google.wireless.android.sdk.stats.AndroidStudioStats$GradleBuildProfile at com.android.builder.profile.ProcessRecorder.<init>(ProcessRecorder.java:96) at com.android.builder.profile.ProcessRecorderFactory.get(ProcessRecorderFactory.java:222) at com.android.builder.profile.ProcessRecorderFactory.initialize(ProcessRecorderFactory.java:122) at com.android.build.gradle.internal.profile.ProfilerInitializer.init(ProfilerInitializer.java:66) at com.android.build.gradle.BasePlugin.apply(BasePlugin.java:310) at com.android.build.gradle.LibraryPlugin.apply(LibraryPlugin.java:85) at com.android.build.gradle.LibraryPlugin.apply(LibraryPlugin.java:40) at org.gradle.api.internal.plugins.ImperativeOnlyPluginApplicator.applyImperative(ImperativeOnlyPluginApplicator.java:35) at org.gradle.api.internal.plugins.RuleBasedPluginApplicator.applyImperative(RuleBasedPluginApplicator.java:43) at org.gradle.api.internal.plugins.DefaultPluginManager.doApply(DefaultPluginManager.java:139) at org.gradle.api.internal.plugins.DefaultPluginManager.apply(DefaultPluginManager.java:112) at org.gradle.api.internal.plugins.DefaultObjectConfigurationAction.applyType(DefaultObjectConfigurationAction.java:113) at org.gradle.api.internal.plugins.DefaultObjectConfigurationAction.access$200(DefaultObjectConfigurationAction.java:36) at org.gradle.api.internal.plugins.DefaultObjectConfigurationAction$3.run(DefaultObjectConfigurationAction.java:80) at org.gradle.api.internal.plugins.DefaultObjectConfigurationAction.execute(DefaultObjectConfigurationAction.java:136) at org.gradle.api.internal.project.AbstractPluginAware.apply(AbstractPluginAware.java:44) at org.gradle.api.internal.project.ProjectScript.apply(ProjectScript.java:34) at org.gradle.api.Script$apply$0.callCurrent(Unknown Source) at build_1ztzbib3h4rketyrpodndoubp.run(F:\yjyl_android_studio_work_space\teacher_svn\pIMlibs\build.gradle:1) at org.gradle.groovy.scripts.internal.DefaultScriptRunnerFactory$ScriptRunnerImpl.run(DefaultScriptRunnerFactory.java:90)
android studio里配置C++报错?
org.gradle.api.tasks.TaskExecutionException: Execution failed for task ':app:transformNativeLibsWithMergeJniLibsForDebug'. at org.gradle.api.internal.tasks.execution.ExecuteActionsTaskExecuter.executeActions(ExecuteActionsTaskExecuter.java:103) at org.gradle.api.internal.tasks.execution.ExecuteActionsTaskExecuter.execute(ExecuteActionsTaskExecuter.java:73) at org.gradle.api.internal.tasks.execution.OutputDirectoryCreatingTaskExecuter.execute(OutputDirectoryCreatingTaskExecuter.java:51) at org.gradle.api.internal.tasks.execution.SkipUpToDateTaskExecuter.execute(SkipUpToDateTaskExecuter.java:59) at org.gradle.api.internal.tasks.execution.ResolveTaskOutputCachingStateExecuter.execute(ResolveTaskOutputCachingStateExecuter.java:54) at org.gradle.api.internal.tasks.execution.ValidatingTaskExecuter.execute(ValidatingTaskExecuter.java:59) at org.gradle.api.internal.tasks.execution.SkipEmptySourceFilesTaskExecuter.execute(SkipEmptySourceFilesTaskExecuter.java:101) at org.gradle.api.internal.tasks.execution.FinalizeInputFilePropertiesTaskExecuter.execute(FinalizeInputFilePropertiesTaskExecuter.java:44) at org.gradle.api.internal.tasks.execution.CleanupStaleOutputsExecuter.execute(CleanupStaleOutputsExecuter.java:91) at org.gradle.api.internal.tasks.execution.ResolveTaskArtifactStateTaskExecuter.execute(ResolveTaskArtifactStateTaskExecuter.java:62) at org.gradle.api.internal.tasks.execution.SkipTaskWithNoActionsExecuter.execute(SkipTaskWithNoActionsExecuter.java:59) at org.gradle.api.internal.tasks.execution.SkipOnlyIfTaskExecuter.execute(SkipOnlyIfTaskExecuter.java:54) at org.gradle.api.internal.tasks.execution.ExecuteAtMostOnceTaskExecuter.execute(ExecuteAtMostOnceTaskExecuter.java:43) at org.gradle.api.internal.tasks.execution.CatchExceptionTaskExecuter.execute(CatchExceptionTaskExecuter.java:34) at org.gradle.execution.taskgraph.DefaultTaskGraphExecuter$EventFiringTaskWorker$1.run(DefaultTaskGraphExecuter.java:256) at org.gradle.internal.progress.DefaultBuildOperationExecutor$RunnableBuildOperationWorker.execute(DefaultBuildOperationExecutor.java:336) at org.gradle.internal.progress.DefaultBuildOperationExecutor$RunnableBuildOperationWorker.execute(DefaultBuildOperationExecutor.java:328) at org.gradle.internal.progress.DefaultBuildOperationExecutor.execute(DefaultBuildOperationExecutor.java:199) at org.gradle.internal.progress.DefaultBuildOperationExecutor.run(DefaultBuildOperationExecutor.java:110) at org.gradle.execution.taskgraph.DefaultTaskGraphExecuter$EventFiringTaskWorker.execute(DefaultTaskGraphExecuter.java:249) at org.gradle.execution.taskgraph.DefaultTaskGraphExecuter$EventFiringTaskWorker.execute(DefaultTaskGraphExecuter.java:238) at org.gradle.execution.taskgraph.DefaultTaskPlanExecutor$TaskExecutorWorker.processTask(DefaultTaskPlanExecutor.java:123) at org.gradle.execution.taskgraph.DefaultTaskPlanExecutor$TaskExecutorWorker.access$200(DefaultTaskPlanExecutor.java:79) at org.gradle.execution.taskgraph.DefaultTaskPlanExecutor$TaskExecutorWorker$1.execute(DefaultTaskPlanExecutor.java:104) at org.gradle.execution.taskgraph.DefaultTaskPlanExecutor$TaskExecutorWorker$1.execute(DefaultTaskPlanExecutor.java:98) at org.gradle.execution.taskgraph.DefaultTaskExecutionPlan.execute(DefaultTaskExecutionPlan.java:663) at org.gradle.execution.taskgraph.DefaultTaskExecutionPlan.executeWithTask(DefaultTaskExecutionPlan.java:597) at org.gradle.execution.taskgraph.DefaultTaskPlanExecutor$TaskExecutorWorker.run(DefaultTaskPlanExecutor.java:98) at org.gradle.internal.concurrent.ExecutorPolicy$CatchAndRecordFailures.onExecute(ExecutorPolicy.java:63) at org.gradle.internal.concurrent.ManagedExecutorImpl$1.run(ManagedExecutorImpl.java:46) at java.util.concurrent.ThreadPoolExecutor.runWorker(ThreadPoolExecutor.java:1142) at java.util.concurrent.ThreadPoolExecutor$Worker.run(ThreadPoolExecutor.java:617) at org.gradle.internal.concurrent.ThreadFactoryImpl$ManagedThreadRunnable.run(ThreadFactoryImpl.java:55) at java.lang.Thread.run(Thread.java:745) Caused by: java.io.UncheckedIOException: java.nio.file.AccessDeniedException: C:\WINDOWS\Temp at com.android.builder.merge.LazyIncrementalFileMergerInputs.load(LazyIncrementalFileMergerInputs.java:88) at com.android.builder.merge.LazyIncrementalFileMergerInputs.lambda$fromNew$0(LazyIncrementalFileMergerInputs.java:59) at com.android.tools.build.apkzlib.utils.CachedSupplier.get(CachedSupplier.java:72) at com.android.builder.merge.LazyIncrementalFileMergerInput.lambda$new$2(LazyIncrementalFileMergerInput.java:138) at com.android.tools.build.apkzlib.utils.CachedSupplier.get(CachedSupplier.java:72) at com.android.builder.merge.LazyIncrementalFileMergerInput.open(LazyIncrementalFileMergerInput.java:225) at com.android.builder.merge.DelegateIncrementalFileMergerInput.open(DelegateIncrementalFileMergerInput.java:49) at com.google.common.collect.ImmutableList.forEach(ImmutableList.java:406) at com.android.builder.merge.IncrementalFileMerger.merge(IncrementalFileMerger.java:73) at com.android.build.gradle.internal.transforms.MergeJavaResourcesTransform.transform(MergeJavaResourcesTransform.java:411) at com.android.build.gradle.internal.pipeline.TransformTask$2.call(TransformTask.java:239) at com.android.build.gradle.internal.pipeline.TransformTask$2.call(TransformTask.java:235) at com.android.builder.profile.ThreadRecorder.record(ThreadRecorder.java:102) at com.android.build.gradle.internal.pipeline.TransformTask.transform(TransformTask.java:230) at sun.reflect.NativeMethodAccessorImpl.invoke0(Native Method) at sun.reflect.NativeMethodAccessorImpl.invoke(NativeMethodAccessorImpl.java:62) at sun.reflect.DelegatingMethodAccessorImpl.invoke(DelegatingMethodAccessorImpl.java:43) at java.lang.reflect.Method.invoke(Method.java:498) at org.gradle.internal.reflect.JavaMethod.invoke(JavaMethod.java:73) at org.gradle.api.internal.project.taskfactory.IncrementalTaskAction.doExecute(IncrementalTaskAction.java:50) at org.gradle.api.internal.project.taskfactory.StandardTaskAction.execute(StandardTaskAction.java:39) at org.gradle.api.internal.project.taskfactory.StandardTaskAction.execute(StandardTaskAction.java:26) at org.gradle.api.internal.tasks.execution.ExecuteActionsTaskExecuter$1.run(ExecuteActionsTaskExecuter.java:124) at org.gradle.internal.progress.DefaultBuildOperationExecutor$RunnableBuildOperationWorker.execute(DefaultBuildOperationExecutor.java:336) at org.gradle.internal.progress.DefaultBuildOperationExecutor$RunnableBuildOperationWorker.execute(DefaultBuildOperationExecutor.java:328) at org.gradle.internal.progress.DefaultBuildOperationExecutor.execute(DefaultBuildOperationExecutor.java:199) at org.gradle.internal.progress.DefaultBuildOperationExecutor.run(DefaultBuildOperationExecutor.java:110) at org.gradle.api.internal.tasks.execution.ExecuteActionsTaskExecuter.executeAction(ExecuteActionsTaskExecuter.java:113) at org.gradle.api.internal.tasks.execution.ExecuteActionsTaskExecuter.executeActions(ExecuteActionsTaskExecuter.java:95) ... 33 more Caused by: java.nio.file.AccessDeniedException: C:\WINDOWS\Temp at sun.nio.fs.WindowsException.translateToIOException(WindowsException.java:83) at sun.nio.fs.WindowsException.rethrowAsIOException(WindowsException.java:97) at sun.nio.fs.WindowsException.rethrowAsIOException(WindowsException.java:102) at sun.nio.fs.WindowsDirectoryStream.<init>(WindowsDirectoryStream.java:86) at sun.nio.fs.WindowsFileSystemProvider.newDirectoryStream(WindowsFileSystemProvider.java:518) at java.nio.file.Files.newDirectoryStream(Files.java:457) at com.google.common.io.MoreFiles.deleteRecursively(MoreFiles.java:516) at com.android.tools.build.apkzlib.bytestorage.TemporaryFile.deleteFile(TemporaryFile.java:57) at com.android.tools.build.apkzlib.bytestorage.TemporaryFile.close(TemporaryFile.java:48) at com.android.tools.build.apkzlib.bytestorage.TemporaryDirectory$1.close(TemporaryDirectory.java:50) at com.android.tools.build.apkzlib.bytestorage.TemporaryDirectoryStorage.close(TemporaryDirectoryStorage.java:101) at com.android.tools.build.apkzlib.bytestorage.OverflowToDiskByteStorage.close(OverflowToDiskByteStorage.java:167) at com.android.tools.build.apkzlib.bytestorage.ChunkBasedByteStorage.close(ChunkBasedByteStorage.java:142) at com.android.tools.build.apkzlib.zip.ZFile.close(ZFile.java:1210) at com.android.builder.files.RelativeFiles.fromZip(RelativeFiles.java:125) at com.android.builder.merge.LazyIncrementalFileMergerInputs.load(LazyIncrementalFileMergerInputs.java:86) ... 61 more
android studio如更新好sdk之后 gradle功能是干嘛的
android studio如更新好sdk之后 gradle功能是干嘛的,一定要联网之后才能使用吗
arcgis Android 10.2.5 gradle 同步出错
错误提示: AAPT err(610279039): D:\AndroidStudioProjects\GisDemo\app\build\intermediates\exploded-aar\com.android.support\appcompat-v7\22.0.0\res\drawable-hdpi-v4\abc_spinner_mtrl_am_alpha.9.png: libpng warning: iCCP: Not recognizing known sRGB profile that has been edited 请问如何解决
终于明白阿里百度这样的大公司,为什么面试经常拿ThreadLocal考验求职者了
点击上面↑「爱开发」关注我们每晚10点,捕获技术思考和创业资源洞察什么是ThreadLocalThreadLocal是一个本地线程副本变量工具类,各个线程都拥有一份线程私...
程序员必须掌握的核心算法有哪些?
由于我之前一直强调数据结构以及算法学习的重要性,所以就有一些读者经常问我,数据结构与算法应该要学习到哪个程度呢?,说实话,这个问题我不知道要怎么回答你,主要取决于你想学习到哪些程度,不过针对这个问题,我稍微总结一下我学过的算法知识点,以及我觉得值得学习的算法。这些算法与数据结构的学习大多数是零散的,并没有一本把他们全部覆盖的书籍。下面是我觉得值得学习的一些算法以及数据结构,当然,我也会整理一些看过...
Linux(服务器编程):15---两种高效的事件处理模式(reactor模式、proactor模式)
前言 同步I/O模型通常用于实现Reactor模式 异步I/O模型则用于实现Proactor模式 最后我们会使用同步I/O方式模拟出Proactor模式 一、Reactor模式 Reactor模式特点 它要求主线程(I/O处理单元)只负责监听文件描述符上是否有事件发生,有的话就立即将时间通知工作线程(逻辑单元)。除此之外,主线程不做任何其他实质性的工作 读写数据,接受新的连接,以及处...
阿里面试官问我:如何设计秒杀系统?我的回答让他比起大拇指
你知道的越多,你不知道的越多 点赞再看,养成习惯 GitHub上已经开源 https://github.com/JavaFamily 有一线大厂面试点脑图和个人联系方式,欢迎Star和指教 前言 Redis在互联网技术存储方面使用如此广泛,几乎所有的后端技术面试官都要在Redis的使用和原理方面对小伙伴们进行360°的刁难。 作为一个在互联网公司面一次拿一次Offer的面霸,打败了...
五年程序员记流水账式的自白。
不知觉已中码龄已突破五年,一路走来从起初铁憨憨到现在的十九线程序员,一路成长,虽然不能成为高工,但是也能挡下一面,从15年很火的android开始入坑,走过java、.Net、QT,目前仍处于android和.net交替开发中。 毕业到现在一共就职过两家公司,目前是第二家,公司算是半个创业公司,所以基本上都会身兼多职。比如不光要写代码,还要写软著、软著评测、线上线下客户对接需求收集...
C语言魔塔游戏
很早就很想写这个,今天终于写完了。 游戏截图: 编译环境: VS2017 游戏需要一些图片,如果有想要的或者对游戏有什么看法的可以加我的QQ 2985486630 讨论,如果暂时没有回应,可以在博客下方留言,到时候我会看到。 下面我来介绍一下游戏的主要功能和实现方式 首先是玩家的定义,使用结构体,这个名字是可以自己改变的 struct gamerole { char n...
一文详尽系列之模型评估指标
点击上方“Datawhale”,选择“星标”公众号第一时间获取价值内容在机器学习领域通常会根据实际的业务场景拟定相应的不同的业务指标,针对不同机器学习问题如回归、分类、排...
究竟你适不适合买Mac?
我清晰的记得,刚买的macbook pro回到家,开机后第一件事情,就是上了淘宝网,花了500元钱,找了一个上门维修电脑的师傅,上门给我装了一个windows系统。。。。。。 表砍我。。。 当时买mac的初衷,只是想要个固态硬盘的笔记本,用来运行一些复杂的扑克软件。而看了当时所有的SSD笔记本后,最终决定,还是买个好(xiong)看(da)的。 已经有好几个朋友问我mba怎么样了,所以今天尽量客观...
程序员一般通过什么途径接私活?
二哥,你好,我想知道一般程序猿都如何接私活,我也想接,能告诉我一些方法吗? 上面是一个读者“烦不烦”问我的一个问题。其实不止是“烦不烦”,还有很多读者问过我类似这样的问题。 我接的私活不算多,挣到的钱也没有多少,加起来不到 20W。说实话,这个数目说出来我是有点心虚的,毕竟太少了,大家轻喷。但我想,恰好配得上“一般程序员”这个称号啊。毕竟苍蝇再小也是肉,我也算是有经验的人了。 唾弃接私活、做外...
压测学习总结(1)——高并发性能指标:QPS、TPS、RT、吞吐量详解
一、QPS,每秒查询 QPS:Queries Per Second意思是“每秒查询率”,是一台服务器每秒能够相应的查询次数,是对一个特定的查询服务器在规定时间内所处理流量多少的衡量标准。互联网中,作为域名系统服务器的机器的性能经常用每秒查询率来衡量。 二、TPS,每秒事务 TPS:是TransactionsPerSecond的缩写,也就是事务数/秒。它是软件测试结果的测量单位。一个事务是指一...
Python爬虫爬取淘宝,京东商品信息
小编是一个理科生,不善长说一些废话。简单介绍下原理然后直接上代码。 使用的工具(Python+pycharm2019.3+selenium+xpath+chromedriver)其中要使用pycharm也可以私聊我selenium是一个框架可以通过pip下载 pip installselenium -ihttps://pypi.tuna.tsinghua.edu.cn/simple/ ...
阿里程序员写了一个新手都写不出的低级bug,被骂惨了。
这种新手都不会范的错,居然被一个工作好几年的小伙子写出来,差点被当场开除了。
Java工作4年来应聘要16K最后没要,细节如下。。。
前奏: 今天2B哥和大家分享一位前几天面试的一位应聘者,工作4年26岁,统招本科。 以下就是他的简历和面试情况。 基本情况: 专业技能: 1、&nbsp;熟悉Sping了解SpringMVC、SpringBoot、Mybatis等框架、了解SpringCloud微服务 2、&nbsp;熟悉常用项目管理工具:SVN、GIT、MAVEN、Jenkins 3、&nbsp;熟悉Nginx、tomca...
2020年,冯唐49岁:我给20、30岁IT职场年轻人的建议
点击“技术领导力”关注∆每天早上8:30推送 作者|Mr.K 编辑| Emma 来源|技术领导力(ID:jishulingdaoli) 前天的推文《冯唐:职场人35岁以后,方法论比经验重要》,收到了不少读者的反馈,觉得挺受启发。其实,冯唐写了不少关于职场方面的文章,都挺不错的。可惜大家只记住了“春风十里不如你”、“如何避免成为油腻腻的中年人”等不那么正经的文章。 本文整理了冯...
程序员该看的几部电影
1、骇客帝国(1999) 概念:在线/离线,递归,循环,矩阵等 剧情简介: 不久的将来,网络黑客尼奥对这个看似正常的现实世界产生了怀疑。 他结识了黑客崔妮蒂,并见到了黑客组织的首领墨菲斯。 墨菲斯告诉他,现实世界其实是由一个名叫“母体”的计算机人工智能系统控制,人们就像他们饲养的动物,没有自由和思想,而尼奥就是能够拯救人类的救世主。 可是,救赎之路从来都不会一帆风顺,到底哪里才是真实的世界?如何...
Python绘图,圣诞树,花,爱心 | Turtle篇
每周每日,分享Python实战代码,入门资料,进阶资料,基础语法,爬虫,数据分析,web网站,机器学习,深度学习等等。 公众号回复【进群】沟通交流吧,QQ扫码进群学习吧 微信群 QQ群 1.画圣诞树 import turtle screen = turtle.Screen() screen.setup(800,600) circle = turtle.Turtle()...
作为一个程序员,CPU的这些硬核知识你必须会!
CPU对每个程序员来说,是个既熟悉又陌生的东西? 如果你只知道CPU是中央处理器的话,那可能对你并没有什么用,那么作为程序员的我们,必须要搞懂的就是CPU这家伙是如何运行的,尤其要搞懂它里面的寄存器是怎么一回事,因为这将让你从底层明白程序的运行机制。 随我一起,来好好认识下CPU这货吧 把CPU掰开来看 对于CPU来说,我们首先就要搞明白它是怎么回事,也就是它的内部构造,当然,CPU那么牛的一个东...
还记得那个提速8倍的IDEA插件吗?VS Code版本也发布啦!!
去年,阿里云发布了本地 IDE 插件 Cloud Toolkit,仅 IntelliJ IDEA 一个平台,就有 15 万以上的开发者进行了下载,体验了一键部署带来的开发便利。时隔一年的今天,阿里云正式发布了 Visual Studio Code 版本,全面覆盖前端开发者,帮助前端实现一键打包部署,让开发提速 8 倍。 VSCode 版本的插件,目前能做到什么? 安装插件之后,开发者可以立即体验...
破14亿,Python分析我国存在哪些人口危机!
一、背景 二、爬取数据 三、数据分析 1、总人口 2、男女人口比例 3、人口城镇化 4、人口增长率 5、人口老化(抚养比) 6、各省人口 7、世界人口 四、遇到的问题 遇到的问题 1、数据分页,需要获取从1949-2018年数据,观察到有近20年参数:LAST20,由此推测获取近70年的参数可设置为:LAST70 2、2019年数据没有放上去,可以手动添加上去 3、将数据进行 行列转换 4、列名...
2019年除夕夜的有感而发
天气:小雨(加小雪) 温度:3摄氏度 空气:严重污染(399) 风向:北风 风力:微风 现在是除夕夜晚上十点钟,再有两个小时就要新的一年了; 首先要说的是我没患病,至少现在是没有患病;但是心情确像患了病一样沉重; 现在这个时刻应该大部分家庭都在看春晚吧,或许一家人团团圆圆的坐在一起,或许因为某些特殊原因而不能团圆;但不管是身在何处,身处什么境地,我都想对每一个人说一句:新年快乐! 不知道csdn这...
听说想当黑客的都玩过这个Monyer游戏(1~14攻略)
第零关 进入传送门开始第0关(游戏链接) 请点击链接进入第1关: 连接在左边→ ←连接在右边 看不到啊。。。。(只能看到一堆大佬做完的留名,也能看到菜鸡的我,在后面~~) 直接fn+f12吧 &lt;span&gt;连接在左边→&lt;/span&gt; &lt;a href="first.php"&gt;&lt;/a&gt; &lt;span&gt;←连接在右边&lt;/span&gt; o...
在家远程办公效率低?那你一定要收好这个「在家办公」神器!
相信大家都已经收到国务院延长春节假期的消息,接下来,在家远程办公可能将会持续一段时间。 但是问题来了。远程办公不是人在电脑前就当坐班了,相反,对于沟通效率,文件协作,以及信息安全都有着极高的要求。有着非常多的挑战,比如: 1在异地互相不见面的会议上,如何提高沟通效率? 2文件之间的来往反馈如何做到及时性?如何保证信息安全? 3如何规划安排每天工作,以及如何进行成果验收? ...... ...
作为一个程序员,内存和磁盘的这些事情,你不得不知道啊!!!
截止目前,我已经分享了如下几篇文章: 一个程序在计算机中是如何运行的?超级干货!!! 作为一个程序员,CPU的这些硬核知识你必须会! 作为一个程序员,内存的这些硬核知识你必须懂! 这些知识可以说是我们之前都不太重视的基础知识,可能大家在上大学的时候都学习过了,但是嘞,当时由于老师讲解的没那么有趣,又加上这些知识本身就比较枯燥,所以嘞,大家当初几乎等于没学。 再说啦,学习这些,也看不出来有什么用啊!...
2020年的1月,我辞掉了我的第一份工作
其实,这篇文章,我应该早点写的,毕竟现在已经2月份了。不过一些其它原因,或者是我的惰性、还有一些迷茫的念头,让自己迟迟没有试着写一点东西,记录下,或者说是总结下自己前3年的工作上的经历、学习的过程。 我自己知道的,在写自己的博客方面,我的文笔很一般,非技术类的文章不想去写;另外我又是一个还比较热衷于技术的人,而平常复杂一点的东西,如果想写文章写的清楚点,是需要足够...
别低估自己的直觉,也别高估自己的智商
所有群全部吵翻天,朋友圈全部沦陷,公众号疯狂转发。这两周没怎么发原创,只发新闻,可能有人注意到了。我不是懒,是文章写了却没发,因为大家的关注力始终在这次的疫情上面,发了也没人看。当然,我...
这个世界上人真的分三六九等,你信吗?
偶然间,在知乎上看到一个问题 一时间,勾起了我深深的回忆。 以前在厂里打过两次工,做过家教,干过辅导班,做过中介。零下几度的晚上,贴过广告,满脸、满手地长冻疮。 再回首那段岁月,虽然苦,但让我学会了坚持和忍耐。让我明白了,在这个世界上,无论环境多么的恶劣,只要心存希望,星星之火,亦可燎原。 下文是原回答,希望能对你能有所启发。 如果我说,这个世界上人真的分三六九等,...
节后首个工作日,企业们集体开晨会让钉钉挂了
By 超神经场景描述:昨天 2 月 3 日,是大部分城市号召远程工作的第一天,全国有接近 2 亿人在家开始远程办公,钉钉上也有超过 1000 万家企业活跃起来。关键词:十一出行 人脸...
Java基础知识点梳理
虽然已经在实际工作中经常与java打交道,但是一直没系统地对java这门语言进行梳理和总结,掌握的知识也比较零散。恰好利用这段时间重新认识下java,并对一些常见的语法和知识点做个总结与回顾,一方面为了加深印象,方便后面查阅,一方面为了掌握好Android打下基础。
2020年全新Java学习路线图,含配套视频,学完即为中级Java程序员!!
新的一年来临,突如其来的疫情打破了平静的生活! 在家的你是否很无聊,如果无聊就来学习吧! 世上只有一种投资只赚不赔,那就是学习!!! 传智播客于2020年升级了Java学习线路图,硬核升级,免费放送! 学完你就是中级程序员,能更快一步找到工作! 一、Java基础 JavaSE基础是Java中级程序员的起点,是帮助你从小白到懂得编程的必经之路。 在Java基础板块中有6个子模块的学...
B 站上有哪些很好的学习资源?
哇说起B站,在小九眼里就是宝藏般的存在,放年假宅在家时一天刷6、7个小时不在话下,更别提今年的跨年晚会,我简直是跪着看完的!! 最早大家聚在在B站是为了追番,再后来我在上面刷欧美新歌和漂亮小姐姐的舞蹈视频,最近两年我和周围的朋友们已经把B站当作学习教室了,而且学习成本还免费,真是个励志的好平台ヽ(.◕ฺˇд ˇ◕ฺ;)ノ 下面我们就来盘点一下B站上优质的学习资源: 综合类 Oeasy: 综合...
相关热词 c# id读写器 c#俄罗斯方块源码 c# linq原理 c# 装箱有什么用 c#集合 复制 c# 一个字符串分组 c++和c#哪个就业率高 c# 批量动态创建控件 c# 模块和程序集的区别 c# gmap 截图
立即提问