执行python setup.py install报警告,如何解决?

1、在服务器上安装某些软件,执行python setup.py install,打印UserWarning: Uknown distribution option: 'long_description_content_type'请问是什么原因导致的??该如何解决??

3个回答

不知道这个报错具体是什么原因,不过可以(1)再看一下这个包的安装说明;(2) 试试用pip安装,一般的包pip都可以解决。
pip就是python内置的,如果没有可以参考安装:
https://blog.csdn.net/sinat_32873711/article/details/78740146

现进入CMD,然后输入DOS命令进入setup.py文件所在目录,然后输入python setup.py install就搞定了。

可以不用python setup.py install,试试
setup.py install
如果不行,
打开setup.py,
找到setup函数
找long_description_content_type参数
把这一项与后面的等于号、逗号删掉
试试

Csdn user default icon
上传中...
上传图片
插入图片
抄袭、复制答案,以达到刷声望分或其他目的的行为,在CSDN问答是严格禁止的,一经发现立刻封号。是时候展现真正的技术了!
其他相关推荐
py2exe 在powershell执行python setup.py py2exe,总是显示你要选择如何打开这个文件,

各位,我用win0系统的windows powershell最后执行命令python setup.py py2exe,总是显示你要选择如何打开这个文件,能麻烦告诉我一下如何解决吗

Python用setup.py安装没有反应

setuptools已经装好了,也切换到了对应的目录,但是输入python setup.py install没有反应,先输入python setup.py build也没有反应 ![图片说明](https://img-ask.csdn.net/upload/202002/03/1580711142_396111.png) setuptools已经安装![图片说明](https://img-ask.csdn.net/upload/202002/03/1580715630_624420.png)

如何用python setup.py打包多个.py文件到同一个包下面

网上提供的一个最简单的例子是:只有一个test.py需要打包时 在setup.py中写上如下内容: # coding: utf-8 from distutils.core import setup setup(name="MyTest", version="1.0", description="test", author="ChaoMa", author_email="1277859938@qq.com", url="http://127.0.0.1:8080/educationma/search", py_modules=["test"], ) 我现在test.py和hello.py都需要打包到同一个包下面,那么setup.py应该怎么写呢?

为什么执行了python setup.py install,导入BS4库的语句还是灰色????

![图片说明](https://img-ask.csdn.net/upload/201807/15/1531641183_351793.png)

我给自己的Python程序写了一个setup.py文件,可以安装,但是无法import,执行可执行文件也报错怎么办?

我自己写了一个用于科学计算的Python程序,用于比较晶体结构相似性,对大批量的晶体结构自动分类,方法原理我在这篇文章里描述了[J. Phys. Condens. Matter 2017, 29, 165901]。现在我想做成一个Python egg,写了一个setup.py文件如下: ``` from setuptools import setup, find_packages setup( name='spap', version='0.3.0', packages=find_packages(), license='GPL', platforms="Independant", # install_requires=['numpy>=1.8.0', 'spglib>=1.10.0', 'ase>=3.13.0'], install_requires=['numpy', 'spglib', 'ase'], entry_points={ 'console_scripts': [ 'spap = src.spap:start_cli', ] } ) ``` 我用sudo python3 setup.py install能安装,安装包的目录如下所示: ``` ./ ├── build │   ├── bdist.linux-x86_64 │   └── lib │   └── src │   ├── ccf.py │   ├── __init__.py │   └── spap.py ├── dist │   └── spap-0.3.0-py3.6.egg ├── example │   └── run.py ├── setup.py ├── spap.egg-info │   ├── dependency_links.txt │   ├── entry_points.txt │   ├── PKG-INFO │   ├── requires.txt │   ├── SOURCES.txt │   └── top_level.txt └── src ├── ccf.py ├── __init__.py └── spap.py 8 directories, 15 files ``` 可以安装到系统上,pip3 list能显示出来,我执行spap -h命令就出错: ``` Traceback (most recent call last): File "/usr/local/bin/spap", line 11, in <module> load_entry_point('spap==0.3.0', 'console_scripts', 'spap')() File "/usr/lib/python3/dist-packages/pkg_resources/__init__.py", line 480, in load_entry_point return get_distribution(dist).load_entry_point(group, name) File "/usr/lib/python3/dist-packages/pkg_resources/__init__.py", line 2693, in load_entry_point return ep.load() File "/usr/lib/python3/dist-packages/pkg_resources/__init__.py", line 2324, in load return self.resolve() File "/usr/lib/python3/dist-packages/pkg_resources/__init__.py", line 2330, in resolve module = __import__(self.module_name, fromlist=['__name__'], level=0) File "/usr/local/lib/python3.6/dist-packages/spap-0.3.0-py3.6.egg/src/spap.py", line 70, in <module> ModuleNotFoundError: No module named 'ccf' ``` 而且在python3里import spap输出如下: ``` >>> import spap Traceback (most recent call last): File "<stdin>", line 1, in <module> ModuleNotFoundError: No module named 'spap' ``` 请问这个怎么办?

在安装robotframework的AutoItLibrary库的时候遇到一个报错File "setup.py", line 57,求教各位大神

按照别的大神的安装帖子安装,一共3个插件,后面2个都安装好了,就第一个报错,![按照别的大神的安装帖子安装,一共3个插件,后面2个都安装好了,就第一个报错,报错代码如下](https://img-ask.csdn.net/upload/201907/01/1561960546_853724.png) 报错代码如下 ``` C:\Users\Administrator\Downloads\AutoItLibrary-1.1.post1>python setup.py install File "setup.py", line 57 print "Don't think we need to unregister the old one..." ^ SyntaxError: Missing parentheses in call to 'print'. Did you mean print(print "D on't think we need to unregister the old one...")? ``` 安装电脑环境 win7旗舰版 64位 python是 64位的3.6.4

Python手动安装包时语法错误求助。

在官网载了个包,解压到\Lib\site-package后在包里打开cmd,输入Python setup.py install后显示SyntaxError: invalid syntax该怎么办?

求帮助!在windows下安装reviewboard执行 setup.py install 时报错。

我是在Win7 32位下面操作的。 in CMD window C:\reviewBoard>setup.py install running install running bdist_egg running egg_info writing requirements to ReviewBoard.egg-info\requires.txt writing ReviewBoard.egg-info\PKG-INFO writing top-level names to ReviewBoard.egg-info\top_level.txt writing dependency_links to ReviewBoard.egg-info\dependency_links.txt writing entry points to ReviewBoard.egg-info\entry_points.txt reading manifest file 'ReviewBoard.egg-info\SOURCES.txt' reading manifest template 'MANIFEST.in' warning: no files found matching 'Makefile' under directory 'docs' warning: no files found matching '*' under directory 'locale' no previously-included directories found matching 'docs\*\_build' no previously-included directories found matching 'reviewboard\htdocs\media\uplo aded\images' writing manifest file 'ReviewBoard.egg-info\SOURCES.txt' installing library code to build\bdist.win32\egg running install_lib running build_py running build_media error: %1 不是有效的 Win3 --就在这里终止了安装过程。 前面的准备工作都很顺利,包括: 1. 安装 python 2.5 , 安装在 E:\Python25 2. 安 装 easy_install,是 setuptools 包里带的一个命令,可以很方便的下载、编译和安装 Python 包,类似于 Ruby 的 Gems,这里其实可以不需要 3.设置环境变量, PATH=E:\ Python25;E:\ Python25\Scripts 4. 安 装 patch 工 具 , 用 于 对 比 文 件 , 安 装 在 E:\GnuWin32 目 录 , 加 System 变 量 PATH=E:\GnuWin32\bin 5.安装 memcached①工具 , 运行 memcached.exe –d install 将其安装成服务,并在服务中将 其启动(这里我安装没成功,但是不影响,后续再研究) 6.安装 python-memcached,是一个*.tar.gz 的压缩文件,解压之后,可以用命令 setup.py install 来安装 7.安装 Python Imaging Library② 8.安装 Pycrypto③ 9.安装 reviewboard,是一个*.tar.gz 的压缩文件,解压之后,可以用命令 setup.py install 来安 装。这里会需要一些其他的包支持,最好可以联网安装④。 --就在step 9 这里卡住了! ( 我在Win7下使用 wsys2 启动一个bash shell可以做到解压*.tar.gz 的压缩文件 )

dlib安装失败,通过python setup.py install安装

我是python3.7版本的,我用pip下载了cmake和boost,然后通过pip安装dlib老是失败,我就通过dlib文件夹安装,执行python setup.py install 结果出现以下问题,怎么 d:\tools\dlib\dlib-19.19.0\dlib\sockets\../dlib_basic_cpp_build_tutorial.txt(1): fatal error C1189: #error: "Don't write #include <dlib/all/source.cpp> in y our code." [D:\TOOLS\dlib\dlib-19.19.0\build\temp.win-amd64-3.7\Release\dlib_build\dlib.vcxproj]

关于python安装pymssql报错,求大神指点,在ubuntu14.04下

报错内容: ``` (pyenvdata)lin@lin-ThinkPad:~$ pip install pymssql Downloading/unpacking pymssql Downloading pymssql-2.1.1.tar.gz (2.4MB): 2.4MB downloaded Running setup.py (path:/home/lin/pyenvdata/build/pymssql/setup.py) egg_info for package pymssql setup.py: platform.system() => 'Linux' setup.py: platform.architecture() => ('64bit', 'ELF') setup.py: platform.linux_distribution() => ('Ubuntu', '14.04', 'trusty') setup.py: platform.libc_ver() => ('glibc', '2.4') setup.py: Not using bundled FreeTDS setup.py: include_dirs = ['/usr/local/include'] setup.py: library_dirs = ['/usr/local/lib'] Installed /home/lin/pyenvdata/build/pymssql/setuptools_git-1.1-py2.7.egg Installing collected packages: pymssql Running setup.py install for pymssql setup.py: platform.system() => 'Linux' setup.py: platform.architecture() => ('64bit', 'ELF') setup.py: platform.linux_distribution() => ('Ubuntu', '14.04', 'trusty') setup.py: platform.libc_ver() => ('glibc', '2.4') setup.py: Not using bundled FreeTDS setup.py: include_dirs = ['/usr/local/include'] setup.py: library_dirs = ['/usr/local/lib'] building '_mssql' extension x86_64-linux-gnu-gcc -pthread -fno-strict-aliasing -DNDEBUG -g -fwrapv -O2 -Wall -Wstrict-prototypes -fPIC -I/usr/local/include -I/usr/include/python2.7 -c _mssql.c -o build/temp.linux-x86_64-2.7/_mssql.o -DMSDBLIB _mssql.c:314:22: fatal error: sqlfront.h: 没有那个文件或目录 #include "sqlfront.h" ^ compilation terminated. error: command 'x86_64-linux-gnu-gcc' failed with exit status 1 Complete output from command /home/lin/pyenvdata/bin/python -c "import setuptools, tokenize;__file__='/home/lin/pyenvdata/build/pymssql/setup.py';exec(compile(getattr(tokenize, 'open', open)(__file__).read().replace('\r\n', '\n'), __file__, 'exec'))" install --record /tmp/pip-c75p_h-record/install-record.txt --single-version-externally-managed --compile --install-headers /home/lin/pyenvdata/include/site/python2.7: setup.py: platform.system() => 'Linux' setup.py: platform.architecture() => ('64bit', 'ELF') setup.py: platform.linux_distribution() => ('Ubuntu', '14.04', 'trusty') setup.py: platform.libc_ver() => ('glibc', '2.4') setup.py: Not using bundled FreeTDS setup.py: include_dirs = ['/usr/local/include'] setup.py: library_dirs = ['/usr/local/lib'] running install running build running build_ext building '_mssql' extension creating build creating build/temp.linux-x86_64-2.7 x86_64-linux-gnu-gcc -pthread -fno-strict-aliasing -DNDEBUG -g -fwrapv -O2 -Wall -Wstrict-prototypes -fPIC -I/usr/local/include -I/usr/include/python2.7 -c _mssql.c -o build/temp.linux-x86_64-2.7/_mssql.o -DMSDBLIB _mssql.c:314:22: fatal error: sqlfront.h: 没有那个文件或目录 #include "sqlfront.h" ^ compilation terminated. error: command 'x86_64-linux-gnu-gcc' failed with exit status 1 ---------------------------------------- Cleaning up... Command /home/lin/pyenvdata/bin/python -c "import setuptools, tokenize;__file__='/home/lin/pyenvdata/build/pymssql/setup.py';exec(compile(getattr(tokenize, 'open', open)(__file__).read().replace('\r\n', '\n'), __file__, 'exec'))" install --record /tmp/pip-c75p_h-record/install-record.txt --single-version-externally-managed --compile --install-headers /home/lin/pyenvdata/include/site/python2.7 failed with error code 1 in /home/lin/pyenvdata/build/pymssql Traceback (most recent call last): File "/home/lin/pyenvdata/bin/pip", line 11, in <module> sys.exit(main()) File "/home/lin/pyenvdata/local/lib/python2.7/site-packages/pip/__init__.py", line 185, in main return command.main(cmd_args) File "/home/lin/pyenvdata/local/lib/python2.7/site-packages/pip/basecommand.py", line 161, in main text = '\n'.join(complete_log) UnicodeDecodeError: 'ascii' codec can't decode byte 0xe6 in position 46: ordinal not in range(128) ```

python安装dlib模块出错

使用python -m pip install dlib 出错原因如下: python -m pip install dlib Collecting dlib Using cached dlib-19.1.0.tar.gz Building wheels for collected packages: dlib Running setup.py bdist_wheel for dlib ... error Complete output from command D:\python语言\python27\python.exe -u -c "import setuptools, tokenize;__file__='c:\\users\\administrator\\appdata\\local\\temp\\pip-build-yjbauy\\dlib\\setup.py';exec(compile(getattr(tokenize, 'open', open)(__file__).read().replace('\r\n', '\n'), __file__, 'exec'))" bdist_wheel -d c:\users\administrator\appdata\local\temp\tmpebunu3pip-wheel- --python-tag cp27: running bdist_wheel running build error: Cannot find cmake, ensure it is installed and in the path. You can install cmake using the instructions at https://cmake.org/install/ You can also specify its path with --cmake parameter. ---------------------------------------- Failed building wheel for dlib Running setup.py clean for dlib **Failed to build dlib Installing collected packages: dlib Running setup.py install for dlib ... error** Complete output from command D:\python语言\python27\python.exe -u -c "import setuptools, tokenize;__file__='c:\\users\\administrator\\appdata\\local\\temp\\pip-build-yjbauy\\dlib\\setup.py';exec(compile(getattr(tokenize, 'open', open)(__file__).read().replace('\r\n', '\n'), __file__, 'exec'))" install --record c:\users\administrator\appdata\local\temp\pip-xtjkek-record\install-record.txt --single-version-externally-managed --compile: running install running build error: Cannot find cmake, ensure it is installed and in the path. You can install cmake using the instructions at https://cmake.org/install/ You can also specify its path with --cmake parameter. ---------------------------------------- Command "D:\python语言\python27\python.exe -u -c "import setuptools, tokenize;__file__='c:\\users\\administrator\\appdata\\local\\temp\\pip-build-yjbauy\\dlib\\setup.py';exec(compile(getattr(tokenize, 'open', open)(__file__).read().replace('\r\n', '\n'), __file__, 'exec'))" install --record c:\users\administrator\appdata\local\temp\pip-xtjkek-record\install-record.txt --single-version-externally-managed --compile" failed with error code 1 in c:\users\administrator\appdata\loc 以前安装过python2和python3,现在已经把python3卸载了。 使用pip install XXX会出现错误,所以才用python -m pip install dlib windows 64为位的系统

Python使用setup.py封装出的Msi安装文件,安装后为什么会在两个地方同时安装?

我利用distutils.core的setup写了一个setup.py文件。 然后使用python setup.py bdist_msi生成了一个msi安装包。 使用这个msi安装包,安装后,会在C:\Lib和C:\Python27\Lib下都安装了一遍。 怎么才能只在C:\Python27\Lib下安装? ``` setup(name='XXX', version="1.0", description="XXX", author="XXX", author_email='XXX', packages=all_file, package_data={'': ['*.*']}, classifiers=[ 'Development Status :: 5 - Production/Stable', 'Operating System :: Microsoft :: Windows', 'Natural Language :: Chinese (Simplified)', 'Programming Language :: Python', 'Programming Language :: Python :: 2.7', 'Topic :: Software Development :: Libraries :: Python Modules' ], install_requires=[ 'pyserial==3.2.1' ], ) ```

python安装pyffmpeg,cython报错

问题是这样的,最近在装python版的ffmpeg模块pyffmpeg,执行python setup.py install后,报错如下: from Cython.Distutils import build_ext ,ImportError: No module named Cython.Distutils ,发现可能缺少Cython模块的安装,于是又执行了下面的命令: pip install cython 结果报错: building 'Cython.Plex.Scanners' extension error: Unable to find vcvarsall.bat 于是我按照网上别人的解决方式: 1 在执行pip install cython之前先执行 SET VS90COMNTOOLS=%VS110COMNTOOLS% 因为我的vs是2012的,结果还是报错 这种方式行不通,我又参照另一个人的方法 2在“..python安装路径...\Lib\distutils目录下有个msvc9compiler.py找到243行 toolskey = "VS%0.f0COMNTOOLS" % version 直接改为 toolskey = "VS110COMNTOOLS" 结果还是报上面的错误。 各位朋友有什么好的解决cython安装方法或者能解决pyffmpeg的安装方法吗,十分感谢。

python安装GDAL包时出错

![图片说明](https://img-ask.csdn.net/upload/201609/25/1474806998_308820.png) 我用的python是2.7.12,下载了gdal-2.1.1.tar.gz用的是python setup.py install命令来进行安装,于是出现了上图中的错误,不知道怎么解决,忘大神指点,我又尝试用pip install GDAL命令来安装,但是也出现了错误,如下图所示 ![图片说明](https://img-ask.csdn.net/upload/201609/25/1474807415_106393.png) ![图片说明](https://img-ask.csdn.net/upload/201609/25/1474807426_559756.png)

本人(新手)手动+自动卸载了dlib模块,但是还能正常import这怎么回事啊

我前几天安装好了dlib的库,想练练人脸识别的那玩样,费了好大的劲才装好dlib模块,后来发现CPU版本的处理起来有点慢,打算卸载了安装GPU版本的,cmd输入pip uninstall dlib,一开始是显示无法找到这个模块的位置。 我就很纳闷了...然后各种手动删dlib的文件夹也还是能import dlib,使用dlib.DLIB_USE_CUDA一直显示false。接着我卸载重装了python还有anaconda3,依旧能导入dlib...不过经过我各种乱删(我知道这并不好),现在能Import dlib,但是里面的功能都没了,用pip uninstall dlib显示Skipping dlib as it is not installed. 所以,这个库究竟能不能清理干净哇?第一次求助请求各位大佬们包涵 还有,那个python setup.py install --yes USE_AVX_INSTRUCTIONS --yes DLIB_USE_CUDA指令好像对dlib-19.17没用了? 一直显示The --yes options to dlib's setup.py don't do anything since all these options are on by default. So --yes has been removed. Do not give it to setup.py. = =现在不知道怎么安装GPU版本了...我非计算机专业的但我还算有兴趣想要学python,遇到很多问题只能百度...这个问题百度了好久没答案只好求助各位了..

ubuntu下dateutil的安装

操作:在ubuntu中virtualenv下运行程序 错误提示:ImportError: No module named dateutil 已完成:下载了dateutil.tar.gz并已解压,里面有setup.py 我在网上看的安装setup.py文件需要python setup.py install --安装路径. 问题1:请问在安装dateutil我应该在ubuntu哪个目录下操作,是放要运行的项目的那个目录还是随便一个目录就可以? 问题2:请问"python setup.py install --安装路径"安装路径我应该怎么写?安装到什么地方? 还有如果我用sudo pip install python-dateutil安装时,提示了: File "/usr/lib/python2.7/dist-packages/pip/req.py", line 1259, in prepare_files )[0] IndexError: list index out of range 不知道为什么会越界. 哪位老师了解情况请不吝赐教,感激不尽.

macOS系统下安装MySQL-Python一直报错怎么解决?

试了网上的各种方法还是不能正常安装。 报错代码如下: ERROR: Command errored out with exit status 1: command: /System/Library/Frameworks/Python.framework/Versions/2.7/Resources/Python.app/Contents/MacOS/Python -u -c 'import sys, setuptools, tokenize; sys.argv[0] = '"'"'/private/tmp/pip-install-lxfX8c/MySQL-Python/setup.py'"'"'; __file__='"'"'/private/tmp/pip-install-lxfX8c/MySQL-Python/setup.py'"'"';f=getattr(tokenize, '"'"'open'"'"', open)(__file__);code=f.read().replace('"'"'\r\n'"'"', '"'"'\n'"'"');f.close();exec(compile(code, __file__, '"'"'exec'"'"'))' bdist_wheel -d /private/tmp/pip-wheel-6O8ZVJ cwd: /private/tmp/pip-install-lxfX8c/MySQL-Python/ Complete output (30 lines): running bdist_wheel running build running build_py creating build creating build/lib.macosx-10.15-x86_64-2.7 copying _mysql_exceptions.py -> build/lib.macosx-10.15-x86_64-2.7 creating build/lib.macosx-10.15-x86_64-2.7/MySQLdb copying MySQLdb/__init__.py -> build/lib.macosx-10.15-x86_64-2.7/MySQLdb copying MySQLdb/converters.py -> build/lib.macosx-10.15-x86_64-2.7/MySQLdb copying MySQLdb/connections.py -> build/lib.macosx-10.15-x86_64-2.7/MySQLdb copying MySQLdb/cursors.py -> build/lib.macosx-10.15-x86_64-2.7/MySQLdb copying MySQLdb/release.py -> build/lib.macosx-10.15-x86_64-2.7/MySQLdb copying MySQLdb/times.py -> build/lib.macosx-10.15-x86_64-2.7/MySQLdb creating build/lib.macosx-10.15-x86_64-2.7/MySQLdb/constants copying MySQLdb/constants/__init__.py -> build/lib.macosx-10.15-x86_64-2.7/MySQLdb/constants copying MySQLdb/constants/CR.py -> build/lib.macosx-10.15-x86_64-2.7/MySQLdb/constants copying MySQLdb/constants/FIELD_TYPE.py -> build/lib.macosx-10.15-x86_64-2.7/MySQLdb/constants copying MySQLdb/constants/ER.py -> build/lib.macosx-10.15-x86_64-2.7/MySQLdb/constants copying MySQLdb/constants/FLAG.py -> build/lib.macosx-10.15-x86_64-2.7/MySQLdb/constants copying MySQLdb/constants/REFRESH.py -> build/lib.macosx-10.15-x86_64-2.7/MySQLdb/constants copying MySQLdb/constants/CLIENT.py -> build/lib.macosx-10.15-x86_64-2.7/MySQLdb/constants running build_ext building '_mysql' extension creating build/temp.macosx-10.15-x86_64-2.7 cc -fno-strict-aliasing -fno-common -dynamic -g -Os -pipe -fno-common -fno-strict-aliasing -fwrapv -DENABLE_DTRACE -DMACOSX -DNDEBUG -Wall -Wstrict-prototypes -Wshorten-64-to-32 -iwithsysroot /usr/local/libressl/include -DNDEBUG -g -fwrapv -Os -Wall -Wstrict-prototypes -DENABLE_DTRACE -arch x86_64 -pipe -Dversion_info=(1,2,5,'final',1) -D__version__=1.2.5 -I/usr/local/Cellar/mysql/8.0.19_1/include/mysql -I/System/Library/Frameworks/Python.framework/Versions/2.7/include/python2.7 -c _mysql.c -o build/temp.macosx-10.15-x86_64-2.7/_mysql.o _mysql.c:44:10: fatal error: 'my_config.h' file not found #include "my_config.h" ^~~~~~~~~~~~~ 1 error generated. error: command 'cc' failed with exit status 1 ---------------------------------------- ERROR: Failed building wheel for MySQL-Python Running setup.py clean for MySQL-Python Failed to build MySQL-Python Installing collected packages: MySQL-Python Running setup.py install for MySQL-Python ... error ERROR: Command errored out with exit status 1: command: /System/Library/Frameworks/Python.framework/Versions/2.7/Resources/Python.app/Contents/MacOS/Python -u -c 'import sys, setuptools, tokenize; sys.argv[0] = '"'"'/private/tmp/pip-install-lxfX8c/MySQL-Python/setup.py'"'"'; __file__='"'"'/private/tmp/pip-install-lxfX8c/MySQL-Python/setup.py'"'"';f=getattr(tokenize, '"'"'open'"'"', open)(__file__);code=f.read().replace('"'"'\r\n'"'"', '"'"'\n'"'"');f.close();exec(compile(code, __file__, '"'"'exec'"'"'))' install --record /private/tmp/pip-record-c9UgRs/install-record.txt --single-version-externally-managed --compile --install-headers /System/Library/Frameworks/Python.framework/Versions/2.7/include/python2.7/MySQL-Python cwd: /private/tmp/pip-install-lxfX8c/MySQL-Python/ Complete output (30 lines): running install running build running build_py creating build creating build/lib.macosx-10.15-x86_64-2.7 copying _mysql_exceptions.py -> build/lib.macosx-10.15-x86_64-2.7 creating build/lib.macosx-10.15-x86_64-2.7/MySQLdb copying MySQLdb/__init__.py -> build/lib.macosx-10.15-x86_64-2.7/MySQLdb copying MySQLdb/converters.py -> build/lib.macosx-10.15-x86_64-2.7/MySQLdb copying MySQLdb/connections.py -> build/lib.macosx-10.15-x86_64-2.7/MySQLdb copying MySQLdb/cursors.py -> build/lib.macosx-10.15-x86_64-2.7/MySQLdb copying MySQLdb/release.py -> build/lib.macosx-10.15-x86_64-2.7/MySQLdb copying MySQLdb/times.py -> build/lib.macosx-10.15-x86_64-2.7/MySQLdb creating build/lib.macosx-10.15-x86_64-2.7/MySQLdb/constants copying MySQLdb/constants/__init__.py -> build/lib.macosx-10.15-x86_64-2.7/MySQLdb/constants copying MySQLdb/constants/CR.py -> build/lib.macosx-10.15-x86_64-2.7/MySQLdb/constants copying MySQLdb/constants/FIELD_TYPE.py -> build/lib.macosx-10.15-x86_64-2.7/MySQLdb/constants copying MySQLdb/constants/ER.py -> build/lib.macosx-10.15-x86_64-2.7/MySQLdb/constants copying MySQLdb/constants/FLAG.py -> build/lib.macosx-10.15-x86_64-2.7/MySQLdb/constants copying MySQLdb/constants/REFRESH.py -> build/lib.macosx-10.15-x86_64-2.7/MySQLdb/constants copying MySQLdb/constants/CLIENT.py -> build/lib.macosx-10.15-x86_64-2.7/MySQLdb/constants running build_ext building '_mysql' extension creating build/temp.macosx-10.15-x86_64-2.7 cc -fno-strict-aliasing -fno-common -dynamic -g -Os -pipe -fno-common -fno-strict-aliasing -fwrapv -DENABLE_DTRACE -DMACOSX -DNDEBUG -Wall -Wstrict-prototypes -Wshorten-64-to-32 -iwithsysroot /usr/local/libressl/include -DNDEBUG -g -fwrapv -Os -Wall -Wstrict-prototypes -DENABLE_DTRACE -arch x86_64 -pipe -Dversion_info=(1,2,5,'final',1) -D__version__=1.2.5 -I/usr/local/Cellar/mysql/8.0.19_1/include/mysql -I/System/Library/Frameworks/Python.framework/Versions/2.7/include/python2.7 -c _mysql.c -o build/temp.macosx-10.15-x86_64-2.7/_mysql.o _mysql.c:44:10: fatal error: 'my_config.h' file not found #include "my_config.h" ^~~~~~~~~~~~~ 1 error generated. error: command 'cc' failed with exit status 1 ---------------------------------------- ERROR: Command errored out with exit status 1: /System/Library/Frameworks/Python.framework/Versions/2.7/Resources/Python.app/Contents/MacOS/Python -u -c 'import sys, setuptools, tokenize; sys.argv[0] = '"'"'/private/tmp/pip-install-lxfX8c/MySQL-Python/setup.py'"'"'; __file__='"'"'/private/tmp/pip-install-lxfX8c/MySQL-Python/setup.py'"'"';f=getattr(tokenize, '"'"'open'"'"', open)(__file__);code=f.read().replace('"'"'\r\n'"'"', '"'"'\n'"'"');f.close();exec(compile(code, __file__, '"'"'exec'"'"'))' install --record /private/tmp/pip-record-c9UgRs/install-record.txt --single-version-externally-managed --compile --install-headers /System/Library/Frameworks/Python.framework/Versions/2.7/include/python2.7/MySQL-Python Check the logs for full command output. 有没有大佬教一教该怎么解决这个问题。

python安装pcapy报错:vc++ fail with exit status 2

![图片说明](https://img-ask.csdn.net/upload/201604/27/1461720478_61688.png) 之前报没有vc++ 9.0什么的,于是我下了个vicual c++ for python 9.0,然后再安装pcapy这个第三方库,就报这个错。自己从pypi下了运行setup.py安装或pip install pcapy都会报这个错,求怎么解决。 我最开始是要装scapy的,但是装了scapy,编译的时候又报没有pcapy,于是我再装pcapy,可是情况就这样装不了,求怎么解决?

centos7.6 安装python3.执行/configure时,gcc异常

安装python时,执行./configure初始编译,报gcc没有工作: 错误信息: ``` checking build system type... x86_64-unknown-linux-gnu checking host system type... x86_64-unknown-linux-gnu checking for python3.6... no checking for python3... no checking for python... python checking for --enable-universalsdk... no checking for --with-universal-archs... no checking MACHDEP... linux checking for --without-gcc... no checking for --with-icc... no checking for gcc... gcc checking whether the C compiler works... no configure: error: in `/opt/Python-3.6.0': configure: error: C compiler cannot create executables ``` config.log信息: ![图片说明](https://img-ask.csdn.net/upload/201909/09/1568015863_225982.png) 去看日志发现ld找不到 执行which ld确实找不到。 ![图片说明](https://img-ask.csdn.net/upload/201909/09/1568015884_257870.png) 去搜索资料,都说安装gcc即可,可是我已经把python所需的依赖全部安装了,c编译器还是没有工作,我想可能是ld问题,我在安装pydoop时也遇到ld问题,很头疼,求解!!!

4小时玩转微信小程序——基础入门与微信支付实战

4小时玩转微信小程序——基础入门与微信支付实战

Python可以这样学(第四季:数据分析与科学计算可视化)

Python可以这样学(第四季:数据分析与科学计算可视化)

组成原理课程设计(实现机器数的真值还原等功能)

实现机器数的真值还原(定点小数)、定点小数的单符号位补码加减运算、定点小数的补码乘法运算和浮点数的加减运算。

javaWeb图书馆管理系统源码mysql版本

系统介绍 图书馆管理系统主要的目的是实现图书馆的信息化管理。图书馆的主要业务就是新书的借阅和归还,因此系统最核心的功能便是实现图书的借阅和归还。此外,还需要提供图书的信息查询、读者图书借阅情况的查询等

土豆浏览器

土豆浏览器可以用来看各种搞笑、电影、电视剧视频

Java面试题大全(2020版)

发现网上很多Java面试题都没有答案,所以花了很长时间搜集整理出来了这套Java面试题大全,希望对大家有帮助哈~ 本套Java面试题大全,全的不能再全,哈哈~ 一、Java 基础 1. JDK 和 JRE 有什么区别? JDK:Java Development Kit 的简称,java 开发工具包,提供了 java 的开发环境和运行环境。 JRE:Java Runtime Environ...

Java8零基础入门视频教程

Java8零基础入门视频教程

Java基础知识面试题(2020最新版)

文章目录Java概述何为编程什么是Javajdk1.5之后的三大版本JVM、JRE和JDK的关系什么是跨平台性?原理是什么Java语言有哪些特点什么是字节码?采用字节码的最大好处是什么什么是Java程序的主类?应用程序和小程序的主类有何不同?Java应用程序与小程序之间有那些差别?Java和C++的区别Oracle JDK 和 OpenJDK 的对比基础语法数据类型Java有哪些数据类型switc...

TTP229触摸代码以及触摸返回值处理

自己总结的ttp229触摸代码,触摸代码以及触摸按键处理

网络工程师小白入门--【思科CCNA、华为HCNA等网络工程师认证】

网络工程师小白入门--【思科CCNA、华为HCNA等网络工程师认证】

深度学习原理+项目实战+算法详解+主流框架(套餐)

深度学习系列课程从深度学习基础知识点开始讲解一步步进入神经网络的世界再到卷积和递归神经网络,详解各大经典网络架构。实战部分选择当下最火爆深度学习框架PyTorch与Tensorflow/Keras,全程实战演示框架核心使用与建模方法。项目实战部分选择计算机视觉与自然语言处理领域经典项目,从零开始详解算法原理,debug模式逐行代码解读。适合准备就业和转行的同学们加入学习! 建议按照下列课程顺序来进行学习 (1)掌握深度学习必备经典网络架构 (2)深度框架实战方法 (3)计算机视觉与自然语言处理项目实战。(按照课程排列顺序即可)

java jdk 8 帮助文档 中文 文档 chm 谷歌翻译

JDK1.8 API 中文谷歌翻译版 java帮助文档 JDK API java 帮助文档 谷歌翻译 JDK1.8 API 中文 谷歌翻译版 java帮助文档 Java最新帮助文档 本帮助文档是使用谷

Ubuntu18.04安装教程

Ubuntu18.04.1安装一、准备工作1.下载Ubuntu18.04.1 LTS2.制作U盘启动盘3.准备 Ubuntu18.04.1 的硬盘空间二、安装Ubuntu18.04.1三、安装后的一些工作1.安装输入法2.更换软件源四、双系统如何卸载Ubuntu18.04.1新的改变功能快捷键合理的创建标题,有助于目录的生成如何改变文本的样式插入链接与图片如何插入一段漂亮的代码片生成一个适合你的列...

快速排序---(面试碰到过好几次)

原理:    快速排序,说白了就是给基准数据找其正确索引位置的过程.    如下图所示,假设最开始的基准数据为数组第一个元素23,则首先用一个临时变量去存储基准数据,即tmp=23;然后分别从数组的两端扫描数组,设两个指示标志:low指向起始位置,high指向末尾.    首先从后半部分开始,如果扫描到的值大于基准数据就让high减1,如果发现有元素比该基准数据的值小(如上图中18&amp;lt...

手把手实现Java图书管理系统(附源码)

手把手实现Java图书管理系统(附源码)

HTML期末大作业

这是我自己做的HTML期末大作业,花了很多时间,稍加修改就可以作为自己的作业了,而且也可以作为学习参考

Python数据挖掘简易入门

Python数据挖掘简易入门

极简JAVA学习营第四期(报名以后加助教微信:eduxy-1)

极简JAVA学习营第四期(报名以后加助教微信:eduxy-1)

C++语言基础视频教程

C++语言基础视频教程

UnityLicence

UnityLicence

软件测试2小时入门

软件测试2小时入门

YOLOv3目标检测实战:训练自己的数据集

YOLOv3目标检测实战:训练自己的数据集

Python数据分析师-实战系列

系列课程主要包括Python数据分析必备工具包,数据分析案例实战,核心算法实战与企业级数据分析与建模解决方案实战,建议大家按照系列课程阶段顺序进行学习。所有数据集均为企业收集的真实数据集,整体风格以实战为导向,通俗讲解Python数据分析核心技巧与实战解决方案。

YOLOv3目标检测实战系列课程

《YOLOv3目标检测实战系列课程》旨在帮助大家掌握YOLOv3目标检测的训练、原理、源码与网络模型改进方法。 本课程的YOLOv3使用原作darknet(c语言编写),在Ubuntu系统上做项目演示。 本系列课程包括三门课: (1)《YOLOv3目标检测实战:训练自己的数据集》 包括:安装darknet、给自己的数据集打标签、整理自己的数据集、修改配置文件、训练自己的数据集、测试训练出的网络模型、性能统计(mAP计算和画出PR曲线)和先验框聚类。 (2)《YOLOv3目标检测:原理与源码解析》讲解YOLOv1、YOLOv2、YOLOv3的原理、程序流程并解析各层的源码。 (3)《YOLOv3目标检测:网络模型改进方法》讲解YOLOv3的改进方法,包括改进1:不显示指定类别目标的方法 (增加功能) ;改进2:合并BN层到卷积层 (加快推理速度) ; 改进3:使用GIoU指标和损失函数 (提高检测精度) ;改进4:tiny YOLOv3 (简化网络模型)并介绍 AlexeyAB/darknet项目。

超详细MySQL安装及基本使用教程

一、下载MySQL 首先,去数据库的官网http://www.mysql.com下载MySQL。 点击进入后的首页如下:  然后点击downloads,community,选择MySQL Community Server。如下图:  滑到下面,找到Recommended Download,然后点击go to download page。如下图:  点击download进入下载页面选择No...

一学即懂的计算机视觉(第一季)

一学即懂的计算机视觉(第一季)

董付国老师Python全栈学习优惠套餐

购买套餐的朋友可以关注微信公众号“Python小屋”,上传付款截图,然后领取董老师任意图书1本。

爬取妹子图片(简单入门)

安装第三方请求库 requests 被网站禁止了访问 原因是我们是Python过来的 重新给一段 可能还是存在用不了,使用网页的 编写代码 上面注意看匹配内容 User-Agent:请求对象 AppleWebKit:请求内核 Chrome浏览器 //请求网页 import requests import re //正则表达式 就是去不规则的网页里面提取有规律的信息 headers = { 'User-Agent':'存放浏览器里面的' } response = requests.get

web网页制作期末大作业

分享思维,改变世界. web网页制作,期末大作业. 所用技术:html css javascript 分享所学所得

技术大佬:我去,你写的 switch 语句也太老土了吧

昨天早上通过远程的方式 review 了两名新来同事的代码,大部分代码都写得很漂亮,严谨的同时注释也很到位,这令我非常满意。但当我看到他们当中有一个人写的 switch 语句时,还是忍不住破口大骂:“我擦,小王,你丫写的 switch 语句也太老土了吧!” 来看看小王写的代码吧,看完不要骂我装逼啊。 private static String createPlayer(PlayerTypes p...

相关热词 c# 开发接口 c# 中方法上面的限制 c# java 时间戳 c#单元测试入门 c# 数组转化成文本 c#实体类主外键关系设置 c# 子函数 局部 c#窗口位置设置 c# list 查询 c# 事件 执行顺序
立即提问
相关内容推荐