VUE Cannot find module

vue项目能正常启动,当浏览器打开时,浏览器就会出现 “Cannot find module ‘./XXX.vue’”的Error。 这个XXX是我的菜单代码里的path的值

2个回答

路径写错了,建议检查导入组件或模块时使用的路径

报错的位置是什么截个图,你这样说太模糊了

Csdn user default icon
上传中...
上传图片
插入图片
抄袭、复制答案,以达到刷声望分或其他目的的行为,在CSDN问答是严格禁止的,一经发现立刻封号。是时候展现真正的技术了!
其他相关推荐
Error: Cannot find module 'webpack' ?
## 问题:使用webpack打包的时候,为什么会出现 Error: Cannot find module 'webpack'? > 我在网上搜了好多,说webpack@4.x 版本需要安装 webpack-cli ,但是我都已经安装了,仍然报这个错,求解决!!!!
vue项目运行报错Error: Cannot find module 'es-abstract/es6'
![图片说明](https://img-ask.csdn.net/upload/201911/06/1573011220_72958.jpg)
执行命令npx webpack 报错Cannot find module 'html-webpack-plugin'
安装了html-webpack-plugin也还是报这个错 把node降到8.2.1版本还是不行
vue-cli + ts 使用CDN时报错,请问各位大佬如何解决?
### 使用vue-cli新建了一个项目,启用了TypeScript 当我尝试将vue、vuex 使用CDN 导入的时候做了如下操作 + 删除了 **package.json** 中的依赖 + 在 **index.html ** 中写入cdn ![图片说明](https://img-ask.csdn.net/upload/201912/23/1577067141_320744.png) + 在 **vue.config.js** 中写入 ``` configureWebpack: (config) => { //入口文件 config.entry.app = ['babel-polyfill', './src/main.ts']; //只有打包生产环境才需要将console删除 if (process.env.NODE_ENV == 'production') { config.plugins = [...config.plugins, ...plugins]; } // CDN config.externals = { 'cdnVue': 'Vue', } }, ``` ### 报错 ``` ERROR in E:/any pros/MyFactory/my_factory/src/main.ts(1,17): 1:17 Cannot find module 'cdnVue'. ```
昨天晚上电脑更新了一下,今天打开vue文件,执行cnpm install后执行npm run serve报错,为什么?
![图片说明](https://img-ask.csdn.net/upload/201908/30/1567155401_358659.png) 这是源码 D:\xiaowa-master>cnpm install √ Installed 23 packages √ Linked 0 latest versions √ Run 0 scripts √ All packages installed (used 198ms(network 187ms), speed 29.85kB/s, json 1(5.58kB), tarball 0B) D:\xiaowa-master>npm run serve > hello-world@0.1.0 serve D:\xiaowa-master > vue-cli-service serve internal/modules/cjs/loader.js:583 throw err; ^ Error: Cannot find module 'semver' at Function.Module._resolveFilename (internal/modules/cjs/loader.js:581:15) at Function.Module._load (internal/modules/cjs/loader.js:507:25) at Module.require (internal/modules/cjs/loader.js:637:17) at require (internal/modules/cjs/helpers.js:22:18) at Object.<anonymous> (D:\xiaowa-master\node_modules\_@vue_cli-service@3.11.0@@vue\cli-service\bin\vue-cli-service.js:3:16) at Module._compile (internal/modules/cjs/loader.js:689:30) at Object.Module._extensions..js (internal/modules/cjs/loader.js:700:10) at Module.load (internal/modules/cjs/loader.js:599:32) at tryModuleLoad (internal/modules/cjs/loader.js:538:12) at Function.Module._load (internal/modules/cjs/loader.js:530:3) npm ERR! code ELIFECYCLE npm ERR! errno 1 npm ERR! hello-world@0.1.0 serve: `vue-cli-service serve` npm ERR! Exit status 1 npm ERR! npm ERR! Failed at the hello-world@0.1.0 serve script. npm ERR! This is probably not a problem with npm. There is likely additional logging output above. npm ERR! A complete log of this run can be found in: npm ERR! C:\Users\1255109002\AppData\Roaming\npm-cache\_logs\2019-08-30T08_57_09_953Z-debug.log D:\xiaowa-master> 哪位大哥能帮帮忙
运行Vue项目时,报错npm ERR! errno 1 npm ERR! Failed at the single@1.0.0 dev script.
运行Vue项目时,报错,不清楚是哪里出了问题 ``` Error: Cannot find module 'webpack-cli/bin/config-yargs' at Function.Module._resolveFilename (internal/modules/cjs/loader.js:636:15) at Function.Module._load (internal/modules/cjs/loader.js:562:25) at Module.require (internal/modules/cjs/loader.js:690:17) at require (internal/modules/cjs/helpers.js:25:18) at Object.<anonymous> (E:\HBuilderProjects\Vue\single\node_modules\_webpack-dev-server@3.7.1@webpack-dev-server\bin\webpack-dev-server.js:60:1) at Module._compile (internal/modules/cjs/loader.js:776:30) at Object.Module._extensions..js (internal/modules/cjs/loader.js:787:10) at Module.load (internal/modules/cjs/loader.js:653:32) at tryModuleLoad (internal/modules/cjs/loader.js:593:12) at Function.Module._load (internal/modules/cjs/loader.js:585:3) npm ERR! code ELIFECYCLE npm ERR! errno 1 npm ERR! single@1.0.0 dev: `webpack-dev-server --open --hot --port 8020` npm ERR! Exit status 1 npm ERR! npm ERR! Failed at the single@1.0.0 dev script. npm ERR! This is probably not a problem with npm. There is likely additional logging output above. npm ERR! A complete log of this run can be found in: npm ERR! C:\Users\asus\AppData\Roaming\npm-cache\_logs\2019-06-15T16_43_01_654Z-debug.log ``` ``` ``` 这个是package.json文件 ``` { "name": "single", "version": "1.0.0", "description": "", "main": "main.js", "scripts": { "dev": "webpack-dev-server --open --hot --port 8020" }, "keywords": [], "author": "", "license": "ISC", "dependencies": { "vue": "^2.6.10" }, "devDependencies": { "babel-core": "^6.26.3", "babel-loader": "^8.0.6", "babel-preset-env": "^1.7.0", "css-loader": "^3.0.0", "file-loader": "^4.0.0", "vue-html-loader": "^1.2.4", "vue-loader": "^15.7.0", "vue-style-loader": "^4.1.2", "vue-template-compiler": "^2.6.10", "webpack": "^4.34.0", "webpack-dev-server": "^3.7.1" } } ```
vue+vux 项目依赖丢失
项目已经发布,因为要加功能跑了dev后报了依赖丢失,可以肯定不是手动删的,求问为什么会出现这种状况,以及如何避免 To debug the "dev" script, make sure the %NODE_DEBUG_OPTION% string is specified as the first argument for the node command you'd like to debug. For example: "scripts": { "start": "node %NODE_DEBUG_OPTION% server.js" } > member@1.0.0 dev D:\member\member > webpack-dev-server --inline --progress --config build/webpack.dev.conf.js module.js:550 throw err; ^ Error: Cannot find module 'vux-loader' at Function.Module._resolveFilename (module.js:548:15) at Function.Module._load (module.js:475:25) at Module.require (module.js:597:17) at require (internal/module.js:11:18) at Object.<anonymous> (D:\member\member\build\vue-loader.conf.js:4:19) at Module._compile (module.js:653:30) at Object.Module._extensions..js (module.js:664:10) at Module.load (module.js:566:32) at tryModuleLoad (module.js:506:12) at Function.Module._load (module.js:498:3) npm ERR! code ELIFECYCLE npm ERR! errno 1 npm ERR! member@1.0.0 dev: `webpack-dev-server --inline --progress --config build/webpack.dev.conf.js` npm ERR! Exit status 1 npm ERR! npm ERR! Failed at the member@1.0.0 dev script. npm ERR! This is probably not a problem with npm. There is likely additional logging output above. npm ERR! A complete log of this run can be found in: npm ERR! C:\Users\DELL\AppData\Roaming\npm-cache\_logs\2018-11-24T03_14_53_401Z-debug.log Process finished with exit code 1
koa2搭建nuxt无法正常启动
https://github.com/nuxt-community/koa-template/tree/master/template ```bash npm install 成功 npm run dev 失败 ``` 报错信息:![图片说明](https://img-ask.csdn.net/upload/201901/06/1546789733_314082.png) Cannot find module 'E:\gitRep\nuxt-learn\build\main.js' 看了下他源项目里也没有build这个文件夹啊。看了半天文档也看不出有什么解决办法,求各位大神帮助。
为什么nuxt.js无法安装node-sass?
1.npm 不管怎么样都安装不了 淘宝镜像也没用 2.每次安装后都卡在Downloading binary from https://github.com/sass/node-sass/releases/download/v4.12.0/win32-x64-64这里然后就报错 3.T.T小白求教 ``` PS E:\Users\FuYuHao\Desktop\sb\a\aaa> npm i node-sass > node-sass@4.12.0 install E:\Users\FuYuHao\Desktop\sb\a\aaa\node_modules\node-sass > node scripts/install.js Downloading binary from https://github.com/sass/node-sass/releases/download/v4.12.0/win32-x64-64_binding.node Cannot download "https://github.com/sass/node-sass/releases/download/v4.12.0/win32-x64-64_binding.node": connect ETIMEDOUT 52.216.135.19:443 Timed out whilst downloading the prebuilt binary Hint: If github.com is not accessible in your location try setting a proxy via HTTP_PROXY, e.g. export HTTP_PROXY=http://example.com:1234 or configure npm proxy via npm config set proxy http://example.com:8080 > node-sass@4.12.0 postinstall E:\Users\FuYuHao\Desktop\sb\a\aaa\node_modules\node-sass > node scripts/build.js Building: C:\Program Files\nodejs\node.exe E:\Users\FuYuHao\Desktop\sb\a\aaa\node_modules\node-gyp\bin\node-gyp.js rebuild --verbose --libsass_ext= --libsass_cflags= --libsass_ldflags= --libsass_library= gyp info it worked if it ends with ok gyp verb cli [ 'C:\\Program Files\\nodejs\\node.exe', gyp verb cli 'E:\\Users\\FuYuHao\\Desktop\\sb\\a\\aaa\\node_modules\\node-gyp\\bin\\node-gyp.js', gyp verb cli 'rebuild', gyp verb cli '--verbose', gyp verb cli '--libsass_ext=', gyp verb cli '--libsass_cflags=', gyp verb cli '--libsass_ldflags=', gyp verb cli '--libsass_library=' ] gyp info using node-gyp@3.8.0 gyp info using node@10.14.1 | win32 | x64 gyp verb command rebuild [] gyp verb command clean [] gyp verb clean removing "build" directory gyp verb command configure [] gyp verb check python checking for Python executable "python2" in the PATH gyp verb `which` failed Error: not found: python2 gyp verb `which` failed at getNotFoundError (E:\Users\FuYuHao\Desktop\sb\a\aaa\node_modules\which\which.js:13:12) gyp verb `which` failed at F (E:\Users\FuYuHao\Desktop\sb\a\aaa\node_modules\which\which.js:68:19) gyp verb `which` failed at E (E:\Users\FuYuHao\Desktop\sb\a\aaa\node_modules\which\which.js:80:29) gyp verb `which` failed at E:\Users\FuYuHao\Desktop\sb\a\aaa\node_modules\which\which.js:89:16 gyp verb `which` failed at E:\Users\FuYuHao\Desktop\sb\a\aaa\node_modules\isexe\index.js:42:5 gyp verb `which` failed at E:\Users\FuYuHao\Desktop\sb\a\aaa\node_modules\isexe\windows.js:36:5 gyp verb `which` failed at FSReqWrap.oncomplete (fs.js:154:21) gyp verb `which` failed python2 { Error: not found: python2 gyp verb `which` failed at getNotFoundError (E:\Users\FuYuHao\Desktop\sb\a\aaa\node_modules\which\which.js:13:12) gyp verb `which` failed at F (E:\Users\FuYuHao\Desktop\sb\a\aaa\node_modules\which\which.js:68:19) gyp verb `which` failed at E (E:\Users\FuYuHao\Desktop\sb\a\aaa\node_modules\which\which.js:80:29) gyp verb `which` failed at E:\Users\FuYuHao\Desktop\sb\a\aaa\node_modules\which\which.js:89:16 gyp verb `which` failed at E:\Users\FuYuHao\Desktop\sb\a\aaa\node_modules\isexe\index.js:42:5 gyp verb `which` failed at E:\Users\FuYuHao\Desktop\sb\a\aaa\node_modules\isexe\windows.js:36:5 gyp verb `which` failed at FSReqWrap.oncomplete (fs.js:154:21) gyp verb `which` failed stack: gyp verb `which` failed 'Error: not found: python2\n at getNotFoundError (E:\\Users\\FuYuHao\\Desktop\\sb\\a\\aaa\\node_modules\\which\\which.js:13:12)\n at F (E:\\Users\\FuYuHao\\Desktop\\sb\\a\\aaa\\node_modules\\which\\which.js:68:19)\n at E (E:\\Users\\FuYuHao\\Desktop\\sb\\a\\aaa\\node_modules\\which\\which.js:80:29)\n at E:\\Users\\FuYuHao\\Desktop\\sb\\a\\aaa\\node_modules\\which\\which.js:89:16\n at E:\\Users\\FuYuHao\\Desktop\\sb\\a\\aaa\\node_modules\\isexe\\index.js:42:5\n at E:\\Users\\FuYuHao\\Desktop\\sb\\a\\aaa\\node_modules\\isexe\\windows.js:36:5\n at FSReqWrap.oncomplete (fs.js:154:21)', gyp verb `which` failed code: 'ENOENT' } gyp verb check python checking for Python executable "python" in the PATH gyp verb `which` succeeded python C:\Python27\python.EXE gyp verb check python version `C:\Python27\python.EXE -c "import sys; print "2.7.15 gyp verb check python version .%s.%s" % sys.version_info[:3];"` returned: %j gyp verb get node dir no --target version specified, falling back to host node version: 10.14.1 gyp verb command install [ '10.14.1' ] gyp verb install input version string "10.14.1" gyp verb install installing version: 10.14.1 gyp verb install --ensure was passed, so won't reinstall if already installed gyp verb install version is already installed, need to check "installVersion" gyp verb got "installVersion" 9 gyp verb needs "installVersion" 9 gyp verb install version is good gyp verb get node dir target node version installed: 10.14.1 gyp verb build dir attempting to create "build" dir: E:\Users\FuYuHao\Desktop\sb\a\aaa\node_modules\node-sass\build gyp verb build dir "build" dir needed to be created? E:\Users\FuYuHao\Desktop\sb\a\aaa\node_modules\node-sass\build gyp verb find vs2017 Found installation at: C:\Program Files (x86)\Microsoft Visual Studio\2017\BuildTools gyp verb find vs2017 - Found Microsoft.VisualStudio.Component.Windows10SDK.17763 gyp verb find vs2017 - Found Microsoft.VisualStudio.Component.VC.Tools.x86.x64 gyp verb find vs2017 - Found Microsoft.VisualStudio.VC.MSBuild.Base gyp verb find vs2017 - Using this installation with Windows 10 SDK gyp verb find vs2017 using installation: C:\Program Files (x86)\Microsoft Visual Studio\2017\BuildTools gyp verb build/config.gypi creating config file gyp verb build/config.gypi writing out config file: E:\Users\FuYuHao\Desktop\sb\a\aaa\node_modules\node-sass\build\config.gypi gyp verb config.gypi checking for gypi file: E:\Users\FuYuHao\Desktop\sb\a\aaa\node_modules\node-sass\config.gypi gyp verb common.gypi checking for gypi file: E:\Users\FuYuHao\Desktop\sb\a\aaa\node_modules\node-sass\common.gypi gyp verb gyp gyp format was not specified; forcing "msvs" gyp info spawn C:\Python27\python.EXE gyp info spawn args [ 'E:\\Users\\FuYuHao\\Desktop\\sb\\a\\aaa\\node_modules\\node-gyp\\gyp\\gyp_main.py', gyp info spawn args 'binding.gyp', gyp info spawn args '-f', gyp info spawn args 'msvs', gyp info spawn args '-G', gyp info spawn args 'msvs_version=2015', gyp info spawn args '-I', gyp info spawn args 'E:\\Users\\FuYuHao\\Desktop\\sb\\a\\aaa\\node_modules\\node-sass\\build\\config.gypi', gyp info spawn args '-I', gyp info spawn args 'E:\\Users\\FuYuHao\\Desktop\\sb\\a\\aaa\\node_modules\\node-gyp\\addon.gypi', gyp info spawn args '-I', gyp info spawn args 'C:\\Users\\FuYuHao\\.node-gyp\\10.14.1\\include\\node\\common.gypi', gyp info spawn args '-Dlibrary=shared_library', gyp info spawn args '-Dvisibility=default', gyp info spawn args '-Dnode_root_dir=C:\\Users\\FuYuHao\\.node-gyp\\10.14.1', gyp info spawn args '-Dnode_gyp_dir=E:\\Users\\FuYuHao\\Desktop\\sb\\a\\aaa\\node_modules\\node-gyp', gyp info spawn args '-Dnode_lib_file=C:\\Users\\FuYuHao\\.node-gyp\\10.14.1\\<(target_arch)\\node.lib', gyp info spawn args '-Dmodule_root_dir=E:\\Users\\FuYuHao\\Desktop\\sb\\a\\aaa\\node_modules\\node-sass', gyp info spawn args '-Dnode_engine=v8', gyp info spawn args '--depth=.', gyp info spawn args '--no-parallel', gyp info spawn args '--generator-output', gyp info spawn args 'E:\\Users\\FuYuHao\\Desktop\\sb\\a\\aaa\\node_modules\\node-sass\\build', gyp info spawn args '-Goutput_dir=.' ] gyp verb command build [] gyp verb build type Release gyp verb architecture x64 gyp verb node dev dir C:\Users\FuYuHao\.node-gyp\10.14.1 gyp verb found first Solution file build/binding.sln gyp verb using MSBuild: C:\Program Files (x86)\Microsoft Visual Studio\2017\BuildTools\MSBuild\15.0\Bin\MSBuild.exe gyp info spawn C:\Program Files (x86)\Microsoft Visual Studio\2017\BuildTools\MSBuild\15.0\Bin\MSBuild.exe gyp info spawn args [ 'build/binding.sln', gyp info spawn args '/nologo', gyp info spawn args '/p:Configuration=Release;Platform=x64' ] 在此解决方案中一次生成一个项目。若要启用并行生成,请添加“/m”开关。 生成启动时间为 2019/5/29 22:01:12。 节点 1 上的项目“E:\Users\FuYuHao\Desktop\sb\a\aaa\node_modules\node-sass\build\binding.sln”(默认目标)。 ValidateSolutionConfiguration: 正在生成解决方案配置“Release|x64”。 项目“E:\Users\FuYuHao\Desktop\sb\a\aaa\node_modules\node-sass\build\binding.sln”(1)正在节点 1 上生成“E:\Users\FuYuHao\Desktop\sb\a\aaa\node_modules\node-sass\build\binding.vcxproj.metaproj”(2) (默认目标)。 项目“E:\Users\FuYuHao\Desktop\sb\a\aaa\node_modules\node-sass\build\binding.vcxproj.metaproj”(2)正在节点 1 上生成“E:\Users\FuYuHao\Desktop\sb\a\aaa\node_modules\node-sass\build\src\libsass.vcxproj”(3) (默认目标)。 PrepareForBuild: 正在创建目录“Release\obj\libsass\”。 正在创建目录“E:\Users\FuYuHao\Desktop\sb\a\aaa\node_modules\node-sass\build\Release\”。 正在创建目录“Release\obj\libsass\libsass.tlog\”。 InitializeBuildStatus: 正在创建“Release\obj\libsass\libsass.tlog\unsuccessfulbuild”,因为已指定“AlwaysCreate”。 ClCompile: C:\Program Files (x86)\Microsoft Visual Studio\2017\BuildTools\VC\Tools\MSVC\14.16.27023\bin\HostX64\x64\CL.exe /c /I"C:\Users\FuYuHao\.node-gyp\10.14.1\include\node" /I"C:\Users\FuYuHao\.node-gyp\10.14.1\src" /I"C:\Use rs\FuYuHao\.node-gyp\10.14.1\deps\openssl\config" /I"C:\Users\FuYuHao\.node-gyp\10.14.1\deps\openssl\openssl\include" /I"C:\Users\FuYuHao\.node-gyp\10.14.1\deps\uv\include" /I"C:\Users\FuYuHao\.node-gyp\10.14.1\deps\zli b" /I"C:\Users\FuYuHao\.node-gyp\10.14.1\deps\v8\include" /I..\..\src\libsass\include /Z7 /nologo /W3 /WX- /diagnostics:classic /MP /Ox /Ob2 /Oi /Ot /Oy /GL /D NODE_GYP_MODULE_NAME=libsass /D USING_UV_SHARED=1 /D USING_ V8_SHARED=1 /D V8_DEPRECATION_WARNINGS=1 /D WIN32 /D _CRT_SECURE_NO_DEPRECATE /D _CRT_NONSTDC_NO_DEPRECATE /D _HAS_EXCEPTIONS=0 /D "LIBSASS_VERSION=\"3.5.4\"" /GF /Gm- /MT /GS /Gy /fp:precise /Zc:wchar_t /Zc:forScope /Z c:inline /GR- /Fo"Release\obj\libsass\\" /Fd"Release\obj\libsass\libsass.pdb" /Gd /TP /wd4351 /wd4355 /wd4800 /wd4251 /wd4275 /wd4244 /wd4267 /FC /errorReport:queue /GR /EHsc ..\..\src\libsass\src\ast.cpp ..\..\src\libs ass\src\ast_fwd_decl.cpp ..\..\src\libsass\src\backtrace.cpp ..\..\src\libsass\src\base64vlq.cpp ..\..\src\libsass\src\bind.cpp ..\..\src\libsass\src\check_nesting.cpp ..\..\src\libsass\src\color_maps.cpp ..\..\src\libs ass\src\constants.cpp ..\..\src\libsass\src\context.cpp ..\..\src\libsass\src\cssize.cpp ..\..\src\libsass\src\emitter.cpp ..\..\src\libsass\src\environment.cpp ..\..\src\libsass\src\error_handling.cpp ..\..\src\libsass \src\eval.cpp ..\..\src\libsass\src\expand.cpp ..\..\src\libsass\src\extend.cpp ..\..\src\libsass\src\file.cpp ..\..\src\libsass\src\functions.cpp ..\..\src\libsass\src\inspect.cpp ..\..\src\libsass\src\json.cpp ..\..\s rc\libsass\src\lexer.cpp ..\..\src\libsass\src\listize.cpp ..\..\src\libsass\src\memory\SharedPtr.cpp ..\..\src\libsass\src\node.cpp ..\..\src\libsass\src\operators.cpp ..\..\src\libsass\src\output.cpp ..\..\src\libsass \src\parser.cpp ..\..\src\libsass\src\plugins.cpp ..\..\src\libsass\src\position.cpp ..\..\src\libsass\src\prelexer.cpp ..\..\src\libsass\src\remove_placeholders.cpp ..\..\src\libsass\src\sass.cpp ..\..\src\libsass\src\ sass2scss.cpp ..\..\src\libsass\src\sass_context.cpp ..\..\src\libsass\src\sass_functions.cpp ..\..\src\libsass\src\sass_util.cpp ..\..\src\libsass\src\sass_values.cpp ..\..\src\libsass\src\source_map.cpp ..\..\src\libs ass\src\subset_map.cpp ..\..\src\libsass\src\to_c.cpp ..\..\src\libsass\src\to_value.cpp ..\..\src\libsass\src\units.cpp ..\..\src\libsass\src\utf8_string.cpp ..\..\src\libsass\src\util.cpp ..\..\src\libsass\src\values. cpp cl : 命令行 warning D9025: 正在重写“/GR-”(用“/GR”) [E:\Users\FuYuHao\Desktop\sb\a\aaa\node_modules\node-sass\build\src\libsass.vcxproj] cl : 命令行 warning D9025: 正在重写“/GR-”(用“/GR”) [E:\Users\FuYuHao\Desktop\sb\a\aaa\node_modules\node-sass\build\src\libsass.vcxproj] ast.cpp cl : 命令行 warning D9025: 正在重写“/GR-”(用“/GR”) [E:\Users\FuYuHao\Desktop\sb\a\aaa\node_modules\node-sass\build\src\libsass.vcxproj] ast_fwd_decl.cpp cl : 命令行 warning D9025: 正在重写“/GR-”(用“/GR”) [E:\Users\FuYuHao\Desktop\sb\a\aaa\node_modules\node-sass\build\src\libsass.vcxproj] backtrace.cpp cl : 命令行 warning D9025: 正在重写“/GR-”(用“/GR”) [E:\Users\FuYuHao\Desktop\sb\a\aaa\node_modules\node-sass\build\src\libsass.vcxproj] base64vlq.cpp bind.cpp check_nesting.cpp color_maps.cpp constants.cpp context.cpp cssize.cpp emitter.cpp environment.cpp error_handling.cpp eval.cpp expand.cpp extend.cpp file.cpp functions.cpp inspect.cpp json.cpp e:\users\fuyuhao\desktop\sb\a\aaa\node_modules\node-sass\src\libsass\src\json.cpp(26): warning C4005: “_CRT_NONSTDC_NO_DEPRECATE”: 宏重定义 [E:\Users\FuYuHao\Desktop\sb\a\aaa\node_modules\node-sass\build\src\libsass.vcxp roj] e:\users\fuyuhao\desktop\sb\a\aaa\node_modules\node-sass\src\libsass\src\json.cpp: note: 参见“_CRT_NONSTDC_NO_DEPRECATE”的前一个定义 lexer.cpp listize.cpp SharedPtr.cpp node.cpp operators.cpp output.cpp parser.cpp plugins.cpp position.cpp prelexer.cpp remove_placeholders.cpp sass.cpp sass2scss.cpp e:\users\fuyuhao\desktop\sb\a\aaa\node_modules\node-sass\src\libsass\src\sass2scss.cpp(9): warning C4005: “_CRT_NONSTDC_NO_DEPRECATE”: 宏重定义 [E:\Users\FuYuHao\Desktop\sb\a\aaa\node_modules\node-sass\build\src\libsass. vcxpr oj] e:\users\fuyuhao\desktop\sb\a\aaa\node_modules\node-sass\src\libsass\src\sass2scss.cpp: note: 参见“_CRT_NONSTDC_NO_DEPRECATE”的前一个定义 sass_context.cpp sass_functions.cpp sass_util.cpp sass_values.cpp source_map.cpp subset_map.cpp to_c.cpp to_value.cpp units.cpp utf8_string.cpp util.cpp values.cpp C:\Program Files (x86)\Microsoft Visual Studio\2017\BuildTools\VC\Tools\MSVC\14.16.27023\bin\HostX64\x64\CL.exe /c /I"C:\Users\FuYuHao\.node-gyp\10.14.1\include\node" /I"C:\Users\FuYuHao\.node-gyp\10.14.1\src" /I"C:\Use rs\FuYuHao\.node-gyp\10.14.1\deps\openssl\config" /I"C:\Users\FuYuHao\.node-gyp\10.14.1\deps\openssl\openssl\include" /I"C:\Users\FuYuHao\.node-gyp\10.14.1\deps\uv\include" /I"C:\Users\FuYuHao\.node-gyp\10.14.1\deps\zli b" /I"C:\Users\FuYuHao\.node-gyp\10.14.1\deps\v8\include" /I..\..\src\libsass\include /Z7 /nologo /W3 /WX- /diagnostics:classic /MP /Ox /Ob2 /Oi /Ot /Oy /GL /D NODE_GYP_MODULE_NAME=libsass /D USING_UV_SHARED=1 /D USING_ V8_SHARED=1 /D V8_DEPRECATION_WARNINGS=1 /D WIN32 /D _CRT_SECURE_NO_DEPRECATE /D _CRT_NONSTDC_NO_DEPRECATE /D _HAS_EXCEPTIONS=0 /D "LIBSASS_VERSION=\"3.5.4\"" /GF /Gm- /MT /GS /Gy /fp:precise /Zc:wchar_t /Zc:forScope /Z c:inline /GR- /Fo"Release\obj\libsass\\" /Fd"Release\obj\libsass\libsass.pdb" /Gd /TC /wd4351 /wd4355 /wd4800 /wd4251 /wd4275 /wd4244 /wd4267 /FC /errorReport:queue /GR /EHsc ..\..\src\libsass\src\cencode.c cl : 命令行 warning D9025: 正在重写“/GR-”(用“/GR”) [E:\Users\FuYuHao\Desktop\sb\a\aaa\node_modules\node-sass\build\src\libsass.vcxproj] cencode.c Lib: C:\Program Files (x86)\Microsoft Visual Studio\2017\BuildTools\VC\Tools\MSVC\14.16.27023\bin\HostX64\x64\Lib.exe /OUT:"E:\Users\FuYuHao\Desktop\sb\a\aaa\node_modules\node-sass\build\Release\libsass.lib" /NOLOGO /MACHINE :X64 /LTCG:INCREMENTAL Release\obj\libsass\ast.obj Release\obj\libsass\ast_fwd_decl.obj Release\obj\libsass\backtrace.obj Release\obj\libsass\base64vlq.obj Release\obj\libsass\bind.obj Release\obj\libsass\cencode.obj Release\obj\libsass\check_nesting.obj Release\obj\libsass\color_maps.obj Release\obj\libsass\constants.obj Release\obj\libsass\context.obj Release\obj\libsass\cssize.obj Release\obj\libsass\emitter.obj Release\obj\libsass\environment.obj Release\obj\libsass\error_handling.obj Release\obj\libsass\eval.obj Release\obj\libsass\expand.obj Release\obj\libsass\extend.obj Release\obj\libsass\file.obj Release\obj\libsass\functions.obj Release\obj\libsass\inspect.obj Release\obj\libsass\json.obj Release\obj\libsass\lexer.obj Release\obj\libsass\listize.obj Release\obj\libsass\SharedPtr.obj Release\obj\libsass\node.obj Release\obj\libsass\operators.obj Release\obj\libsass\output.obj Release\obj\libsass\parser.obj Release\obj\libsass\plugins.obj Release\obj\libsass\position.obj Release\obj\libsass\prelexer.obj Release\obj\libsass\remove_placeholders.obj Release\obj\libsass\sass.obj Release\obj\libsass\sass2scss.obj Release\obj\libsass\sass_context.obj Release\obj\libsass\sass_functions.obj Release\obj\libsass\sass_util.obj Release\obj\libsass\sass_values.obj Release\obj\libsass\source_map.obj Release\obj\libsass\subset_map.obj Release\obj\libsass\to_c.obj Release\obj\libsass\to_value.obj Release\obj\libsass\units.obj Release\obj\libsass\utf8_string.obj Release\obj\libsass\util.obj Release\obj\libsass\values.obj libsass.vcxproj -> E:\Users\FuYuHao\Desktop\sb\a\aaa\node_modules\node-sass\build\Release\\libsass.lib FinalizeBuildStatus: 正在删除文件“Release\obj\libsass\libsass.tlog\unsuccessfulbuild”。 正在对“Release\obj\libsass\libsass.tlog\libsass.lastbuildstate”执行 Touch 任务。 已完成生成项目“E:\Users\FuYuHao\Desktop\sb\a\aaa\node_modules\node-sass\build\src\libsass.vcxproj”(默认目标)的操作。 项目“E:\Users\FuYuHao\Desktop\sb\a\aaa\node_modules\node-sass\build\binding.vcxproj.metaproj”(2)正在节点 1 上生成“E:\Users\FuYuHao\Desktop\sb\a\aaa\node_modules\node-sass\build\binding.vcxproj”(4) (默认目标)。 PrepareForBuild: 正在创建目录“Release\obj\binding\”。 正在创建目录“Release\obj\binding\binding.tlog\”。 InitializeBuildStatus: 正在创建“Release\obj\binding\binding.tlog\unsuccessfulbuild”,因为已指定“AlwaysCreate”。 ClCompile: C:\Program Files (x86)\Microsoft Visual Studio\2017\BuildTools\VC\Tools\MSVC\14.16.27023\bin\HostX64\x64\CL.exe /c /I"C:\Users\FuYuHao\.node-gyp\10.14.1\include\node" /I"C:\Users\FuYuHao\.node-gyp\10.14.1\src" /I"C:\Use rs\FuYuHao\.node-gyp\10.14.1\deps\openssl\config" /I"C:\Users\FuYuHao\.node-gyp\10.14.1\deps\openssl\openssl\include" /I"C:\Users\FuYuHao\.node-gyp\10.14.1\deps\uv\include" /I"C:\Users\FuYuHao\.node-gyp\10.14.1\deps\zli b" /I"C:\Users\FuYuHao\.node-gyp\10.14.1\deps\v8\include" /I..\..\nan /I..\src\libsass\include /Z7 /nologo /W3 /WX- /diagnostics:classic /MP /Ox /Ob2 /Oi /Ot /Oy /GL /D NODE_GYP_MODULE_NAME=binding /D USING_UV_SHARED=1 /D USING_V8_SHARED=1 /D V8_DEPRECATION_WARNINGS=1 /D WIN32 /D _CRT_SECURE_NO_DEPRECATE /D _CRT_NONSTDC_NO_DEPRECATE /D _HAS_EXCEPTIONS=0 /D BUILDING_NODE_EXTENSION /D _WINDLL /GF /Gm- /MT /GS /Gy /fp:precise /Zc:wchar_t /Zc:forScope /Zc:inline /GR- /Fo"Release\obj\binding\\" /Fd"Release\obj\binding\vc141.pdb" /Gd /TP /wd4351 /wd4355 /wd4800 /wd4251 /wd4275 /wd4244 /wd4267 /FC /errorReport:queue /Zc:threadSafeInit- ..\src\binding.cpp . .\src\create_string.cpp ..\src\custom_function_bridge.cpp ..\src\custom_importer_bridge.cpp ..\src\sass_context_wrapper.cpp ..\src\sass_types\boolean.cpp ..\src\sass_types\color.cpp ..\src\sass_types\error.cpp ..\src\sa ss_types\factory.cpp ..\src\sass_types\list.cpp ..\src\sass_types\map.cpp ..\src\sass_types\null.cpp ..\src\sass_types\number.cpp ..\src\sass_types\string.cpp "E:\Users\FuYuHao\Desktop\sb\a\aaa\node_modules\node-gyp\src \win_delay_load_hook.cc" binding.cpp create_string.cpp custom_function_bridge.cpp custom_importer_bridge.cpp sass_context_wrapper.cpp boolean.cpp color.cpp error.cpp factory.cpp list.cpp map.cpp null.cpp number.cpp string.cpp win_delay_load_hook.cc Link: C:\Program Files (x86)\Microsoft Visual Studio\2017\BuildTools\VC\Tools\MSVC\14.16.27023\bin\HostX64\x64\link.exe /ERRORREPORT:QUEUE /OUT:"E:\Users\FuYuHao\Desktop\sb\a\aaa\node_modules\node-sass\build\Release\binding.n ode" /INCREMENTAL:NO /NOLOGO kernel32.lib user32.lib gdi32.lib winspool.lib comdlg32.lib advapi32.lib shell32.lib ole32.lib oleaut32.lib uuid.lib odbc32.lib DelayImp.lib "C:\Users\FuYuHao\.node-gyp\10.14.1\x64\node.lib" Delayimp.lib /DELAYLOAD:iojs.exe /DELAYLOAD:node.exe /MANIFEST /MANIFESTUAC:"level='asInvoker' uiAccess='false'" /manifest:embed /DEBUG /PDB:"E:\Users\FuYuHao\Desktop\sb\a\aaa\node_modules\node-sass\build\Release\bindi ng.pdb" /MAP /MAPINFO:EXPORTS /OPT:REF /OPT:ICF /TLBID:1 /RELEASE /DYNAMICBASE /NXCOMPAT /MACHINE:X64 /ignore:4199 /LTCG:INCREMENTAL /DLL Release\obj\binding\binding.obj Release\obj\binding\create_string.obj Release\obj\binding\custom_function_bridge.obj Release\obj\binding\custom_importer_bridge.obj Release\obj\binding\sass_context_wrapper.obj Release\obj\binding\boolean.obj Release\obj\binding\color.obj Release\obj\binding\error.obj Release\obj\binding\factory.obj Release\obj\binding\list.obj Release\obj\binding\map.obj Release\obj\binding\null.obj Release\obj\binding\number.obj Release\obj\binding\string.obj Release\obj\binding\win_delay_load_hook.obj "E:\Users\FuYuHao\Desktop\sb\a\aaa\node_modules\node-sass\build\Release\libsass.lib" C:\Users\FuYuHao\.node-gyp\10.14.1\x64\node.lib : fatal error LNK1107: 文件无效或损坏: 无法在 0x39F993 处读取 [E:\Users\FuYuHao\Desktop\sb\a\aaa\node_modules\node-sass\build\binding.vcxproj] 已完成生成项目“E:\Users\FuYuHao\Desktop\sb\a\aaa\node_modules\node-sass\build\binding.vcxproj”(默认目标)的操作 - 失败。 已完成生成项目“E:\Users\FuYuHao\Desktop\sb\a\aaa\node_modules\node-sass\build\binding.vcxproj.metaproj”(默认目标)的操作 - 失败。 已完成生成项目“E:\Users\FuYuHao\Desktop\sb\a\aaa\node_modules\node-sass\build\binding.sln”(默认目标)的操作 - 失败。 生成失败。 “E:\Users\FuYuHao\Desktop\sb\a\aaa\node_modules\node-sass\build\binding.sln”(默认目标) (1) -> “E:\Users\FuYuHao\Desktop\sb\a\aaa\node_modules\node-sass\build\binding.vcxproj.metaproj”(默认目标) (2) -> “E:\Users\FuYuHao\Desktop\sb\a\aaa\node_modules\node-sass\build\src\libsass.vcxproj”(默认目标) (3) -> (ClCompile 目标) -> cl : 命令行 warning D9025: 正在重写“/GR-”(用“/GR”) [E:\Users\FuYuHao\Desktop\sb\a\aaa\node_modules\node-sass\build\src\libsass.vcxproj] cl : 命令行 warning D9025: 正在重写“/GR-”(用“/GR”) [E:\Users\FuYuHao\Desktop\sb\a\aaa\node_modules\node-sass\build\src\libsass.vcxproj] cl : 命令行 warning D9025: 正在重写“/GR-”(用“/GR”) [E:\Users\FuYuHao\Desktop\sb\a\aaa\node_modules\node-sass\build\src\libsass.vcxproj] cl : 命令行 warning D9025: 正在重写“/GR-”(用“/GR”) [E:\Users\FuYuHao\Desktop\sb\a\aaa\node_modules\node-sass\build\src\libsass.vcxproj] cl : 命令行 warning D9025: 正在重写“/GR-”(用“/GR”) [E:\Users\FuYuHao\Desktop\sb\a\aaa\node_modules\node-sass\build\src\libsass.vcxproj] e:\users\fuyuhao\desktop\sb\a\aaa\node_modules\node-sass\src\libsass\src\json.cpp(26): warning C4005: “_CRT_NONSTDC_NO_DEPRECATE”: 宏重定义 [E:\Users\FuYuHao\Desktop\sb\a\aaa\node_modules\node-sass\build\src\libsass.vc xproj ] e:\users\fuyuhao\desktop\sb\a\aaa\node_modules\node-sass\src\libsass\src\sass2scss.cpp(9): warning C4005: “_CRT_NONSTDC_NO_DEPRECATE”: 宏重定义 [E:\Users\FuYuHao\Desktop\sb\a\aaa\node_modules\node-sass\build\src\libsas s.vcx proj] “E:\Users\FuYuHao\Desktop\sb\a\aaa\node_modules\node-sass\build\binding.sln”(默认目标) (1) -> “E:\Users\FuYuHao\Desktop\sb\a\aaa\node_modules\node-sass\build\binding.vcxproj.metaproj”(默认目标) (2) -> “E:\Users\FuYuHao\Desktop\sb\a\aaa\node_modules\node-sass\build\src\libsass.vcxproj”(默认目标) (3) -> cl : 命令行 warning D9025: 正在重写“/GR-”(用“/GR”) [E:\Users\FuYuHao\Desktop\sb\a\aaa\node_modules\node-sass\build\src\libsass.vcxproj] “E:\Users\FuYuHao\Desktop\sb\a\aaa\node_modules\node-sass\build\binding.sln”(默认目标) (1) -> “E:\Users\FuYuHao\Desktop\sb\a\aaa\node_modules\node-sass\build\binding.vcxproj.metaproj”(默认目标) (2) -> “E:\Users\FuYuHao\Desktop\sb\a\aaa\node_modules\node-sass\build\binding.vcxproj”(默认目标) (4) -> (Link 目标) -> C:\Users\FuYuHao\.node-gyp\10.14.1\x64\node.lib : fatal error LNK1107: 文件无效或损坏: 无法在 0x39F993 处读取 [E:\Users\FuYuHao\Desktop\sb\a\aaa\node_modules\node-sass\build\binding.vcxproj] 8 个警告 1 个错误 已用时间 00:00:24.13 gyp ERR! build error gyp ERR! stack Error: `C:\Program Files (x86)\Microsoft Visual Studio\2017\BuildTools\MSBuild\15.0\Bin\MSBuild.exe` failed with exit code: 1 gyp ERR! stack at ChildProcess.onExit (E:\Users\FuYuHao\Desktop\sb\a\aaa\node_modules\node-gyp\lib\build.js:262:23) gyp ERR! stack at ChildProcess.emit (events.js:182:13) gyp ERR! stack at Process.ChildProcess._handle.onexit (internal/child_process.js:240:12) gyp ERR! System Windows_NT 10.0.17763 gyp ERR! command "C:\\Program Files\\nodejs\\node.exe" "E:\\Users\\FuYuHao\\Desktop\\sb\\a\\aaa\\node_modules\\node-gyp\\bin\\node-gyp.js" "rebuild" "--verbose" "--libsass_ext=" "--libsass_cflags=" "--libsass_ldflags=" "--libsass_library=" gyp ERR! cwd E:\Users\FuYuHao\Desktop\sb\a\aaa\node_modules\node-sass gyp ERR! node -v v10.14.1 gyp ERR! node-gyp -v v3.8.0 gyp ERR! not ok Build failed with error code: 1 npm WARN optional SKIPPING OPTIONAL DEPENDENCY: fsevents@2.0.7 (node_modules\fsevents): npm WARN notsup SKIPPING OPTIONAL DEPENDENCY: Unsupported platform for fsevents@2.0.7: wanted {"os":"darwin","arch":"any"} (current: {"os":"win32","arch":"x64"}) npm WARN optional SKIPPING OPTIONAL DEPENDENCY: fsevents@1.2.9 (node_modules\watchpack\node_modules\fsevents): npm WARN notsup SKIPPING OPTIONAL DEPENDENCY: Unsupported platform for fsevents@1.2.9: wanted {"os":"darwin","arch":"any"} (current: {"os":"win32","arch":"x64"}) npm WARN optional SKIPPING OPTIONAL DEPENDENCY: fsevents@1.2.9 (node_modules\nodemon\node_modules\fsevents): npm WARN notsup SKIPPING OPTIONAL DEPENDENCY: Unsupported platform for fsevents@1.2.9: wanted {"os":"darwin","arch":"any"} (current: {"os":"win32","arch":"x64"}) npm ERR! code ELIFECYCLE npm ERR! errno 1 npm ERR! node-sass@4.12.0 postinstall: `node scripts/build.js` npm ERR! Exit status 1 npm ERR! npm ERR! Failed at the node-sass@4.12.0 postinstall script. npm ERR! This is probably not a problem with npm. There is likely additional logging output above. npm ERR! A complete log of this run can be found in: npm ERR! C:\Users\FuYuHao\AppData\Roaming\npm-cache\_logs\2019-05-29T14_01_39_903Z-debug.log PS E:\Users\FuYuHao\Desktop\sb\a\aaa> ```
Kafka实战(三) - Kafka的自我修养与定位
Apache Kafka是消息引擎系统,也是一个分布式流处理平台(Distributed Streaming Platform) Kafka是LinkedIn公司内部孵化的项目。LinkedIn最开始有强烈的数据强实时处理方面的需求,其内部的诸多子系统要执行多种类型的数据处理与分析,主要包括业务系统和应用程序性能监控,以及用户行为数据处理等。 遇到的主要问题: 数据正确性不足 数据的收集主要...
volatile 与 synchronize 详解
Java支持多个线程同时访问一个对象或者对象的成员变量,由于每个线程可以拥有这个变量的拷贝(虽然对象以及成员变量分配的内存是在共享内存中的,但是每个执行的线程还是可以拥有一份拷贝,这样做的目的是加速程序的执行,这是现代多核处理器的一个显著特性),所以程序在执行过程中,一个线程看到的变量并不一定是最新的。 volatile 关键字volatile可以用来修饰字段(成员变量),就是告知程序任何对该变量...
Java学习的正确打开方式
在博主认为,对于入门级学习java的最佳学习方法莫过于视频+博客+书籍+总结,前三者博主将淋漓尽致地挥毫于这篇博客文章中,至于总结在于个人,实际上越到后面你会发现学习的最好方式就是阅读参考官方文档其次就是国内的书籍,博客次之,这又是一个层次了,这里暂时不提后面再谈。博主将为各位入门java保驾护航,各位只管冲鸭!!!上天是公平的,只要不辜负时间,时间自然不会辜负你。 何谓学习?博主所理解的学习,它是一个过程,是一个不断累积、不断沉淀、不断总结、善于传达自己的个人见解以及乐于分享的过程。
程序员必须掌握的核心算法有哪些?
由于我之前一直强调数据结构以及算法学习的重要性,所以就有一些读者经常问我,数据结构与算法应该要学习到哪个程度呢?,说实话,这个问题我不知道要怎么回答你,主要取决于你想学习到哪些程度,不过针对这个问题,我稍微总结一下我学过的算法知识点,以及我觉得值得学习的算法。这些算法与数据结构的学习大多数是零散的,并没有一本把他们全部覆盖的书籍。下面是我觉得值得学习的一些算法以及数据结构,当然,我也会整理一些看过...
有哪些让程序员受益终生的建议
从业五年多,辗转两个大厂,出过书,创过业,从技术小白成长为基层管理,联合几个业内大牛回答下这个问题,希望能帮到大家,记得帮我点赞哦。 敲黑板!!!读了这篇文章,你将知道如何才能进大厂,如何实现财务自由,如何在工作中游刃有余,这篇文章很长,但绝对是精品,记得帮我点赞哦!!!! 一腔肺腑之言,能看进去多少,就看你自己了!!! 目录: 在校生篇: 为什么要尽量进大厂? 如何选择语言及方...
大学四年自学走来,这些私藏的实用工具/学习网站我贡献出来了
大学四年,看课本是不可能一直看课本的了,对于学习,特别是自学,善于搜索网上的一些资源来辅助,还是非常有必要的,下面我就把这几年私藏的各种资源,网站贡献出来给你们。主要有:电子书搜索、实用工具、在线视频学习网站、非视频学习网站、软件下载、面试/求职必备网站。 注意:文中提到的所有资源,文末我都给你整理好了,你们只管拿去,如果觉得不错,转发、分享就是最大的支持了。 一、电子书搜索 对于大部分程序员...
linux系列之常用运维命令整理笔录
本博客记录工作中需要的linux运维命令,大学时候开始接触linux,会一些基本操作,可是都没有整理起来,加上是做开发,不做运维,有些命令忘记了,所以现在整理成博客,当然vi,文件操作等就不介绍了,慢慢积累一些其它拓展的命令,博客不定时更新 free -m 其中:m表示兆,也可以用g,注意都要小写 Men:表示物理内存统计 total:表示物理内存总数(total=used+free) use...
比特币原理详解
一、什么是比特币 比特币是一种电子货币,是一种基于密码学的货币,在2008年11月1日由中本聪发表比特币白皮书,文中提出了一种去中心化的电子记账系统,我们平时的电子现金是银行来记账,因为银行的背后是国家信用。去中心化电子记账系统是参与者共同记账。比特币可以防止主权危机、信用风险。其好处不多做赘述,这一层面介绍的文章很多,本文主要从更深层的技术原理角度进行介绍。 二、问题引入 假设现有4个人...
GitHub开源史上最大规模中文知识图谱
近日,一直致力于知识图谱研究的 OwnThink 平台在 Github 上开源了史上最大规模 1.4 亿中文知识图谱,其中数据是以(实体、属性、值),(实体、关系、实体)混合的形式组织,数据格式采用 csv 格式。 到目前为止,OwnThink 项目开放了对话机器人、知识图谱、语义理解、自然语言处理工具。知识图谱融合了两千五百多万的实体,拥有亿级别的实体属性关系,机器人采用了基于知识图谱的语义感...
程序员接私活怎样防止做完了不给钱?
首先跟大家说明一点,我们做 IT 类的外包开发,是非标品开发,所以很有可能在开发过程中会有这样那样的需求修改,而这种需求修改很容易造成扯皮,进而影响到费用支付,甚至出现做完了项目收不到钱的情况。 那么,怎么保证自己的薪酬安全呢? 我们在开工前,一定要做好一些证据方面的准备(也就是“讨薪”的理论依据),这其中最重要的就是需求文档和验收标准。一定要让需求方提供这两个文档资料作为开发的基础。之后开发...
网页实现一个简单的音乐播放器(大佬别看。(⊙﹏⊙))
今天闲着无事,就想写点东西。然后听了下歌,就打算写个播放器。 于是乎用h5 audio的加上js简单的播放器完工了。 演示地点演示 html代码如下` music 这个年纪 七月的风 音乐 ` 然后就是css`*{ margin: 0; padding: 0; text-decoration: none; list-...
微信支付崩溃了,但是更让马化腾和张小龙崩溃的竟然是……
loonggg读完需要3分钟速读仅需1分钟事件还得还原到昨天晚上,10 月 29 日晚上 20:09-21:14 之间,微信支付发生故障,全国微信支付交易无法正常进行。然...
Python十大装B语法
Python 是一种代表简单思想的语言,其语法相对简单,很容易上手。不过,如果就此小视 Python 语法的精妙和深邃,那就大错特错了。本文精心筛选了最能展现 Python 语法之精妙的十个知识点,并附上详细的实例代码。如能在实战中融会贯通、灵活使用,必将使代码更为精炼、高效,同时也会极大提升代码B格,使之看上去更老练,读起来更优雅。
数据库优化 - SQL优化
以实际SQL入手,带你一步一步走上SQL优化之路!
2019年11月中国大陆编程语言排行榜
2019年11月2日,我统计了某招聘网站,获得有效程序员招聘数据9万条。针对招聘信息,提取编程语言关键字,并统计如下: 编程语言比例 rank pl_ percentage 1 java 33.62% 2 cpp 16.42% 3 c_sharp 12.82% 4 javascript 12.31% 5 python 7.93% 6 go 7.25% 7 p...
通俗易懂地给女朋友讲:线程池的内部原理
餐盘在灯光的照耀下格外晶莹洁白,女朋友拿起红酒杯轻轻地抿了一小口,对我说:“经常听你说线程池,到底线程池到底是个什么原理?”
《奇巧淫技》系列-python!!每天早上八点自动发送天气预报邮件到QQ邮箱
将代码部署服务器,每日早上定时获取到天气数据,并发送到邮箱。 也可以说是一个小型人工智障。 知识可以运用在不同地方,不一定非是天气预报。
经典算法(5)杨辉三角
杨辉三角 是经典算法,这篇博客对它的算法思想进行了讲解,并有完整的代码实现。
英特尔不为人知的 B 面
从 PC 时代至今,众人只知在 CPU、GPU、XPU、制程、工艺等战场中,英特尔在与同行硬件芯片制造商们的竞争中杀出重围,且在不断的成长进化中,成为全球知名的半导体公司。殊不知,在「刚硬」的背后,英特尔「柔性」的软件早已经做到了全方位的支持与支撑,并持续发挥独特的生态价值,推动产业合作共赢。 而对于这一不知人知的 B 面,很多人将其称之为英特尔隐形的翅膀,虽低调,但是影响力却不容小觑。 那么,在...
腾讯算法面试题:64匹马8个跑道需要多少轮才能选出最快的四匹?
昨天,有网友私信我,说去阿里面试,彻底的被打击到了。问了为什么网上大量使用ThreadLocal的源码都会加上private static?他被难住了,因为他从来都没有考虑过这个问题。无独有偶,今天笔者又发现有网友吐槽了一道腾讯的面试题,我们一起来看看。 腾讯算法面试题:64匹马8个跑道需要多少轮才能选出最快的四匹? 在互联网职场论坛,一名程序员发帖求助到。二面腾讯,其中一个算法题:64匹...
面试官:你连RESTful都不知道我怎么敢要你?
干货,2019 RESTful最贱实践
刷了几千道算法题,这些我私藏的刷题网站都在这里了!
遥想当年,机缘巧合入了 ACM 的坑,周边巨擘林立,从此过上了"天天被虐似死狗"的生活… 然而我是谁,我可是死狗中的战斗鸡,智力不够那刷题来凑,开始了夜以继日哼哧哼哧刷题的日子,从此"读题与提交齐飞, AC 与 WA 一色 ",我惊喜的发现被题虐既刺激又有快感,那一刻我泪流满面。这么好的事儿作为一个正直的人绝不能自己独享,经过激烈的颅内斗争,我决定把我私藏的十几个 T 的,阿不,十几个刷题网...
为啥国人偏爱Mybatis,而老外喜欢Hibernate/JPA呢?
关于SQL和ORM的争论,永远都不会终止,我也一直在思考这个问题。昨天又跟群里的小伙伴进行了一番讨论,感触还是有一些,于是就有了今天这篇文。 声明:本文不会下关于Mybatis和JPA两个持久层框架哪个更好这样的结论。只是摆事实,讲道理,所以,请各位看官勿喷。 一、事件起因 关于Mybatis和JPA孰优孰劣的问题,争论已经很多年了。一直也没有结论,毕竟每个人的喜好和习惯是大不相同的。我也看...
白话阿里巴巴Java开发手册高级篇
不久前,阿里巴巴发布了《阿里巴巴Java开发手册》,总结了阿里巴巴内部实际项目开发过程中开发人员应该遵守的研发流程规范,这些流程规范在一定程度上能够保证最终的项目交付质量,通过在时间中总结模式,并推广给广大开发人员,来避免研发人员在实践中容易犯的错误,确保最终在大规模协作的项目中达成既定目标。 无独有偶,笔者去年在公司里负责升级和制定研发流程、设计模板、设计标准、代码标准等规范,并在实际工作中进行...
SQL-小白最佳入门sql查询一
不要偷偷的查询我的个人资料,即使你再喜欢我,也不要这样,真的不好;
项目中的if else太多了,该怎么重构?
介绍 最近跟着公司的大佬开发了一款IM系统,类似QQ和微信哈,就是聊天软件。我们有一部分业务逻辑是这样的 if (msgType = "文本") { // dosomething } else if(msgType = "图片") { // doshomething } else if(msgType = "视频") { // doshomething } else { // doshom...
Nginx 原理和架构
Nginx 是一个免费的,开源的,高性能的 HTTP 服务器和反向代理,以及 IMAP / POP3 代理服务器。Nginx 以其高性能,稳定性,丰富的功能,简单的配置和低资源消耗而闻名。 Nginx 的整体架构 Nginx 里有一个 master 进程和多个 worker 进程。master 进程并不处理网络请求,主要负责调度工作进程:加载配置、启动工作进程及非停升级。worker 进程负责处...
YouTube排名第一的励志英文演讲《Dream(梦想)》
Idon’t know what that dream is that you have, I don't care how disappointing it might have been as you've been working toward that dream,but that dream that you’re holding in your mind, that it’s po...
“狗屁不通文章生成器”登顶GitHub热榜,分分钟写出万字形式主义大作
一、垃圾文字生成器介绍 最近在浏览GitHub的时候,发现了这样一个骨骼清奇的雷人项目,而且热度还特别高。 项目中文名:狗屁不通文章生成器 项目英文名:BullshitGenerator 根据作者的介绍,他是偶尔需要一些中文文字用于GUI开发时测试文本渲染,因此开发了这个废话生成器。但由于生成的废话实在是太过富于哲理,所以最近已经被小伙伴们给玩坏了。 他的文风可能是这样的: 你发现,...
程序员:我终于知道post和get的区别
是一个老生常谈的话题,然而随着不断的学习,对于以前的认识有很多误区,所以还是需要不断地总结的,学而时习之,不亦说乎
《程序人生》系列-这个程序员只用了20行代码就拿了冠军
你知道的越多,你不知道的越多 点赞再看,养成习惯GitHub上已经开源https://github.com/JavaFamily,有一线大厂面试点脑图,欢迎Star和完善 前言 这一期不算《吊打面试官》系列的,所有没前言我直接开始。 絮叨 本来应该是没有这期的,看过我上期的小伙伴应该是知道的嘛,双十一比较忙嘛,要值班又要去帮忙拍摄年会的视频素材,还得搞个程序员一天的Vlog,还要写BU...
加快推动区块链技术和产业创新发展,2019可信区块链峰会在京召开
11月8日,由中国信息通信研究院、中国通信标准化协会、中国互联网协会、可信区块链推进计划联合主办,科技行者协办的2019可信区块链峰会将在北京悠唐皇冠假日酒店开幕。   区块链技术被认为是继蒸汽机、电力、互联网之后,下一代颠覆性的核心技术。如果说蒸汽机释放了人类的生产力,电力解决了人类基本的生活需求,互联网彻底改变了信息传递的方式,区块链作为构造信任的技术有重要的价值。   1...
Python 植物大战僵尸代码实现(2):植物卡片选择和种植
这篇文章要介绍的是: - 上方植物卡片栏的实现。 - 点击植物卡片,鼠标切换为植物图片。 - 鼠标移动时,判断当前在哪个方格中,并显示半透明的植物作为提示。
Java世界最常用的工具类库
Apache Commons Apache Commons有很多子项目 Google Guava 参考博客
程序员把地府后台管理系统做出来了,还有3.0版本!12月7号最新消息:已在开发中有github地址
第一幕:缘起 听说阎王爷要做个生死簿后台管理系统,我们派去了一个程序员…… 996程序员做的梦: 第一场:团队招募 为了应对地府管理危机,阎王打算找“人”开发一套地府后台管理系统,于是就在地府总经办群中发了项目需求。 话说还是中国电信的信号好,地府都是满格,哈哈!!! 经常会有外行朋友问:看某网站做的不错,功能也简单,你帮忙做一下? 而这次,面对这样的需求,这个程序员...
网易云6亿用户音乐推荐算法
网易云音乐是音乐爱好者的集聚地,云音乐推荐系统致力于通过 AI 算法的落地,实现用户千人千面的个性化推荐,为用户带来不一样的听歌体验。 本次分享重点介绍 AI 算法在音乐推荐中的应用实践,以及在算法落地过程中遇到的挑战和解决方案。 将从如下两个部分展开: AI算法在音乐推荐中的应用 音乐场景下的 AI 思考 从 2013 年 4 月正式上线至今,网易云音乐平台持续提供着:乐屏社区、UGC...
【技巧总结】位运算装逼指南
位算法的效率有多快我就不说,不信你可以去用 10 亿个数据模拟一下,今天给大家讲一讲位运算的一些经典例子。不过,最重要的不是看懂了这些例子就好,而是要在以后多去运用位运算这些技巧,当然,采用位运算,也是可以装逼的,不信,你往下看。我会从最简单的讲起,一道比一道难度递增,不过居然是讲技巧,那么也不会太难,相信你分分钟看懂。 判断奇偶数 判断一个数是基于还是偶数,相信很多人都做过,一般的做法的代码如下...
8年经验面试官详解 Java 面试秘诀
作者 |胡书敏 责编 | 刘静 出品 | CSDN(ID:CSDNnews) 本人目前在一家知名外企担任架构师,而且最近八年来,在多家外企和互联网公司担任Java技术面试官,前后累计面试了有两三百位候选人。在本文里,就将结合本人的面试经验,针对Java初学者、Java初级开发和Java开发,给出若干准备简历和准备面试的建议。 Java程序员准备和投递简历的实...
面试官如何考察你的思维方式?
1.两种思维方式在求职面试中,经常会考察这种问题:北京有多少量特斯拉汽车?某胡同口的煎饼摊一年能卖出多少个煎饼?深圳有多少个产品经理?一辆公交车里能装下多少个乒乓球?一个正常成年人有多少根头发?这类估算问题,被称为费米问题,是以科学家费米命名的。为什么面试会问这种问题呢?这类问题能把两类人清楚地区分出来。一类是具有文科思维的人,擅长赞叹和模糊想象,它主要依靠的是人的第一反应和直觉,比如小孩...
27 个提升开发幸福度的 VsCode 插件
作者:Jsmanifest 译者:前端小智 来源:Medium Visual Studio Code(也称为VSCode)是一种轻量级但功能强大的跨平台源代码编辑器, 借助对TypeScript 和Chrome调试器等开发工具的内置支持,越来越多的开发都都喜欢使用它。 如果你正在寻找更多的好用的 VsCode 工具,那么这篇或许能够帮助你。以下是 2019年为 JS 开发者提供的26...
相关热词 基于c#波形控件 c# 十进制转十六进制 对文件aes加密vc# c#读取栈中所有的值 c# rsa256加密 好 学c# 还是c++ c# 和java的差距 c# curl网络框架 c# https证书请求 c# 中崎
立即提问