python3.7 下载email包,一直报错

C:\Users\111>pip -V
pip 19.1.1 from D:\Python37\lib\site-packages\pip-19.1.1-py3.7.egg\pip (python 3.7)
C:\Users\111>pip install email
Collecting email
Using cached https://files.pythonhosted.org/packages/71/e7/816030d3b0426c130040bd068be62b9213357ed02896f5d9badcf46d1b5f/email-4.0.2.tar.gz

    ERROR: Complete output from command python setup.py egg_info:
ERROR: Traceback (most recent call last):
  File "<string>", line 1, in <module>
  File "D:\Python37\lib\site-packages\setuptools\__init__.py", line 12, in <module>
    import setuptools.version
  File "D:\Python37\lib\site-packages\setuptools\version.py", line 1, in <module>
    import pkg_resources
  File "D:\Python37\lib\site-packages\pkg_resources\__init__.py", line 36, in <module>
    import email.parser
  File "C:\Users\111\AppData\Local\Temp\pip-install-i6c6xiar\email\email\parser.py", line 10, in <module>
    from cStringIO import StringIO
ModuleNotFoundError: No module named 'cStringIO'
----------------------------------------


 ERROR: Command "python setup.py egg_info" failed with error code 1 in C:\Users\111\AppData\Local\Temp\pip-install-i6c6xiar\email\

Csdn user default icon
上传中...
上传图片
插入图片
抄袭、复制答案,以达到刷声望分或其他目的的行为,在CSDN问答是严格禁止的,一经发现立刻封号。是时候展现真正的技术了!
其他相关推荐
python3.7安装email库出现报错
下面是全部报错信息 ``` Collecting email Downloading https://files.pythonhosted.org/packages/71/e7/816030d3b0426c130040bd068be62b9213357ed02896f5d9badcf46d1b5f/email-4.0.2.tar.gz (1.2MB) |████████████████████████████████| 1.2MB 11kB/s ERROR: Complete output from command python setup.py egg_info: ERROR: Traceback (most recent call last): File "<string>", line 1, in <module> File "d:\软件\python3.7.3\lib\site-packages\setuptools\__init__.py", line 18, in <module> import setuptools.version File "d:\软件\python3.7.3\lib\site-packages\setuptools\version.py", line 1, in <module> import pkg_resources File "d:\软件\python3.7.3\lib\site-packages\pkg_resources\__init__.py", line 36, in <module> import email.parser File "C:\Users\wenrui\AppData\Local\Temp\pip-install-zuekqdy0\email\email\parser.py", line 10, in <module> from cStringIO import StringIO ModuleNotFoundError: No module named 'cStringIO' ---------------------------------------- ERROR: Command "python setup.py egg_info" failed with error code 1 in C:\Users\wenrui\AppData\Local\Temp\pip-install-zuekqdy0\email\ ```
python 3.7引用docx操作word文档报错exception
python 3.7引用docx操作word文档报错“docx.opc.exceptions.PackageNotFoundError: Package not found at.....”,网上搜的方法都尝试过了,没有用。python__docx-0.8.6-py2.py3-none-any.whl这个包已经没有了,下载了python__docx-0.8.7-py2.py3-none-any.whl。但是仍然报错。求大神帮忙,给个终极解决办法。
python2.7导入goose包失败
安装goose包时失败,报如下错: File "F:\python2.7.13\lib\site-packages\goose\__init__.py", line 26, in <module> from goose.crawler import CrawlCandidate File "F:\python2.7.13\lib\site-packages\goose\crawler.py", line 28, in <module> from goose.extractors import StandardContentExtractor ImportError: cannot import name StandardContentExtractor 请问要怎么解决?
python3.6安装pypsa包时报错,无法安装。
在使用pip install pypsa,安装报错如下![图片说明](https://img-ask.csdn.net/upload/201910/15/1571110476_72432.png)![图片说明](https://img-ask.csdn.net/upload/201910/15/1571110486_931164.png) ERROR: Command errored out with exit status 1: command: 'd:\python3\python.exe' 'd:\python3\lib\site-packages\pip\_vendor\pep517\_in_process.py' get_requires_for_build_wheel 'C:\Users\xyrrrr\AppData\Local\Temp\tmpk8s4cp1x' cwd: C:\Users\xyrrrr\AppData\Local\Temp\pip-install-y9r5hyt9\cartopy Complete output (3 lines): setup.py:171: UserWarning: Unable to determine GEOS version. Ensure you have 3.3.3 or later installed, or installation may fail. '.'.join(str(v) for v in GEOS_MIN_VERSION), )) Proj 4.9.0 must be installed. ---------------------------------------- ERROR: Command errored out with exit status 1: 'd:\python3\python.exe' 'd:\python3\lib\site-packages\pip\_vendor\pep517\_in_process.py' get_requires_for_build_wheel 'C:\Users\xyrrrr\AppData\Local\Temp\tmpk8s4cp1x' Check the logs for full command output. 查了很多,真的不懂如何解决,小白求专业人士帮助!谢谢。 一天也没解决,我就是一个刚下载python的小白 饶了我吧
如何在django中使用mysql自带的MySQL Connector Python 8.0 for Python 3.7?
django连接mysql提示 django.core.exceptions.ImproperlyConfigured: Error loading MySQLdb module. Did you install mysqlclient? 也就是说要我pip install mysqlclient 可我安装mysql的时候自带MySQL Connector Python 8.0 for Python 3.7 C:\Program Files\MySQL\MySQL Connector Python 8.0 for Python 3.7 也就是说我只要告诉django连接mysql用这个目录里的文件就好了... 可我怎么才能让django知道这件事...
python3.7配置了pip,安装3.7对应的pygame一直安装不成功显示找不到对应是什么问题?
如图一,python3.7配置了pip19.3.1,安装3.7对应的pygame一直安装不成功,提示找不到对应版本,求教下这个怎么解决?![图片说明](https://img-ask.csdn.net/upload/201912/02/1575216297_77750.png) 使用powershell配置,结果如下: ![图片说明](https://img-ask.csdn.net/upload/201912/02/1575216352_197983.png)
python3.7+selenuim3.141 无法打开新页签
## python3.7+selenuim3.141 无法打开新页签 在ie11环境下执行window.open("http://www.baidu.com")js脚本, 执行成功但不打开新页签 ![图片说明](https://img-ask.csdn.net/upload/202001/08/1578451689_396113.png)
python3.7 安装requests报错,求大神支招?
python3.7 通过pip 安装requests 报错,百度上也查过很多方法 1、通过更改源 2、通过wheel安装 3、pip --timout=60000等方式都不能解决 公司每台电脑上都装了赛门铁克(Symantec),会不会与这个有影响。 求详细解决方式 报错如下: ![图片说明](https://img-ask.csdn.net/upload/201906/10/1560136696_190131.jpg) Retrying (Retry(total=4, connect=None, read=None, redirect=None, status=None)) after connection broken by 'ConnectTimeoutError(<pip._vendor.urllib3.connection.VerifiedHTTPSConnection object at 0x0000000003F7B588>, 'Connection to pypi.org timed out. (connect timeout=15)')': /simple/requests/
python3.7.0安装aiodns包出现问题
python3.7.0安装whl包出现问题,提示缺少C++14.0 ![![图片说明](https://img-ask.csdn.net/upload/201807/28/1532745998_112893.png) 图片说明](https://img-ask.csdn.net/upload/201807/28/1532745984_838831.png)
装了python3.7 大包的时候显示python3不是内部或外部指令
环境是windows10,官网下载了python3.7 安装的时候也勾选了Add to path选项,看到环境变量里也有python的路径,但是运行Head first python里面大包的例子的时候显示python3不是内部或者外部指令如图: ![图片说明](https://img-ask.csdn.net/upload/201808/29/1535519161_269989.png) 但是运行python setup.py sdist可以识别python指令,但是报语法错误。请问怎么设置才能打包成功呢
执行python manage.py migrate命令有问题
我在windows系统搭建了开发环境,使用的是pytohn2.7版本,在本地开发环境验证测试,执行python manage.py migrate命令有问题: 我在这个位置执行的命令: ![图片说明](https://img-ask.csdn.net/upload/201912/16/1576467780_425609.png) 报错如下: ![图片说明](https://img-ask.csdn.net/upload/201912/16/1576467889_633346.png) D:\python2.7\python2.7\Lib\site-packages\django\conf\project_template>python manage.py migrate Traceback (most recent call last): File "manage.py", line 10, in <module> execute_from_command_line(sys.argv) File "D:\python2.7\python2.7\lib\site-packages\django\core\management\__init__.py", line 338, in execute_from_command_line utility.execute() File "D:\python2.7\python2.7\lib\site-packages\django\core\management\__init__.py", line 303, in execute settings.INSTALLED_APPS File "D:\python2.7\python2.7\lib\site-packages\django\conf\__init__.py", line 48, in __getattr__ self._setup(name) File "D:\python2.7\python2.7\lib\site-packages\django\conf\__init__.py", line 44, in _setup self._wrapped = Settings(settings_module) File "D:\python2.7\python2.7\lib\site-packages\django\conf\__init__.py", line 92, in __init__ mod = importlib.import_module(self.SETTINGS_MODULE) File "D:\python2.7\python2.7\lib\importlib\__init__.py", line 37, in import_module __import__(name) ImportError: No module named {{ project_name }}.settings 求大神指教,是我执行的目录位置有问题吗?
python2.7下使用smtplib模块发送邮件,报错
有没有大佬知道python2.7下使用smtplib模块发送邮件,报错 ``` 552, '2ee45dcd00e3ada-0fff9 Sender daily sent mail exceed limit ``` 但是用windows环境能正常跑,放到生产环境就报错了嘤嘤嘤,求助
安装python3.3.3+pywin32-219.win32-py3.3.exe报错
安装python3.3.3+pywin32-219.win32-py3.3.exe报错,错误如下,麻烦大师指导,谢谢!![图片说明](https://img-ask.csdn.net/upload/201510/26/1445840075_922784.png)
Python2.7里的intobject和stringobject在python3.6里去哪了?
最近在看python源码,python2.7里的intobject和stringobject在python3.6里面没找到。
用Boost.python把.cpp文件生成.py文件时,一直报错。
用Boost.python把.cpp文件生成.py文件时,一直报boost的错。 boost版本是1.70,平台上windows10. ![图片说明](https://img-ask.csdn.net/upload/201905/13/1557756166_850750.png) 出错代码(vs2017划红线): # define N BOOST_PP_RELATIVE_ITERATION(1) # define Q BOOST_PYTHON_CV_QUALIFIER(BOOST_PP_ITERATION()) template < class RT, class ClassT BOOST_PP_ENUM_TRAILING_PARAMS_Z(1, N, class T)> inline BOOST_PYTHON_LIST_INC(BOOST_PP_INC(N))< RT, ClassT& BOOST_PP_ENUM_TRAILING_PARAMS_Z(1, N, T)> get_signature(RT(BOOST_PYTHON_FN_CC ClassT::*)(BOOST_PP_ENUM_PARAMS_Z(1, N, T)) Q) { return BOOST_PYTHON_LIST_INC(BOOST_PP_INC(N))< RT, ClassT& BOOST_PP_ENUM_TRAILING_PARAMS_Z(1, N, T) >(); } ``` ![图片说明](https://img-ask.csdn.net/upload/201905/13/1557756593_911842.png) 求帮忙啊啊啊
Pyltp有没有适用于python3.8的版本
我在构建知识图谱的时候想使用Pyltp,用pip直接安装会报错,于是想直接下载,想请教一下各位大佬Pyltp有没有适用于python3.8的版本,还是说pyltp0.2.1就可以适用
ubuntu18.04 python3.6 pip安装mysqlclient报错
ubuntu18.04 python3.6 pip安装mysqlclient报错 求大佬解答 ``` Building wheels for collected packages: mysqlclient Running setup.py bdist_wheel for mysqlclient ... error Complete output from command /usr/bin/python3 -u -c "import setuptools, tokenize;__file__='/tmp/pip-build-njxuuzpo/mysqlclient/setup.py';f=getattr(tokenize, 'open', open)(__file__);code=f.read().replace('\r\n', '\n');f.close();exec(compile(code, __file__, 'exec'))" bdist_wheel -d /tmp/tmpzs54ny_2pip-wheel- --python-tag cp36: running bdist_wheel running build running build_py creating build creating build/lib.linux-x86_64-3.6 creating build/lib.linux-x86_64-3.6/MySQLdb copying MySQLdb/__init__.py -> build/lib.linux-x86_64-3.6/MySQLdb copying MySQLdb/_exceptions.py -> build/lib.linux-x86_64-3.6/MySQLdb copying MySQLdb/compat.py -> build/lib.linux-x86_64-3.6/MySQLdb copying MySQLdb/connections.py -> build/lib.linux-x86_64-3.6/MySQLdb copying MySQLdb/converters.py -> build/lib.linux-x86_64-3.6/MySQLdb copying MySQLdb/cursors.py -> build/lib.linux-x86_64-3.6/MySQLdb copying MySQLdb/release.py -> build/lib.linux-x86_64-3.6/MySQLdb copying MySQLdb/times.py -> build/lib.linux-x86_64-3.6/MySQLdb creating build/lib.linux-x86_64-3.6/MySQLdb/constants copying MySQLdb/constants/__init__.py -> build/lib.linux-x86_64-3.6/MySQLdb/constants copying MySQLdb/constants/CLIENT.py -> build/lib.linux-x86_64-3.6/MySQLdb/constants copying MySQLdb/constants/CR.py -> build/lib.linux-x86_64-3.6/MySQLdb/constants copying MySQLdb/constants/ER.py -> build/lib.linux-x86_64-3.6/MySQLdb/constants copying MySQLdb/constants/FIELD_TYPE.py -> build/lib.linux-x86_64-3.6/MySQLdb/constants copying MySQLdb/constants/FLAG.py -> build/lib.linux-x86_64-3.6/MySQLdb/constants running build_ext building 'MySQLdb._mysql' extension creating build/temp.linux-x86_64-3.6 creating build/temp.linux-x86_64-3.6/MySQLdb x86_64-linux-gnu-gcc -pthread -DNDEBUG -g -fwrapv -O2 -Wall -g -fstack-protector-strong -Wformat -Werror=format-security -Wdate-time -D_FORTIFY_SOURCE=2 -fPIC -Dversion_info=(1,4,5,'final',0) -D__version__=1.4.5 -I/usr/include/mysql -I/usr/include/python3.6m -c MySQLdb/_mysql.c -o build/temp.linux-x86_64-3.6/MySQLdb/_mysql.o x86_64-linux-gnu-gcc -pthread -shared -Wl,-O1 -Wl,-Bsymbolic-functions -Wl,-Bsymbolic-functions -Wl,-z,relro -Wl,-Bsymbolic-functions -Wl,-z,relro -g -fstack-protector-strong -Wformat -Werror=format-security -Wdate-time -D_FORTIFY_SOURCE=2 build/temp.linux-x86_64-3.6/MySQLdb/_mysql.o -lmysqlclient -lpthread -lz -lm -lrt -latomic -lssl -lcrypto -ldl -o build/lib.linux-x86_64-3.6/MySQLdb/_mysql.cpython-36m-x86_64-linux-gnu.so /usr/bin/ld: cannot find -lssl /usr/bin/ld: cannot find -lcrypto collect2: error: ld returned 1 exit status error: command 'x86_64-linux-gnu-gcc' failed with exit status 1 ---------------------------------------- Failed building wheel for mysqlclient Running setup.py clean for mysqlclient Failed to build mysqlclient Installing collected packages: mysqlclient Running setup.py install for mysqlclient ... error Complete output from command /usr/bin/python3 -u -c "import setuptools, tokenize;__file__='/tmp/pip-build-njxuuzpo/mysqlclient/setup.py';f=getattr(tokenize, 'open', open)(__file__);code=f.read().replace('\r\n', '\n');f.close();exec(compile(code, __file__, 'exec'))" install --record /tmp/pip-ldoqhl56-record/install-record.txt --single-version-externally-managed --compile --user --prefix=: running install running build running build_py creating build creating build/lib.linux-x86_64-3.6 creating build/lib.linux-x86_64-3.6/MySQLdb copying MySQLdb/__init__.py -> build/lib.linux-x86_64-3.6/MySQLdb copying MySQLdb/_exceptions.py -> build/lib.linux-x86_64-3.6/MySQLdb copying MySQLdb/compat.py -> build/lib.linux-x86_64-3.6/MySQLdb copying MySQLdb/connections.py -> build/lib.linux-x86_64-3.6/MySQLdb copying MySQLdb/converters.py -> build/lib.linux-x86_64-3.6/MySQLdb copying MySQLdb/cursors.py -> build/lib.linux-x86_64-3.6/MySQLdb copying MySQLdb/release.py -> build/lib.linux-x86_64-3.6/MySQLdb copying MySQLdb/times.py -> build/lib.linux-x86_64-3.6/MySQLdb creating build/lib.linux-x86_64-3.6/MySQLdb/constants copying MySQLdb/constants/__init__.py -> build/lib.linux-x86_64-3.6/MySQLdb/constants copying MySQLdb/constants/CLIENT.py -> build/lib.linux-x86_64-3.6/MySQLdb/constants copying MySQLdb/constants/CR.py -> build/lib.linux-x86_64-3.6/MySQLdb/constants copying MySQLdb/constants/ER.py -> build/lib.linux-x86_64-3.6/MySQLdb/constants copying MySQLdb/constants/FIELD_TYPE.py -> build/lib.linux-x86_64-3.6/MySQLdb/constants copying MySQLdb/constants/FLAG.py -> build/lib.linux-x86_64-3.6/MySQLdb/constants running build_ext building 'MySQLdb._mysql' extension creating build/temp.linux-x86_64-3.6 creating build/temp.linux-x86_64-3.6/MySQLdb x86_64-linux-gnu-gcc -pthread -DNDEBUG -g -fwrapv -O2 -Wall -g -fstack-protector-strong -Wformat -Werror=format-security -Wdate-time -D_FORTIFY_SOURCE=2 -fPIC -Dversion_info=(1,4,5,'final',0) -D__version__=1.4.5 -I/usr/include/mysql -I/usr/include/python3.6m -c MySQLdb/_mysql.c -o build/temp.linux-x86_64-3.6/MySQLdb/_mysql.o x86_64-linux-gnu-gcc -pthread -shared -Wl,-O1 -Wl,-Bsymbolic-functions -Wl,-Bsymbolic-functions -Wl,-z,relro -Wl,-Bsymbolic-functions -Wl,-z,relro -g -fstack-protector-strong -Wformat -Werror=format-security -Wdate-time -D_FORTIFY_SOURCE=2 build/temp.linux-x86_64-3.6/MySQLdb/_mysql.o -lmysqlclient -lpthread -lz -lm -lrt -latomic -lssl -lcrypto -ldl -o build/lib.linux-x86_64-3.6/MySQLdb/_mysql.cpython-36m-x86_64-linux-gnu.so /usr/bin/ld: cannot find -lssl /usr/bin/ld: cannot find -lcrypto collect2: error: ld returned 1 exit status error: command 'x86_64-linux-gnu-gcc' failed with exit status 1 ---------------------------------------- Command "/usr/bin/python3 -u -c "import setuptools, tokenize;__file__='/tmp/pip-build-njxuuzpo/mysqlclient/setup.py';f=getattr(tokenize, 'open', open)(__file__);code=f.read().replace('\r\n', '\n');f.close();exec(compile(code, __file__, 'exec'))" install --record /tmp/pip-ldoqhl56-record/install-record.txt --single-version-externally-managed --compile --user --prefix=" failed with error code 1 in /tmp/pip-build-njxuuzpo/mysqlclient/ ```
【求助】Anaconda 建立python 3.6 新环境后,激活环境,进入python交互模式又变回原来的python3.7 。
我用anaconda创建了基于python3.6的新环境,如下图,名为tensorflow: ![图片说明](https://img-ask.csdn.net/upload/201905/03/1556847480_762671.png) 但当我激活它之后(无论是通过conda avtivate tensorflow命令激活还是通过anaconda navigator激活),如下图: ![图片说明](https://img-ask.csdn.net/upload/201905/03/1556847588_126399.png) 这应该代表环境被激活了吧。但当我进入python交互模式后,却显示python版本为3.7,是我base环境中原来的python,如下图: ![图片说明](https://img-ask.csdn.net/upload/201905/03/1556847699_806573.png) 这是为什么呢? 当我找到该新建环境的目录,并打开其中的python.exe之后,python为3.6版本,这说明该环境确实是基于python3.6的,但是却显示该环境为被激活,如下图: ![图片说明](https://img-ask.csdn.net/upload/201905/03/1556847881_114908.png) ![图片说明](https://img-ask.csdn.net/upload/201905/03/1556847864_39961.png) 这是什么原因呢?似乎无法激活环境啊?为什么我激活了环境,进入交互界面,却又变为原来的python3.7呢? 请各位大神帮忙看看,万分感激!!
python3.5 用socket提取图片报错,急!
我在学习Python for Information 这本书,第12章是用socket去抓取一张网络图片,但是报错UnicodeDecodeError: 'utf-8' codec can't decode byte 0xff in position 246: invalid start byte 用python 2.7是可以正常用的,但是python3.5 在 这句报错 ``` picture = picture + bytes.decode(data) ``` 请大神指点下解决方法 ``` import socket import time mysock = socket.socket(socket.AF_INET, socket.SOCK_STREAM) mysock.connect(('www.py4inf.com', 80)) s = 'GET http://www.py4inf.com/cover.jpg HTTP/1.0\n\n' mysock.send(str.encode(s)) count = 0 picture = '' while True: data = mysock.recv(5120) if (len(data) < 1): break #time.sleep(0.25) count = count + len(data) print(len(data), count) picture = picture + bytes.decode(data) mysock.close() # Look for the end of header pos = picture.find('\r\n\r\n') print('Header length', pos) print(picture[:pos]) # Skip past the header and save the picture data picture = picture[pos+4:] fhand = open('stuff.jpg', 'wb') fhand.write(picture) fhand.close() ```
Java学习的正确打开方式
在博主认为,对于入门级学习java的最佳学习方法莫过于视频+博客+书籍+总结,前三者博主将淋漓尽致地挥毫于这篇博客文章中,至于总结在于个人,实际上越到后面你会发现学习的最好方式就是阅读参考官方文档其次就是国内的书籍,博客次之,这又是一个层次了,这里暂时不提后面再谈。博主将为各位入门java保驾护航,各位只管冲鸭!!!上天是公平的,只要不辜负时间,时间自然不会辜负你。 何谓学习?博主所理解的学习,它是一个过程,是一个不断累积、不断沉淀、不断总结、善于传达自己的个人见解以及乐于分享的过程。
程序员必须掌握的核心算法有哪些?
由于我之前一直强调数据结构以及算法学习的重要性,所以就有一些读者经常问我,数据结构与算法应该要学习到哪个程度呢?,说实话,这个问题我不知道要怎么回答你,主要取决于你想学习到哪些程度,不过针对这个问题,我稍微总结一下我学过的算法知识点,以及我觉得值得学习的算法。这些算法与数据结构的学习大多数是零散的,并没有一本把他们全部覆盖的书籍。下面是我觉得值得学习的一些算法以及数据结构,当然,我也会整理一些看过...
大学四年自学走来,这些私藏的实用工具/学习网站我贡献出来了
大学四年,看课本是不可能一直看课本的了,对于学习,特别是自学,善于搜索网上的一些资源来辅助,还是非常有必要的,下面我就把这几年私藏的各种资源,网站贡献出来给你们。主要有:电子书搜索、实用工具、在线视频学习网站、非视频学习网站、软件下载、面试/求职必备网站。 注意:文中提到的所有资源,文末我都给你整理好了,你们只管拿去,如果觉得不错,转发、分享就是最大的支持了。 一、电子书搜索 对于大部分程序员...
linux系列之常用运维命令整理笔录
本博客记录工作中需要的linux运维命令,大学时候开始接触linux,会一些基本操作,可是都没有整理起来,加上是做开发,不做运维,有些命令忘记了,所以现在整理成博客,当然vi,文件操作等就不介绍了,慢慢积累一些其它拓展的命令,博客不定时更新 free -m 其中:m表示兆,也可以用g,注意都要小写 Men:表示物理内存统计 total:表示物理内存总数(total=used+free) use...
比特币原理详解
一、什么是比特币 比特币是一种电子货币,是一种基于密码学的货币,在2008年11月1日由中本聪发表比特币白皮书,文中提出了一种去中心化的电子记账系统,我们平时的电子现金是银行来记账,因为银行的背后是国家信用。去中心化电子记账系统是参与者共同记账。比特币可以防止主权危机、信用风险。其好处不多做赘述,这一层面介绍的文章很多,本文主要从更深层的技术原理角度进行介绍。 二、问题引入 假设现有4个人...
程序员接私活怎样防止做完了不给钱?
首先跟大家说明一点,我们做 IT 类的外包开发,是非标品开发,所以很有可能在开发过程中会有这样那样的需求修改,而这种需求修改很容易造成扯皮,进而影响到费用支付,甚至出现做完了项目收不到钱的情况。 那么,怎么保证自己的薪酬安全呢? 我们在开工前,一定要做好一些证据方面的准备(也就是“讨薪”的理论依据),这其中最重要的就是需求文档和验收标准。一定要让需求方提供这两个文档资料作为开发的基础。之后开发...
网页实现一个简单的音乐播放器(大佬别看。(⊙﹏⊙))
今天闲着无事,就想写点东西。然后听了下歌,就打算写个播放器。 于是乎用h5 audio的加上js简单的播放器完工了。 演示地点演示 html代码如下` music 这个年纪 七月的风 音乐 ` 然后就是css`*{ margin: 0; padding: 0; text-decoration: none; list-...
Python十大装B语法
Python 是一种代表简单思想的语言,其语法相对简单,很容易上手。不过,如果就此小视 Python 语法的精妙和深邃,那就大错特错了。本文精心筛选了最能展现 Python 语法之精妙的十个知识点,并附上详细的实例代码。如能在实战中融会贯通、灵活使用,必将使代码更为精炼、高效,同时也会极大提升代码B格,使之看上去更老练,读起来更优雅。
数据库优化 - SQL优化
以实际SQL入手,带你一步一步走上SQL优化之路!
通俗易懂地给女朋友讲:线程池的内部原理
餐盘在灯光的照耀下格外晶莹洁白,女朋友拿起红酒杯轻轻地抿了一小口,对我说:“经常听你说线程池,到底线程池到底是个什么原理?”
经典算法(5)杨辉三角
杨辉三角 是经典算法,这篇博客对它的算法思想进行了讲解,并有完整的代码实现。
使用 Docker 部署 Spring Boot 项目
Docker 技术发展为微服务落地提供了更加便利的环境,使用 Docker 部署 Spring Boot 其实非常简单,这篇文章我们就来简单学习下。首先构建一个简单的 S...
英特尔不为人知的 B 面
从 PC 时代至今,众人只知在 CPU、GPU、XPU、制程、工艺等战场中,英特尔在与同行硬件芯片制造商们的竞争中杀出重围,且在不断的成长进化中,成为全球知名的半导体公司。殊不知,在「刚硬」的背后,英特尔「柔性」的软件早已经做到了全方位的支持与支撑,并持续发挥独特的生态价值,推动产业合作共赢。 而对于这一不知人知的 B 面,很多人将其称之为英特尔隐形的翅膀,虽低调,但是影响力却不容小觑。 那么,在...
面试官:你连RESTful都不知道我怎么敢要你?
干货,2019 RESTful最贱实践
刷了几千道算法题,这些我私藏的刷题网站都在这里了!
遥想当年,机缘巧合入了 ACM 的坑,周边巨擘林立,从此过上了"天天被虐似死狗"的生活… 然而我是谁,我可是死狗中的战斗鸡,智力不够那刷题来凑,开始了夜以继日哼哧哼哧刷题的日子,从此"读题与提交齐飞, AC 与 WA 一色 ",我惊喜的发现被题虐既刺激又有快感,那一刻我泪流满面。这么好的事儿作为一个正直的人绝不能自己独享,经过激烈的颅内斗争,我决定把我私藏的十几个 T 的,阿不,十几个刷题网...
白话阿里巴巴Java开发手册高级篇
不久前,阿里巴巴发布了《阿里巴巴Java开发手册》,总结了阿里巴巴内部实际项目开发过程中开发人员应该遵守的研发流程规范,这些流程规范在一定程度上能够保证最终的项目交付质量,通过在时间中总结模式,并推广给广大开发人员,来避免研发人员在实践中容易犯的错误,确保最终在大规模协作的项目中达成既定目标。 无独有偶,笔者去年在公司里负责升级和制定研发流程、设计模板、设计标准、代码标准等规范,并在实际工作中进行...
SQL-小白最佳入门sql查询一
不要偷偷的查询我的个人资料,即使你再喜欢我,也不要这样,真的不好;
redis分布式锁,面试官请随便问,我都会
文章有点长并且绕,先来个图片缓冲下! 前言 现在的业务场景越来越复杂,使用的架构也就越来越复杂,分布式、高并发已经是业务要求的常态。像腾讯系的不少服务,还有CDN优化、异地多备份等处理。 说到分布式,就必然涉及到分布式锁的概念,如何保证不同机器不同线程的分布式锁同步呢? 实现要点 互斥性,同一时刻,智能有一个客户端持有锁。 防止死锁发生,如果持有锁的客户端崩溃没有主动释放锁,也要保证锁可以正常释...
项目中的if else太多了,该怎么重构?
介绍 最近跟着公司的大佬开发了一款IM系统,类似QQ和微信哈,就是聊天软件。我们有一部分业务逻辑是这样的 if (msgType = "文本") { // dosomething } else if(msgType = "图片") { // doshomething } else if(msgType = "视频") { // doshomething } else { // doshom...
Nginx 原理和架构
Nginx 是一个免费的,开源的,高性能的 HTTP 服务器和反向代理,以及 IMAP / POP3 代理服务器。Nginx 以其高性能,稳定性,丰富的功能,简单的配置和低资源消耗而闻名。 Nginx 的整体架构 Nginx 里有一个 master 进程和多个 worker 进程。master 进程并不处理网络请求,主要负责调度工作进程:加载配置、启动工作进程及非停升级。worker 进程负责处...
“狗屁不通文章生成器”登顶GitHub热榜,分分钟写出万字形式主义大作
一、垃圾文字生成器介绍 最近在浏览GitHub的时候,发现了这样一个骨骼清奇的雷人项目,而且热度还特别高。 项目中文名:狗屁不通文章生成器 项目英文名:BullshitGenerator 根据作者的介绍,他是偶尔需要一些中文文字用于GUI开发时测试文本渲染,因此开发了这个废话生成器。但由于生成的废话实在是太过富于哲理,所以最近已经被小伙伴们给玩坏了。 他的文风可能是这样的: 你发现,...
程序员:我终于知道post和get的区别
是一个老生常谈的话题,然而随着不断的学习,对于以前的认识有很多误区,所以还是需要不断地总结的,学而时习之,不亦说乎
《程序人生》系列-这个程序员只用了20行代码就拿了冠军
你知道的越多,你不知道的越多 点赞再看,养成习惯GitHub上已经开源https://github.com/JavaFamily,有一线大厂面试点脑图,欢迎Star和完善 前言 这一期不算《吊打面试官》系列的,所有没前言我直接开始。 絮叨 本来应该是没有这期的,看过我上期的小伙伴应该是知道的嘛,双十一比较忙嘛,要值班又要去帮忙拍摄年会的视频素材,还得搞个程序员一天的Vlog,还要写BU...
加快推动区块链技术和产业创新发展,2019可信区块链峰会在京召开
11月8日,由中国信息通信研究院、中国通信标准化协会、中国互联网协会、可信区块链推进计划联合主办,科技行者协办的2019可信区块链峰会将在北京悠唐皇冠假日酒店开幕。   区块链技术被认为是继蒸汽机、电力、互联网之后,下一代颠覆性的核心技术。如果说蒸汽机释放了人类的生产力,电力解决了人类基本的生活需求,互联网彻底改变了信息传递的方式,区块链作为构造信任的技术有重要的价值。   1...
Java世界最常用的工具类库
Apache Commons Apache Commons有很多子项目 Google Guava 参考博客
程序员把地府后台管理系统做出来了,还有3.0版本!12月7号最新消息:已在开发中有github地址
第一幕:缘起 听说阎王爷要做个生死簿后台管理系统,我们派去了一个程序员…… 996程序员做的梦: 第一场:团队招募 为了应对地府管理危机,阎王打算找“人”开发一套地府后台管理系统,于是就在地府总经办群中发了项目需求。 话说还是中国电信的信号好,地府都是满格,哈哈!!! 经常会有外行朋友问:看某网站做的不错,功能也简单,你帮忙做一下? 而这次,面对这样的需求,这个程序员...
网易云6亿用户音乐推荐算法
网易云音乐是音乐爱好者的集聚地,云音乐推荐系统致力于通过 AI 算法的落地,实现用户千人千面的个性化推荐,为用户带来不一样的听歌体验。 本次分享重点介绍 AI 算法在音乐推荐中的应用实践,以及在算法落地过程中遇到的挑战和解决方案。 将从如下两个部分展开: AI算法在音乐推荐中的应用 音乐场景下的 AI 思考 从 2013 年 4 月正式上线至今,网易云音乐平台持续提供着:乐屏社区、UGC...
【技巧总结】位运算装逼指南
位算法的效率有多快我就不说,不信你可以去用 10 亿个数据模拟一下,今天给大家讲一讲位运算的一些经典例子。不过,最重要的不是看懂了这些例子就好,而是要在以后多去运用位运算这些技巧,当然,采用位运算,也是可以装逼的,不信,你往下看。我会从最简单的讲起,一道比一道难度递增,不过居然是讲技巧,那么也不会太难,相信你分分钟看懂。 判断奇偶数 判断一个数是基于还是偶数,相信很多人都做过,一般的做法的代码如下...
为什么要学数据结构?
一、前言 在可视化化程序设计的今天,借助于集成开发环境可以很快地生成程序,程序设计不再是计算机专业人员的专利。很多人认为,只要掌握几种开发工具就可以成为编程高手,其实,这是一种误解。要想成为一个专业的开发人员,至少需要以下三个条件: 1) 能够熟练地选择和设计各种数据结构和算法 2) 至少要能够熟练地掌握一门程序设计语言 3) 熟知所涉及的相关应用领域的知识 其中,后两个条件比较容易实现,而第一个...
Android 9.0 init 启动流程
阅读五分钟,每日十点,和您一起终身学习,这里是程序员Android本篇文章主要介绍Android开发中的部分知识点,通过阅读本篇文章,您将收获以下内容:一、启动流程概述一、 启动流程概述Android启动流程跟Linux启动类似,大致分为如下五个阶段。1.开机上电,加载固化的ROM。2.加载BootLoader,拉起Android OS。3.加载Uboot,初始外设,引导Kernel启动等。...
相关热词 c# 输入ip c# 乱码 报表 c#选择结构应用基本算法 c# 收到udp包后回包 c#oracle 头文件 c# 序列化对象 自定义 c# tcp 心跳 c# ice连接服务端 c# md5 解密 c# 文字导航控件
立即提问

相似问题

3
monkeyrunner下跑Python3.6的代码老报错:no module named:com
3
python3.7.0安装aiodns包出现问题
3
装了python3.7 大包的时候显示python3不是内部或外部指令
1
centos6.3 如何解决python3.7 的 SSL 问题?
1
python 3.7引用docx操作word文档报错exception
2
大佬们,python 3.7 中如何调用函数marshal.UnsafeAddrOfPinnedArrayElement(vBuffer,0)
2
Python 3.7 AttributeError: 'str' object has no attribute 'items' 报错怎么解决
2
python 3.7引用docx操作word文档报错exception 该怎么办?
1
python 3 报错 urllib.error.URLError: <urlopen error unknown url type: "http>
2
python3.7安装的 tensorflow缺少tensorflow.app.flags怎么解决?
0
求教!安装kaldi,make时错误提示没有安装libtool和python2.7,但是已经安装了。
1
ubuntu16.04 Python目录中无3.7.1 但Python版本显示3.7.1 且无法更改
1
win8 卸载 python3.7,使用原来安装包卸载出现()x80070643-安装时发生严重错误?
0
python3.7 suds用CA证书访问webservice(server端CFX框架)报错
0
【求助】Anaconda 建立python 3.6 新环境后,激活环境,进入python交互模式又变回原来的python3.7 。
7
关于Python3.7中安装pip install Scrapy出现的问题
2
Ubuntu上安装python3.7.0版本,执行到make命令有两个modules build failed,请问如何解决呢?
0
用Boost.python把.cpp文件生成.py文件时,一直报错。
1
乌班图下载python3.7时的问题
1
yum报Error downloading packages 但是python2.7 -v可以正确进入