IDEA 2018.2 使用gradle 构建, java + scala 的项目, 编译不通过,无法运行

下面是编译异常的日志:

org.gradle.api.tasks.TaskExecutionException: Execution failed for task ':common:compileScala'.
    at org.gradle.api.internal.tasks.execution.ExecuteActionsTaskExecuter.executeActions(ExecuteActionsTaskExecuter.java:103)
    at org.gradle.api.internal.tasks.execution.ExecuteActionsTaskExecuter.execute(ExecuteActionsTaskExecuter.java:73)
    at org.gradle.api.internal.tasks.execution.OutputDirectoryCreatingTaskExecuter.execute(OutputDirectoryCreatingTaskExecuter.java:51)
    at org.gradle.api.internal.tasks.execution.SkipUpToDateTaskExecuter.execute(SkipUpToDateTaskExecuter.java:59)
    at org.gradle.api.internal.tasks.execution.ResolveTaskOutputCachingStateExecuter.execute(ResolveTaskOutputCachingStateExecuter.java:54)
    at org.gradle.api.internal.tasks.execution.ValidatingTaskExecuter.execute(ValidatingTaskExecuter.java:59)
    at org.gradle.api.internal.tasks.execution.SkipEmptySourceFilesTaskExecuter.execute(SkipEmptySourceFilesTaskExecuter.java:101)
    at org.gradle.api.internal.tasks.execution.FinalizeInputFilePropertiesTaskExecuter.execute(FinalizeInputFilePropertiesTaskExecuter.java:44)
    at org.gradle.api.internal.tasks.execution.CleanupStaleOutputsExecuter.execute(CleanupStaleOutputsExecuter.java:91)
    at org.gradle.api.internal.tasks.execution.ResolveTaskArtifactStateTaskExecuter.execute(ResolveTaskArtifactStateTaskExecuter.java:62)
    at org.gradle.api.internal.tasks.execution.SkipTaskWithNoActionsExecuter.execute(SkipTaskWithNoActionsExecuter.java:59)
    at org.gradle.api.internal.tasks.execution.SkipOnlyIfTaskExecuter.execute(SkipOnlyIfTaskExecuter.java:54)
    at org.gradle.api.internal.tasks.execution.ExecuteAtMostOnceTaskExecuter.execute(ExecuteAtMostOnceTaskExecuter.java:43)
    at org.gradle.api.internal.tasks.execution.CatchExceptionTaskExecuter.execute(CatchExceptionTaskExecuter.java:34)
    at org.gradle.execution.taskgraph.DefaultTaskGraphExecuter$EventFiringTaskWorker$1.run(DefaultTaskGraphExecuter.java:256)
    at org.gradle.internal.progress.DefaultBuildOperationExecutor$RunnableBuildOperationWorker.execute(DefaultBuildOperationExecutor.java:336)
    at org.gradle.internal.progress.DefaultBuildOperationExecutor$RunnableBuildOperationWorker.execute(DefaultBuildOperationExecutor.java:328)
    at org.gradle.internal.progress.DefaultBuildOperationExecutor.execute(DefaultBuildOperationExecutor.java:199)
    at org.gradle.internal.progress.DefaultBuildOperationExecutor.run(DefaultBuildOperationExecutor.java:110)
    at org.gradle.execution.taskgraph.DefaultTaskGraphExecuter$EventFiringTaskWorker.execute(DefaultTaskGraphExecuter.java:249)
    at org.gradle.execution.taskgraph.DefaultTaskGraphExecuter$EventFiringTaskWorker.execute(DefaultTaskGraphExecuter.java:238)
    at org.gradle.execution.taskgraph.DefaultTaskPlanExecutor$TaskExecutorWorker.processTask(DefaultTaskPlanExecutor.java:123)
    at org.gradle.execution.taskgraph.DefaultTaskPlanExecutor$TaskExecutorWorker.access$200(DefaultTaskPlanExecutor.java:79)
    at org.gradle.execution.taskgraph.DefaultTaskPlanExecutor$TaskExecutorWorker$1.execute(DefaultTaskPlanExecutor.java:104)
    at org.gradle.execution.taskgraph.DefaultTaskPlanExecutor$TaskExecutorWorker$1.execute(DefaultTaskPlanExecutor.java:98)
    at org.gradle.execution.taskgraph.DefaultTaskExecutionPlan.execute(DefaultTaskExecutionPlan.java:663)
    at org.gradle.execution.taskgraph.DefaultTaskExecutionPlan.executeWithTask(DefaultTaskExecutionPlan.java:597)
    at org.gradle.execution.taskgraph.DefaultTaskPlanExecutor$TaskExecutorWorker.run(DefaultTaskPlanExecutor.java:98)
    at org.gradle.internal.concurrent.ExecutorPolicy$CatchAndRecordFailures.onExecute(ExecutorPolicy.java:63)
    at org.gradle.internal.concurrent.ManagedExecutorImpl$1.run(ManagedExecutorImpl.java:46)
    at java.util.concurrent.ThreadPoolExecutor.runWorker(ThreadPoolExecutor.java:1142)
    at java.util.concurrent.ThreadPoolExecutor$Worker.run(ThreadPoolExecutor.java:617)
    at org.gradle.internal.concurrent.ThreadFactoryImpl$ManagedThreadRunnable.run(ThreadFactoryImpl.java:55)
    at java.lang.Thread.run(Thread.java:745)
Caused by: org.gradle.api.internal.tasks.compile.CompilationFailedException: javac returned nonzero exit code
    at org.gradle.api.internal.tasks.scala.ZincScalaCompiler$Compiler.execute(ZincScalaCompiler.java:83)
    at org.gradle.api.internal.tasks.scala.ZincScalaCompiler.execute(ZincScalaCompiler.java:52)
    at org.gradle.api.internal.tasks.scala.ZincScalaCompiler.execute(ZincScalaCompiler.java:38)
    at org.gradle.api.internal.tasks.compile.daemon.AbstractDaemonCompiler$CompilerRunnable.run(AbstractDaemonCompiler.java:87)
    at org.gradle.workers.internal.DefaultWorkerServer.execute(DefaultWorkerServer.java:36)
    at org.gradle.workers.internal.WorkerDaemonServer.execute(WorkerDaemonServer.java:46)
    at org.gradle.workers.internal.WorkerDaemonServer.execute(WorkerDaemonServer.java:30)
    at sun.reflect.NativeMethodAccessorImpl.invoke0(Native Method)
    at sun.reflect.NativeMethodAccessorImpl.invoke(NativeMethodAccessorImpl.java:62)
    at sun.reflect.DelegatingMethodAccessorImpl.invoke(DelegatingMethodAccessorImpl.java:43)
    at java.lang.reflect.Method.invoke(Method.java:497)
    at org.gradle.process.internal.worker.request.WorkerAction.run(WorkerAction.java:100)
    at sun.reflect.NativeMethodAccessorImpl.invoke0(Native Method)
    at sun.reflect.NativeMethodAccessorImpl.invoke(NativeMethodAccessorImpl.java:62)
    at sun.reflect.DelegatingMethodAccessorImpl.invoke(DelegatingMethodAccessorImpl.java:43)
    at java.lang.reflect.Method.invoke(Method.java:497)
    at org.gradle.internal.dispatch.ReflectionDispatch.dispatch(ReflectionDispatch.java:35)
    at org.gradle.internal.dispatch.ReflectionDispatch.dispatch(ReflectionDispatch.java:24)
    at org.gradle.internal.remote.internal.hub.MessageHubBackedObjectConnection$DispatchWrapper.dispatch(MessageHubBackedObjectConnection.java:146)
    at org.gradle.internal.remote.internal.hub.MessageHubBackedObjectConnection$DispatchWrapper.dispatch(MessageHubBackedObjectConnection.java:128)
    at org.gradle.internal.remote.internal.hub.MessageHub$Handler.run(MessageHub.java:404)
    ... 6 more
Caused by: javac returned nonzero exit code
    at sbt.compiler.JavaCompiler$JavaTool0.compile(JavaCompiler.scala:97)
    at sbt.compiler.JavaTool$class.apply(JavaCompiler.scala:54)
    at sbt.compiler.JavaCompiler$JavaTool0.apply(JavaCompiler.scala:84)
    at sbt.compiler.JavaCompiler$class.compile(JavaCompiler.scala:35)
    at sbt.compiler.JavaCompiler$JavaTool0.compile(JavaCompiler.scala:84)
    at sbt.compiler.JavaCompiler$class.compileWithReporter(JavaCompiler.scala:40)
    at sbt.compiler.JavaCompiler$JavaTool0.compileWithReporter(JavaCompiler.scala:84)
    at sbt.compiler.AggressiveCompile$$anonfun$3$$anonfun$compileJava$1$1.apply$mcV$sp(AggressiveCompile.scala:121)
    at sbt.compiler.AggressiveCompile$$anonfun$3$$anonfun$compileJava$1$1.apply(AggressiveCompile.scala:121)
    at sbt.compiler.AggressiveCompile$$anonfun$3$$anonfun$compileJava$1$1.apply(AggressiveCompile.scala:121)
    at sbt.compiler.AggressiveCompile.sbt$compiler$AggressiveCompile$$timed(AggressiveCompile.scala:168)
    at sbt.compiler.AggressiveCompile$$anonfun$3.compileJava$1(AggressiveCompile.scala:120)
    at sbt.compiler.AggressiveCompile$$anonfun$3.apply(AggressiveCompile.scala:142)
    at sbt.compiler.AggressiveCompile$$anonfun$3.apply(AggressiveCompile.scala:84)
    at sbt.inc.IncrementalCompile$$anonfun$doCompile$1.apply(Compile.scala:66)
    at sbt.inc.IncrementalCompile$$anonfun$doCompile$1.apply(Compile.scala:64)
    at sbt.inc.IncrementalCommon.cycle(IncrementalCommon.scala:32)
    at sbt.inc.Incremental$$anonfun$1.apply(Incremental.scala:72)
    at sbt.inc.Incremental$$anonfun$1.apply(Incremental.scala:71)
    at sbt.inc.Incremental$.manageClassfiles(Incremental.scala:99)
    at sbt.inc.Incremental$.compile(Incremental.scala:71)
    at sbt.inc.IncrementalCompile$.apply(Compile.scala:54)
    at sbt.compiler.AggressiveCompile.compile2(AggressiveCompile.scala:159)
    at sbt.compiler.AggressiveCompile.compile1(AggressiveCompile.scala:68)
    at com.typesafe.zinc.Compiler.compile(Compiler.scala:207)
    at com.typesafe.zinc.Compiler.compile(Compiler.scala:189)
    at com.typesafe.zinc.Compiler.compile(Compiler.scala:180)
    at com.typesafe.zinc.Compiler.compile(Compiler.scala:171)
    at org.gradle.api.internal.tasks.scala.ZincScalaCompiler$Compiler.execute(ZincScalaCompiler.java:81)
    ... 26 more


IDEA 的 scala 插件版本 2018.2.11
gradle 版本:5.1
JDK 版本 1.8.0_45

scala 依赖的版本 2.11.8

1个回答

解决办法就是, 把IDEA 使用的Gradle 版本降低, 我默认使用的是 5.1 , 这个项目可能依赖的比较旧

Preferences ---> Build, Execution, Deployment ---> Build Tools ---> Gradle 

修改 Gradle home 的版本, 然后 编译可以通过了
Csdn user default icon
上传中...
上传图片
插入图片
抄袭、复制答案,以达到刷声望分或其他目的的行为,在CSDN问答是严格禁止的,一经发现立刻封号。是时候展现真正的技术了!
其他相关推荐
IDEA 2018.2 使用gradle 构建, java + scala 的项目, 编译不通过,无法运行
**下面是编译异常的日志:** ``` org.gradle.api.tasks.TaskExecutionException: Execution failed for task ':common:compileScala'. at org.gradle.api.internal.tasks.execution.ExecuteActionsTaskExecuter.executeActions(ExecuteActionsTaskExecuter.java:103) at org.gradle.api.internal.tasks.execution.ExecuteActionsTaskExecuter.execute(ExecuteActionsTaskExecuter.java:73) at org.gradle.api.internal.tasks.execution.OutputDirectoryCreatingTaskExecuter.execute(OutputDirectoryCreatingTaskExecuter.java:51) at org.gradle.api.internal.tasks.execution.SkipUpToDateTaskExecuter.execute(SkipUpToDateTaskExecuter.java:59) at org.gradle.api.internal.tasks.execution.ResolveTaskOutputCachingStateExecuter.execute(ResolveTaskOutputCachingStateExecuter.java:54) at org.gradle.api.internal.tasks.execution.ValidatingTaskExecuter.execute(ValidatingTaskExecuter.java:59) at org.gradle.api.internal.tasks.execution.SkipEmptySourceFilesTaskExecuter.execute(SkipEmptySourceFilesTaskExecuter.java:101) at org.gradle.api.internal.tasks.execution.FinalizeInputFilePropertiesTaskExecuter.execute(FinalizeInputFilePropertiesTaskExecuter.java:44) at org.gradle.api.internal.tasks.execution.CleanupStaleOutputsExecuter.execute(CleanupStaleOutputsExecuter.java:91) at org.gradle.api.internal.tasks.execution.ResolveTaskArtifactStateTaskExecuter.execute(ResolveTaskArtifactStateTaskExecuter.java:62) at org.gradle.api.internal.tasks.execution.SkipTaskWithNoActionsExecuter.execute(SkipTaskWithNoActionsExecuter.java:59) at org.gradle.api.internal.tasks.execution.SkipOnlyIfTaskExecuter.execute(SkipOnlyIfTaskExecuter.java:54) at org.gradle.api.internal.tasks.execution.ExecuteAtMostOnceTaskExecuter.execute(ExecuteAtMostOnceTaskExecuter.java:43) at org.gradle.api.internal.tasks.execution.CatchExceptionTaskExecuter.execute(CatchExceptionTaskExecuter.java:34) at org.gradle.execution.taskgraph.DefaultTaskGraphExecuter$EventFiringTaskWorker$1.run(DefaultTaskGraphExecuter.java:256) at org.gradle.internal.progress.DefaultBuildOperationExecutor$RunnableBuildOperationWorker.execute(DefaultBuildOperationExecutor.java:336) at org.gradle.internal.progress.DefaultBuildOperationExecutor$RunnableBuildOperationWorker.execute(DefaultBuildOperationExecutor.java:328) at org.gradle.internal.progress.DefaultBuildOperationExecutor.execute(DefaultBuildOperationExecutor.java:199) at org.gradle.internal.progress.DefaultBuildOperationExecutor.run(DefaultBuildOperationExecutor.java:110) at org.gradle.execution.taskgraph.DefaultTaskGraphExecuter$EventFiringTaskWorker.execute(DefaultTaskGraphExecuter.java:249) at org.gradle.execution.taskgraph.DefaultTaskGraphExecuter$EventFiringTaskWorker.execute(DefaultTaskGraphExecuter.java:238) at org.gradle.execution.taskgraph.DefaultTaskPlanExecutor$TaskExecutorWorker.processTask(DefaultTaskPlanExecutor.java:123) at org.gradle.execution.taskgraph.DefaultTaskPlanExecutor$TaskExecutorWorker.access$200(DefaultTaskPlanExecutor.java:79) at org.gradle.execution.taskgraph.DefaultTaskPlanExecutor$TaskExecutorWorker$1.execute(DefaultTaskPlanExecutor.java:104) at org.gradle.execution.taskgraph.DefaultTaskPlanExecutor$TaskExecutorWorker$1.execute(DefaultTaskPlanExecutor.java:98) at org.gradle.execution.taskgraph.DefaultTaskExecutionPlan.execute(DefaultTaskExecutionPlan.java:663) at org.gradle.execution.taskgraph.DefaultTaskExecutionPlan.executeWithTask(DefaultTaskExecutionPlan.java:597) at org.gradle.execution.taskgraph.DefaultTaskPlanExecutor$TaskExecutorWorker.run(DefaultTaskPlanExecutor.java:98) at org.gradle.internal.concurrent.ExecutorPolicy$CatchAndRecordFailures.onExecute(ExecutorPolicy.java:63) at org.gradle.internal.concurrent.ManagedExecutorImpl$1.run(ManagedExecutorImpl.java:46) at java.util.concurrent.ThreadPoolExecutor.runWorker(ThreadPoolExecutor.java:1142) at java.util.concurrent.ThreadPoolExecutor$Worker.run(ThreadPoolExecutor.java:617) at org.gradle.internal.concurrent.ThreadFactoryImpl$ManagedThreadRunnable.run(ThreadFactoryImpl.java:55) at java.lang.Thread.run(Thread.java:745) Caused by: org.gradle.api.internal.tasks.compile.CompilationFailedException: javac returned nonzero exit code at org.gradle.api.internal.tasks.scala.ZincScalaCompiler$Compiler.execute(ZincScalaCompiler.java:83) at org.gradle.api.internal.tasks.scala.ZincScalaCompiler.execute(ZincScalaCompiler.java:52) at org.gradle.api.internal.tasks.scala.ZincScalaCompiler.execute(ZincScalaCompiler.java:38) at org.gradle.api.internal.tasks.compile.daemon.AbstractDaemonCompiler$CompilerRunnable.run(AbstractDaemonCompiler.java:87) at org.gradle.workers.internal.DefaultWorkerServer.execute(DefaultWorkerServer.java:36) at org.gradle.workers.internal.WorkerDaemonServer.execute(WorkerDaemonServer.java:46) at org.gradle.workers.internal.WorkerDaemonServer.execute(WorkerDaemonServer.java:30) at sun.reflect.NativeMethodAccessorImpl.invoke0(Native Method) at sun.reflect.NativeMethodAccessorImpl.invoke(NativeMethodAccessorImpl.java:62) at sun.reflect.DelegatingMethodAccessorImpl.invoke(DelegatingMethodAccessorImpl.java:43) at java.lang.reflect.Method.invoke(Method.java:497) at org.gradle.process.internal.worker.request.WorkerAction.run(WorkerAction.java:100) at sun.reflect.NativeMethodAccessorImpl.invoke0(Native Method) at sun.reflect.NativeMethodAccessorImpl.invoke(NativeMethodAccessorImpl.java:62) at sun.reflect.DelegatingMethodAccessorImpl.invoke(DelegatingMethodAccessorImpl.java:43) at java.lang.reflect.Method.invoke(Method.java:497) at org.gradle.internal.dispatch.ReflectionDispatch.dispatch(ReflectionDispatch.java:35) at org.gradle.internal.dispatch.ReflectionDispatch.dispatch(ReflectionDispatch.java:24) at org.gradle.internal.remote.internal.hub.MessageHubBackedObjectConnection$DispatchWrapper.dispatch(MessageHubBackedObjectConnection.java:146) at org.gradle.internal.remote.internal.hub.MessageHubBackedObjectConnection$DispatchWrapper.dispatch(MessageHubBackedObjectConnection.java:128) at org.gradle.internal.remote.internal.hub.MessageHub$Handler.run(MessageHub.java:404) ... 6 more Caused by: javac returned nonzero exit code at sbt.compiler.JavaCompiler$JavaTool0.compile(JavaCompiler.scala:97) at sbt.compiler.JavaTool$class.apply(JavaCompiler.scala:54) at sbt.compiler.JavaCompiler$JavaTool0.apply(JavaCompiler.scala:84) at sbt.compiler.JavaCompiler$class.compile(JavaCompiler.scala:35) at sbt.compiler.JavaCompiler$JavaTool0.compile(JavaCompiler.scala:84) at sbt.compiler.JavaCompiler$class.compileWithReporter(JavaCompiler.scala:40) at sbt.compiler.JavaCompiler$JavaTool0.compileWithReporter(JavaCompiler.scala:84) at sbt.compiler.AggressiveCompile$$anonfun$3$$anonfun$compileJava$1$1.apply$mcV$sp(AggressiveCompile.scala:121) at sbt.compiler.AggressiveCompile$$anonfun$3$$anonfun$compileJava$1$1.apply(AggressiveCompile.scala:121) at sbt.compiler.AggressiveCompile$$anonfun$3$$anonfun$compileJava$1$1.apply(AggressiveCompile.scala:121) at sbt.compiler.AggressiveCompile.sbt$compiler$AggressiveCompile$$timed(AggressiveCompile.scala:168) at sbt.compiler.AggressiveCompile$$anonfun$3.compileJava$1(AggressiveCompile.scala:120) at sbt.compiler.AggressiveCompile$$anonfun$3.apply(AggressiveCompile.scala:142) at sbt.compiler.AggressiveCompile$$anonfun$3.apply(AggressiveCompile.scala:84) at sbt.inc.IncrementalCompile$$anonfun$doCompile$1.apply(Compile.scala:66) at sbt.inc.IncrementalCompile$$anonfun$doCompile$1.apply(Compile.scala:64) at sbt.inc.IncrementalCommon.cycle(IncrementalCommon.scala:32) at sbt.inc.Incremental$$anonfun$1.apply(Incremental.scala:72) at sbt.inc.Incremental$$anonfun$1.apply(Incremental.scala:71) at sbt.inc.Incremental$.manageClassfiles(Incremental.scala:99) at sbt.inc.Incremental$.compile(Incremental.scala:71) at sbt.inc.IncrementalCompile$.apply(Compile.scala:54) at sbt.compiler.AggressiveCompile.compile2(AggressiveCompile.scala:159) at sbt.compiler.AggressiveCompile.compile1(AggressiveCompile.scala:68) at com.typesafe.zinc.Compiler.compile(Compiler.scala:207) at com.typesafe.zinc.Compiler.compile(Compiler.scala:189) at com.typesafe.zinc.Compiler.compile(Compiler.scala:180) at com.typesafe.zinc.Compiler.compile(Compiler.scala:171) at org.gradle.api.internal.tasks.scala.ZincScalaCompiler$Compiler.execute(ZincScalaCompiler.java:81) ... 26 more ``` IDEA 的 scala 插件版本 2018.2.11 gradle 版本:5.1 JDK 版本 1.8.0_45 scala 依赖的版本 2.11.8
使用gradle编译打包scala工程,报错:
1.使用的版本 jdk1.7.004 gradle 2.1 scala 2.11.2 2.代码结构 src/main/scala/HelloWorld.scala package main.scala object HelloWorld { def main(args: Array[String]): Unit = { println("hello world") } } 3.build.gradle文件 apply plugin: 'scala' repositories { maven { url "http://10.177.60.141:8888/nexus/conte..." } } dependencies { compile 'org.scala-lang:scala-library:2.11.2' compile 'org.scala-lang:scala-compiler:2.11.2' } 4.执行gradle build命令,结果: D:\Workfiles\Scala\gradleproject>gradle build -stacktrace :compileJava UP-TO-DATE :compileScala FAILED FAILURE: Build failed with an exception. * What went wrong: Execution failed for task ':compileScala'. > scala/runtime/Nothing$ * Try: Run with --info or --debug option to get more log output. * Exception is: org.gradle.api.tasks.TaskExecutionException: Execution failed for task ':compile Scala'. at org.gradle.api.internal.tasks.execution.ExecuteActionsTaskExecuter.ex ecuteActions(ExecuteActionsTaskExecuter.java:69) ........................................................... at org.gradle.api.internal.tasks.execution.ExecuteActionsTaskExecuter.ex ecuteActions(ExecuteActionsTaskExecuter.java:61) ... 44 more Caused by: java.lang.ClassNotFoundException: scala.runtime.Nothing$ ... 76 more BUILD FAILED Total time: 12.063 secs
Error:Could not find com.android.tools.build:gradle-core:2.3.3. Searched in the following locations:
新导入项目报这个错误: Error:Could not find com.android.tools.build:gradle-core:2.3.3. Searched in the following locations: https://repo1.maven.org/maven2/com/android/tools/build/gradle-core/2.3.3/gradle-core-2.3.3.pom https://repo1.maven.org/maven2/com/android/tools/build/gradle-core/2.3.3/gradle-core-2.3.3.jar Required by: project :library > com.android.tools.build:gradle:2.3.3。 图片: ![图片说明](https://img-ask.csdn.net/upload/201908/30/1567134273_698972.png) ![图片说明](https://img-ask.csdn.net/upload/201908/30/1567134287_697402.png)
Android studio加载项目出现Could not find com.android.tools.build:gradle:4.10.1
Android studio加载项目出现Could not find com.android.tools.build:gradle:4.10.1 ![图片说明](https://img-ask.csdn.net/upload/201911/05/1572944856_31543.jpg) 实在是不知道怎么解决了,这个问题已经困扰我好久了,哪位大神可以帮忙解决一下,万分感谢。 repositories中的代码库是jcenter{ url'http://jcenter.bintray.com'},已经把项目build.gradle,将其中的classpath 'com.android.tools.build:gradle:4.10.1'改为classpath 'com.android.tools.build:gradle:2.3.2'了,但是还是报错 ![图片说明](https://img-ask.csdn.net/upload/201911/06/1573034916_778380.png) 用浏览器打开代码库地址,可以找到2.3.2版本信息,但是地址会自动变为https ![图片说明](https://img-ask.csdn.net/upload/201911/06/1573035170_400923.png) 将代码库的地址改为https以后,又会报别的错 ![图片说明](https://img-ask.csdn.net/upload/201911/06/1573035255_577090.png)
idea导入spring源码5.0.x后gradle报错
idea2017版本,在导入spring5.0.x源码后,报错。本地版本安装的是gradle-4.3.1,再点击gradle刷新后,出现以下错误,模块依赖的jar报红,求解决 ![图片说明](https://img-ask.csdn.net/upload/201911/26/1574757730_901833.png)
Gradle 报错,怎么解决?在网上找了很多方法,都不能解决
代码如下: Error:Internal error: org.gradle.tooling.BuildException: Could not execute build using Gradle installation 'D:\Program Files\gradle-4.8-rc-1'. at org.gradle.tooling.internal.consumer.ExceptionTransformer.transform(ExceptionTransformer.java:51) at org.gradle.tooling.internal.consumer.ExceptionTransformer.transform(ExceptionTransformer.java:29) at org.gradle.tooling.internal.consumer.ResultHandlerAdapter.onFailure(ResultHandlerAdapter.java:41) at org.gradle.tooling.internal.consumer.async.DefaultAsyncConsumerActionExecutor$1$1.run(DefaultAsyncConsumerActionExecutor.java:57) at org.gradle.internal.concurrent.ExecutorPolicy$CatchAndRecordFailures.onExecute(ExecutorPolicy.java:63) at org.gradle.internal.concurrent.StoppableExecutorImpl$1.run(StoppableExecutorImpl.java:46) at java.util.concurrent.ThreadPoolExecutor.runWorker(ThreadPoolExecutor.java:1142) at java.util.concurrent.ThreadPoolExecutor$Worker.run(ThreadPoolExecutor.java:617) at java.lang.Thread.run(Thread.java:745) at org.gradle.tooling.internal.consumer.BlockingResultHandler.getResult(BlockingResultHandler.java:46) at org.gradle.tooling.internal.consumer.DefaultBuildLauncher.run(DefaultBuildLauncher.java:77) at com.android.tools.idea.gradle.project.build.invoker.GradleTasksExecutor$GradleTasksExecutorImpl.lambda$invokeGradleTasks$2(GradleTasksExecutor.java:418) at org.jetbrains.plugins.gradle.service.execution.GradleExecutionHelper.execute(GradleExecutionHelper.java:222) at com.android.tools.idea.gradle.project.build.invoker.GradleTasksExecutor$GradleTasksExecutorImpl.invokeGradleTasks(GradleTasksExecutor.java:458) at com.android.tools.idea.gradle.project.build.invoker.GradleTasksExecutor$GradleTasksExecutorImpl.run(GradleTasksExecutor.java:271) at com.intellij.openapi.progress.impl.CoreProgressManager$TaskRunnable.run(CoreProgressManager.java:718) at com.intellij.openapi.progress.impl.CoreProgressManager.a(CoreProgressManager.java:170) at com.intellij.openapi.progress.impl.CoreProgressManager.a(CoreProgressManager.java:548) at com.intellij.openapi.progress.impl.CoreProgressManager.executeProcessUnderProgress(CoreProgressManager.java:493) at com.intellij.openapi.progress.impl.ProgressManagerImpl.executeProcessUnderProgress(ProgressManagerImpl.java:94) at com.intellij.openapi.progress.impl.CoreProgressManager.runProcess(CoreProgressManager.java:157) at com.intellij.openapi.progress.impl.ProgressManagerImpl$2.run(ProgressManagerImpl.java:165) at com.intellij.openapi.application.impl.ApplicationImpl$1.run(ApplicationImpl.java:330) at java.util.concurrent.Executors$RunnableAdapter.call(Executors.java:511) at java.util.concurrent.FutureTask.run(FutureTask.java:266) at java.util.concurrent.ThreadPoolExecutor.runWorker(ThreadPoolExecutor.java:1142) at java.util.concurrent.ThreadPoolExecutor$Worker.run(ThreadPoolExecutor.java:617) at java.lang.Thread.run(Thread.java:745) Caused by: org.gradle.internal.exceptions.LocationAwareException: Execution failed for task ':app:processDebugManifest'. at org.gradle.initialization.DefaultExceptionAnalyser.transform(DefaultExceptionAnalyser.java:74) at org.gradle.initialization.MultipleBuildFailuresExceptionAnalyser.transform(MultipleBuildFailuresExceptionAnalyser.java:47) at org.gradle.initialization.StackTraceSanitizingExceptionAnalyser.transform(StackTraceSanitizingExceptionAnalyser.java:30) at org.gradle.initialization.DefaultGradleLauncher.doBuildStages(DefaultGradleLauncher.java:143) at org.gradle.initialization.DefaultGradleLauncher.executeTasks(DefaultGradleLauncher.java:115) at org.gradle.internal.invocation.GradleBuildController$1.call(GradleBuildController.java:77) at org.gradle.internal.invocation.GradleBuildController$1.call(GradleBuildController.java:74) at org.gradle.internal.work.DefaultWorkerLeaseService.withLocks(DefaultWorkerLeaseService.java:152) at org.gradle.internal.work.StopShieldingWorkerLeaseService.withLocks(StopShieldingWorkerLeaseService.java:38) at org.gradle.internal.invocation.GradleBuildController.doBuild(GradleBuildController.java:96) at org.gradle.internal.invocation.GradleBuildController.run(GradleBuildController.java:74) at org.gradle.tooling.internal.provider.runner.BuildModelActionRunner.run(BuildModelActionRunner.java:55) at org.gradle.launcher.exec.ChainingBuildActionRunner.run(ChainingBuildActionRunner.java:35) at org.gradle.launcher.exec.ChainingBuildActionRunner.run(ChainingBuildActionRunner.java:35) at org.gradle.tooling.internal.provider.ValidatingBuildActionRunner.run(ValidatingBuildActionRunner.java:32) at org.gradle.launcher.exec.RunAsBuildOperationBuildActionRunner$3.run(RunAsBuildOperationBuildActionRunner.java:47) at org.gradle.internal.operations.DefaultBuildOperationExecutor$RunnableBuildOperationWorker.execute(DefaultBuildOperationExecutor.java:317) at org.gradle.internal.operations.DefaultBuildOperationExecutor$RunnableBuildOperationWorker.execute(DefaultBuildOperationExecutor.java:309) at org.gradle.internal.operations.DefaultBuildOperationExecutor.execute(DefaultBuildOperationExecutor.java:185) at org.gradle.internal.operations.DefaultBuildOperationExecutor.run(DefaultBuildOperationExecutor.java:97) at org.gradle.internal.operations.DelegatingBuildOperationExecutor.run(DelegatingBuildOperationExecutor.java:31) at org.gradle.launcher.exec.RunAsBuildOperationBuildActionRunner.run(RunAsBuildOperationBuildActionRunner.java:43) at org.gradle.tooling.internal.provider.SubscribableBuildActionRunner.run(SubscribableBuildActionRunner.java:51) at org.gradle.launcher.exec.InProcessBuildActionExecuter$1.transform(InProcessBuildActionExecuter.java:45) at org.gradle.launcher.exec.InProcessBuildActionExecuter$1.transform(InProcessBuildActionExecuter.java:41) at org.gradle.composite.internal.DefaultRootBuildState.run(DefaultRootBuildState.java:65) at org.gradle.launcher.exec.InProcessBuildActionExecuter.execute(InProcessBuildActionExecuter.java:41) at org.gradle.launcher.exec.InProcessBuildActionExecuter.execute(InProcessBuildActionExecuter.java:31) at org.gradle.launcher.exec.BuildTreeScopeBuildActionExecuter.execute(BuildTreeScopeBuildActionExecuter.java:39) at org.gradle.launcher.exec.BuildTreeScopeBuildActionExecuter.execute(BuildTreeScopeBuildActionExecuter.java:25) at org.gradle.tooling.internal.provider.ContinuousBuildActionExecuter.execute(ContinuousBuildActionExecuter.java:80) at org.gradle.tooling.internal.provider.ContinuousBuildActionExecuter.execute(ContinuousBuildActionExecuter.java:53) at org.gradle.tooling.internal.provider.ServicesSetupBuildActionExecuter.execute(ServicesSetupBuildActionExecuter.java:62) at org.gradle.tooling.internal.provider.ServicesSetupBuildActionExecuter.execute(ServicesSetupBuildActionExecuter.java:34) at org.gradle.tooling.internal.provider.GradleThreadBuildActionExecuter.execute(GradleThreadBuildActionExecuter.java:36) at org.gradle.tooling.internal.provider.GradleThreadBuildActionExecuter.execute(GradleThreadBuildActionExecuter.java:25) at org.gradle.tooling.internal.provider.ParallelismConfigurationBuildActionExecuter.execute(ParallelismConfigurationBuildActionExecuter.java:43) at org.gradle.tooling.internal.provider.ParallelismConfigurationBuildActionExecuter.execute(ParallelismConfigurationBuildActionExecuter.java:29) at org.gradle.tooling.internal.provider.StartParamsValidatingActionExecuter.execute(StartParamsValidatingActionExecuter.java:59) at org.gradle.tooling.internal.provider.StartParamsValidatingActionExecuter.execute(StartParamsValidatingActionExecuter.java:31) at org.gradle.tooling.internal.provider.SessionFailureReportingActionExecuter.execute(SessionFailureReportingActionExecuter.java:59) at org.gradle.tooling.internal.provider.SessionFailureReportingActionExecuter.execute(SessionFailureReportingActionExecuter.java:44) at org.gradle.tooling.internal.provider.SetupLoggingActionExecuter.execute(SetupLoggingActionExecuter.java:46) at org.gradle.tooling.internal.provider.SetupLoggingActionExecuter.execute(SetupLoggingActionExecuter.java:30) at org.gradle.launcher.daemon.server.exec.ExecuteBuild.doBuild(ExecuteBuild.java:67) at org.gradle.launcher.daemon.server.exec.BuildCommandOnly.execute(BuildCommandOnly.java:36) at org.gradle.launcher.daemon.server.api.DaemonCommandExecution.proceed(DaemonCommandExecution.java:122) at org.gradle.launcher.daemon.server.exec.WatchForDisconnection.execute(WatchForDisconnection.java:37) at org.gradle.launcher.daemon.server.api.DaemonCommandExecution.proceed(DaemonCommandExecution.java:122) at org.gradle.launcher.daemon.server.exec.ResetDeprecationLogger.execute(ResetDeprecationLogger.java:26) at org.gradle.launcher.daemon.server.api.DaemonCommandExecution.proceed(DaemonCommandExecution.java:122) at org.gradle.launcher.daemon.server.exec.RequestStopIfSingleUsedDaemon.execute(RequestStopIfSingleUsedDaemon.java:34) at org.gradle.launcher.daemon.server.api.DaemonCommandExecution.proceed(DaemonCommandExecution.java:122) at org.gradle.launcher.daemon.server.exec.ForwardClientInput$2.call(ForwardClientInput.java:74) at org.gradle.launcher.daemon.server.exec.ForwardClientInput$2.call(ForwardClientInput.java:72) at org.gradle.util.Swapper.swap(Swapper.java:38) at org.gradle.launcher.daemon.server.exec.ForwardClientInput.execute(ForwardClientInput.java:72) at org.gradle.launcher.daemon.server.api.DaemonCommandExecution.proceed(DaemonCommandExecution.java:122) at org.gradle.launcher.daemon.server.exec.LogAndCheckHealth.execute(LogAndCheckHealth.java:55) at org.gradle.launcher.daemon.server.api.DaemonCommandExecution.proceed(DaemonCommandExecution.java:122) at org.gradle.launcher.daemon.server.exec.LogToClient.doBuild(LogToClient.java:62) at org.gradle.launcher.daemon.server.exec.BuildCommandOnly.execute(BuildCommandOnly.java:36) at org.gradle.launcher.daemon.server.api.DaemonCommandExecution.proceed(DaemonCommandExecution.java:122) at org.gradle.launcher.daemon.server.exec.EstablishBuildEnvironment.doBuild(EstablishBuildEnvironment.java:82) at org.gradle.launcher.daemon.server.exec.BuildCommandOnly.execute(BuildCommandOnly.java:36) at org.gradle.launcher.daemon.server.api.DaemonCommandExecution.proceed(DaemonCommandExecution.java:122) at org.gradle.launcher.daemon.server.exec.StartBuildOrRespondWithBusy$1.run(StartBuildOrRespondWithBusy.java:50) at org.gradle.launcher.daemon.server.DaemonStateCoordinator$1.run(DaemonStateCoordinator.java:295) at org.gradle.internal.concurrent.ExecutorPolicy$CatchAndRecordFailures.onExecute(ExecutorPolicy.java:63) at org.gradle.internal.concurrent.ManagedExecutorImpl$1.run(ManagedExecutorImpl.java:46) at org.gradle.internal.concurrent.ThreadFactoryImpl$ManagedThreadRunnable.run(ThreadFactoryImpl.java:55) Caused by: org.gradle.api.tasks.TaskExecutionException: Execution failed for task ':app:processDebugManifest'. at org.gradle.api.internal.tasks.execution.ExecuteActionsTaskExecuter.executeActions(ExecuteActionsTaskExecuter.java:110) at org.gradle.api.internal.tasks.execution.ExecuteActionsTaskExecuter.execute(ExecuteActionsTaskExecuter.java:77) at org.gradle.api.internal.tasks.execution.OutputDirectoryCreatingTaskExecuter.execute(OutputDirectoryCreatingTaskExecuter.java:51) at org.gradle.api.internal.tasks.execution.SkipUpToDateTaskExecuter.execute(SkipUpToDateTaskExecuter.java:59) at org.gradle.api.internal.tasks.execution.ResolveTaskOutputCachingStateExecuter.execute(ResolveTaskOutputCachingStateExecuter.java:54) at org.gradle.api.internal.tasks.execution.ValidatingTaskExecuter.execute(ValidatingTaskExecuter.java:59) at org.gradle.api.internal.tasks.execution.SkipEmptySourceFilesTaskExecuter.execute(SkipEmptySourceFilesTaskExecuter.java:101) at org.gradle.api.internal.tasks.execution.FinalizeInputFilePropertiesTaskExecuter.execute(FinalizeInputFilePropertiesTaskExecuter.java:44) at org.gradle.api.internal.tasks.execution.CleanupStaleOutputsExecuter.execute(CleanupStaleOutputsExecuter.java:91) at org.gradle.api.internal.tasks.execution.ResolveTaskArtifactStateTaskExecuter.execute(ResolveTaskArtifactStateTaskExecuter.java:62) at org.gradle.api.internal.tasks.execution.SkipTaskWithNoActionsExecuter.execute(SkipTaskWithNoActionsExecuter.java:59) at org.gradle.api.internal.tasks.execution.SkipOnlyIfTaskExecuter.execute(SkipOnlyIfTaskExecuter.java:54) at org.gradle.api.internal.tasks.execution.ExecuteAtMostOnceTaskExecuter.execute(ExecuteAtMostOnceTaskExecuter.java:43) at org.gradle.api.internal.tasks.execution.CatchExceptionTaskExecuter.execute(CatchExceptionTaskExecuter.java:34) at org.gradle.api.internal.tasks.execution.EventFiringTaskExecuter$1.run(EventFiringTaskExecuter.java:51) at org.gradle.internal.operations.DefaultBuildOperationExecutor$RunnableBuildOperationWorker.execute(DefaultBuildOperationExecutor.java:317) at org.gradle.internal.operations.DefaultBuildOperationExecutor$RunnableBuildOperationWorker.execute(DefaultBuildOperationExecutor.java:309) at org.gradle.internal.operations.DefaultBuildOperationExecutor.execute(DefaultBuildOperationExecutor.java:185) at org.gradle.internal.operations.DefaultBuildOperationExecutor.run(DefaultBuildOperationExecutor.java:97) at org.gradle.internal.operations.DelegatingBuildOperationExecutor.run(DelegatingBuildOperationExecutor.java:31) at org.gradle.api.internal.tasks.execution.EventFiringTaskExecuter.execute(EventFiringTaskExecuter.java:46) at org.gradle.execution.taskgraph.DefaultTaskExecutionGraph$ExecuteTaskAction.execute(DefaultTaskExecutionGraph.java:262) at org.gradle.execution.taskgraph.DefaultTaskExecutionGraph$ExecuteTaskAction.execute(DefaultTaskExecutionGraph.java:246) at org.gradle.execution.taskgraph.DefaultTaskPlanExecutor$TaskExecutorWorker$1.execute(DefaultTaskPlanExecutor.java:136) at org.gradle.execution.taskgraph.DefaultTaskPlanExecutor$TaskExecutorWorker$1.execute(DefaultTaskPlanExecutor.java:130) at org.gradle.execution.taskgraph.DefaultTaskPlanExecutor$TaskExecutorWorker.execute(DefaultTaskPlanExecutor.java:201) at org.gradle.execution.taskgraph.DefaultTaskPlanExecutor$TaskExecutorWorker.executeWithTask(DefaultTaskPlanExecutor.java:192) at org.gradle.execution.taskgraph.DefaultTaskPlanExecutor$TaskExecutorWorker.run(DefaultTaskPlanExecutor.java:130) ... 3 more Caused by: java.lang.RuntimeException: Manifest merger failed : uses-sdk:minSdkVersion 15 cannot be smaller than version 17 declared in library [com.github.xuexiangjys:XUI:1.0.4] C:\Users\Administrator\.android\build-cache\0e85c716275ee970052537f7d72f491aaf0a4a05\output\AndroidManifest.xml Suggestion: use tools:overrideLibrary="com.xuexiang.xui" to force usage at com.android.builder.core.AndroidBuilder.mergeManifestsForApplication(AndroidBuilder.java:576) at com.android.build.gradle.tasks.MergeManifests.doFullTaskAction(MergeManifests.java:74) at com.android.build.gradle.internal.tasks.IncrementalTask.taskAction(IncrementalTask.java:82) at org.gradle.internal.reflect.JavaMethod.invoke(JavaMethod.java:73) at org.gradle.api.internal.project.taskfactory.IncrementalTaskAction.doExecute(IncrementalTaskAction.java:50) at org.gradle.api.internal.project.taskfactory.StandardTaskAction.execute(StandardTaskAction.java:39) at org.gradle.api.internal.project.taskfactory.StandardTaskAction.execute(StandardTaskAction.java:26) at org.gradle.api.internal.tasks.execution.ExecuteActionsTaskExecuter$1.run(ExecuteActionsTaskExecuter.java:131) at org.gradle.internal.operations.DefaultBuildOperationExecutor$RunnableBuildOperationWorker.execute(DefaultBuildOperationExecutor.java:317) at org.gradle.internal.operations.DefaultBuildOperationExecutor$RunnableBuildOperationWorker.execute(DefaultBuildOperationExecutor.java:309) at org.gradle.internal.operations.DefaultBuildOperationExecutor.execute(DefaultBuildOperationExecutor.java:185) at org.gradle.internal.operations.DefaultBuildOperationExecutor.run(DefaultBuildOperationExecutor.java:97) at org.gradle.internal.operations.DelegatingBuildOperationExecutor.run(DelegatingBuildOperationExecutor.java:31) at org.gradle.api.internal.tasks.execution.ExecuteActionsTaskExecuter.executeAction(ExecuteActionsTaskExecuter.java:120) at org.gradle.api.internal.tasks.execution.ExecuteActionsTaskExecuter.executeActions(ExecuteActionsTaskExecuter.java:99) ... 30 more
AndroidStudio 编程中出现java.lang.RuntimeException错误
在网上找了很长时间没有看到跟我的报错完全一样的情况,不知道是怎么回事。 Caused by: java.lang.RuntimeException只有这一句话 org.gradle.api.tasks.TaskExecutionException: Execution failed for task ':app:transformClassesWithDexBuilderForDebug'. at org.gradle.api.internal.tasks.execution.ExecuteActionsTaskExecuter.executeActions(ExecuteActionsTaskExecuter.java:103) at org.gradle.api.internal.tasks.execution.ExecuteActionsTaskExecuter.execute(ExecuteActionsTaskExecuter.java:73) at org.gradle.api.internal.tasks.execution.OutputDirectoryCreatingTaskExecuter.execute(OutputDirectoryCreatingTaskExecuter.java:51) at org.gradle.api.internal.tasks.execution.SkipUpToDateTaskExecuter.execute(SkipUpToDateTaskExecuter.java:59) at org.gradle.api.internal.tasks.execution.ResolveTaskOutputCachingStateExecuter.execute(ResolveTaskOutputCachingStateExecuter.java:54) at org.gradle.api.internal.tasks.execution.ValidatingTaskExecuter.execute(ValidatingTaskExecuter.java:59) at org.gradle.api.internal.tasks.execution.SkipEmptySourceFilesTaskExecuter.execute(SkipEmptySourceFilesTaskExecuter.java:101) at org.gradle.api.internal.tasks.execution.FinalizeInputFilePropertiesTaskExecuter.execute(FinalizeInputFilePropertiesTaskExecuter.java:44) at org.gradle.api.internal.tasks.execution.CleanupStaleOutputsExecuter.execute(CleanupStaleOutputsExecuter.java:91) at org.gradle.api.internal.tasks.execution.ResolveTaskArtifactStateTaskExecuter.execute(ResolveTaskArtifactStateTaskExecuter.java:62) at org.gradle.api.internal.tasks.execution.SkipTaskWithNoActionsExecuter.execute(SkipTaskWithNoActionsExecuter.java:59) at org.gradle.api.internal.tasks.execution.SkipOnlyIfTaskExecuter.execute(SkipOnlyIfTaskExecuter.java:54) at org.gradle.api.internal.tasks.execution.ExecuteAtMostOnceTaskExecuter.execute(ExecuteAtMostOnceTaskExecuter.java:43) at org.gradle.api.internal.tasks.execution.CatchExceptionTaskExecuter.execute(CatchExceptionTaskExecuter.java:34) at org.gradle.execution.taskgraph.DefaultTaskGraphExecuter$EventFiringTaskWorker$1.run(DefaultTaskGraphExecuter.java:256) at org.gradle.internal.progress.DefaultBuildOperationExecutor$RunnableBuildOperationWorker.execute(DefaultBuildOperationExecutor.java:336) at org.gradle.internal.progress.DefaultBuildOperationExecutor$RunnableBuildOperationWorker.execute(DefaultBuildOperationExecutor.java:328) at org.gradle.internal.progress.DefaultBuildOperationExecutor.execute(DefaultBuildOperationExecutor.java:199) at org.gradle.internal.progress.DefaultBuildOperationExecutor.run(DefaultBuildOperationExecutor.java:110) at org.gradle.execution.taskgraph.DefaultTaskGraphExecuter$EventFiringTaskWorker.execute(DefaultTaskGraphExecuter.java:249) at org.gradle.execution.taskgraph.DefaultTaskGraphExecuter$EventFiringTaskWorker.execute(DefaultTaskGraphExecuter.java:238) at org.gradle.execution.taskgraph.DefaultTaskPlanExecutor$TaskExecutorWorker.processTask(DefaultTaskPlanExecutor.java:123) at org.gradle.execution.taskgraph.DefaultTaskPlanExecutor$TaskExecutorWorker.access$200(DefaultTaskPlanExecutor.java:79) at org.gradle.execution.taskgraph.DefaultTaskPlanExecutor$TaskExecutorWorker$1.execute(DefaultTaskPlanExecutor.java:104) at org.gradle.execution.taskgraph.DefaultTaskPlanExecutor$TaskExecutorWorker$1.execute(DefaultTaskPlanExecutor.java:98) at org.gradle.execution.taskgraph.DefaultTaskExecutionPlan.execute(DefaultTaskExecutionPlan.java:663) at org.gradle.execution.taskgraph.DefaultTaskExecutionPlan.executeWithTask(DefaultTaskExecutionPlan.java:597) at org.gradle.execution.taskgraph.DefaultTaskPlanExecutor$TaskExecutorWorker.run(DefaultTaskPlanExecutor.java:98) at org.gradle.internal.concurrent.ExecutorPolicy$CatchAndRecordFailures.onExecute(ExecutorPolicy.java:63) at org.gradle.internal.concurrent.ManagedExecutorImpl$1.run(ManagedExecutorImpl.java:46) at java.util.concurrent.ThreadPoolExecutor.runWorker(ThreadPoolExecutor.java:1142) at java.util.concurrent.ThreadPoolExecutor$Worker.run(ThreadPoolExecutor.java:617) at org.gradle.internal.concurrent.ThreadFactoryImpl$ManagedThreadRunnable.run(ThreadFactoryImpl.java:55) at java.lang.Thread.run(Thread.java:745) Caused by: java.lang.RuntimeException: com.android.build.api.transform.TransformException: java.lang.RuntimeException: java.lang.RuntimeException at com.android.builder.profile.Recorder$Block.handleException(Recorder.java:55) at com.android.builder.profile.ThreadRecorder.record(ThreadRecorder.java:104) at com.android.build.gradle.internal.pipeline.TransformTask.transform(TransformTask.java:230) at sun.reflect.NativeMethodAccessorImpl.invoke0(Native Method) at sun.reflect.NativeMethodAccessorImpl.invoke(NativeMethodAccessorImpl.java:62) at sun.reflect.DelegatingMethodAccessorImpl.invoke(DelegatingMethodAccessorImpl.java:43) at java.lang.reflect.Method.invoke(Method.java:498) at org.gradle.internal.reflect.JavaMethod.invoke(JavaMethod.java:73) at org.gradle.api.internal.project.taskfactory.IncrementalTaskAction.doExecute(IncrementalTaskAction.java:50) at org.gradle.api.internal.project.taskfactory.StandardTaskAction.execute(StandardTaskAction.java:39) at org.gradle.api.internal.project.taskfactory.StandardTaskAction.execute(StandardTaskAction.java:26) at org.gradle.api.internal.tasks.execution.ExecuteActionsTaskExecuter$1.run(ExecuteActionsTaskExecuter.java:124) at org.gradle.internal.progress.DefaultBuildOperationExecutor$RunnableBuildOperationWorker.execute(DefaultBuildOperationExecutor.java:336) at org.gradle.internal.progress.DefaultBuildOperationExecutor$RunnableBuildOperationWorker.execute(DefaultBuildOperationExecutor.java:328) at org.gradle.internal.progress.DefaultBuildOperationExecutor.execute(DefaultBuildOperationExecutor.java:199) at org.gradle.internal.progress.DefaultBuildOperationExecutor.run(DefaultBuildOperationExecutor.java:110) at org.gradle.api.internal.tasks.execution.ExecuteActionsTaskExecuter.executeAction(ExecuteActionsTaskExecuter.java:113) at org.gradle.api.internal.tasks.execution.ExecuteActionsTaskExecuter.executeActions(ExecuteActionsTaskExecuter.java:95) ... 33 more Caused by: com.android.build.api.transform.TransformException: java.lang.RuntimeException: java.lang.RuntimeException at com.android.build.gradle.internal.transforms.DexArchiveBuilderTransform.transform(DexArchiveBuilderTransform.java:427) at com.android.build.gradle.internal.pipeline.TransformTask$2.call(TransformTask.java:239) at com.android.build.gradle.internal.pipeline.TransformTask$2.call(TransformTask.java:235) at com.android.builder.profile.ThreadRecorder.record(ThreadRecorder.java:102) ... 49 more Caused by: java.lang.RuntimeException: java.lang.RuntimeException at sun.reflect.NativeConstructorAccessorImpl.newInstance0(Native Method) at sun.reflect.NativeConstructorAccessorImpl.newInstance(NativeConstructorAccessorImpl.java:62) at sun.reflect.DelegatingConstructorAccessorImpl.newInstance(DelegatingConstructorAccessorImpl.java:45) at java.lang.reflect.Constructor.newInstance(Constructor.java:423) at java.util.concurrent.ForkJoinTask.getThrowableException(ForkJoinTask.java:593) at java.util.concurrent.ForkJoinTask.reportException(ForkJoinTask.java:677) at java.util.concurrent.ForkJoinTask.join(ForkJoinTask.java:720) at com.android.ide.common.internal.WaitableExecutor.waitForTasksWithQuickFail(WaitableExecutor.java:146) at com.android.build.gradle.internal.transforms.DesugarIncrementalTransformHelper.getInitalGraphData(DesugarIncrementalTransformHelper.java:162) at com.android.build.gradle.internal.transforms.DesugarIncrementalTransformHelper.makeDesugaringGraph(DesugarIncrementalTransformHelper.java:130) at com.google.common.base.Suppliers$NonSerializableMemoizingSupplier.get(Suppliers.java:160) at com.android.build.gradle.internal.transforms.DesugarIncrementalTransformHelper.getDependenciesPaths(DesugarIncrementalTransformHelper.java:231) at com.android.build.gradle.internal.transforms.DexArchiveBuilderTransform.getD8DesugaringCacheInfo(DexArchiveBuilderTransform.java:461) at com.android.build.gradle.internal.transforms.DexArchiveBuilderTransform.transform(DexArchiveBuilderTransform.java:375) ... 52 more Caused by: java.lang.RuntimeException at org.objectweb.asm.ClassVisitor.visitModule(ClassVisitor.java:148) at org.objectweb.asm.ClassReader.readModule(ClassReader.java:731) at org.objectweb.asm.ClassReader.accept(ClassReader.java:632) at org.objectweb.asm.ClassReader.accept(ClassReader.java:500) at com.android.builder.desugaring.DesugaringClassAnalyzer.analyze(DesugaringClassAnalyzer.java:144) at com.android.builder.desugaring.DesugaringClassAnalyzer.analyzeJar(DesugaringClassAnalyzer.java:92) at com.android.builder.desugaring.DesugaringClassAnalyzer.analyze(DesugaringClassAnalyzer.java:63) at com.android.build.gradle.internal.transforms.DesugarIncrementalTransformHelper.lambda$getInitalGraphData$4(DesugarIncrementalTransformHelper.java:150) at java.util.concurrent.ForkJoinTask$AdaptedCallable.exec(ForkJoinTask.java:1424) at java.util.concurrent.ForkJoinTask.doExec(ForkJoinTask.java:289) at java.util.concurrent.ForkJoinPool$WorkQueue.runTask(ForkJoinPool.java:1056) at java.util.concurrent.ForkJoinPool.runWorker(ForkJoinPool.java:1692) at java.util.concurrent.ForkJoinWorkerThread.run(ForkJoinWorkerThread.java:157) 具体情况
gradle 构建java web项目,如何指定生成的war包的存放路径?
gradle 构建java web项目,如何指定生成的war包的存放路径,默认生成在build/libs下,该怎么修改buildg.radle文件。网上说可以修改却都不说怎么修改。
android gradle工程,引用annotation包,构建javadoc报错
我在android 工程引入了android官方的注解support-annotation,然后用gradle构建时增加了一个javadoc的task,就是提取javadoc时失败,不知道怎么修改。so求助各位大神们,怎么解决? 我现在用的插件是‘com.android.tools.build:gradle:1.3.0’,gradle版本2.7 代码如下: ``` task androidJavadoc(type: Javadoc) { source = android.sourceSets.main.java.srcDirs exclude '**/pom.xml' exclude '**/proguard_annotations.pro' classpath += files(android.bootClasspath.join(File.pathSeparator)) destinationDir = file("../javadoc/") } task androidJavadocJar(type: Jar, dependsOn: androidJavadoc) { classifier = 'javadoc' from androidJavadoc.destinationDir } artifacts { archives androidSourcesJar archives androidJavadocJar } ``` 错误如下: Execution failed for task ':IPullToRefreshRecycler:androidJavadoc'. > Javadoc generation failed. Generated Javadoc options file (useful for troubleshooting): '/Users/heart19901126/zhouli/codes/50AH-code-master/IPullToRefreshRecyclerSample/IPullToRefreshRecycler/build/tmp/androidJavadoc/javadoc.options' * Try: Run with --info or --debug option to get more log output. * Exception is: org.gradle.api.tasks.TaskExecutionException: Execution failed for task ':IPullToRefreshRecycler:androidJavadoc'. at org.gradle.api.internal.tasks.execution.ExecuteActionsTaskExecuter.executeActions(ExecuteActionsTaskExecuter.java:69) at org.gradle.api.internal.tasks.execution.ExecuteActionsTaskExecuter.execute(ExecuteActionsTaskExecuter.java:46) at org.gradle.api.internal.tasks.execution.PostExecutionAnalysisTaskExecuter.execute(PostExecutionAnalysisTaskExecuter.java:35) at org.gradle.api.internal.tasks.execution.SkipUpToDateTaskExecuter.execute(SkipUpToDateTaskExecuter.java:64) at org.gradle.api.internal.tasks.execution.ValidatingTaskExecuter.execute(ValidatingTaskExecuter.java:58) at org.gradle.api.internal.tasks.execution.SkipEmptySourceFilesTaskExecuter.execute(SkipEmptySourceFilesTaskExecuter.java:42) at org.gradle.api.internal.tasks.execution.SkipTaskWithNoActionsExecuter.execute(SkipTaskWithNoActionsExecuter.java:52) at org.gradle.api.internal.tasks.execution.SkipOnlyIfTaskExecuter.execute(SkipOnlyIfTaskExecuter.java:53) at org.gradle.api.internal.tasks.execution.ExecuteAtMostOnceTaskExecuter.execute(ExecuteAtMostOnceTaskExecuter.java:43) at org.gradle.api.internal.AbstractTask.executeWithoutThrowingTaskFailure(AbstractTask.java:305) at org.gradle.execution.taskgraph.AbstractTaskPlanExecutor$TaskExecutorWorker.executeTask(AbstractTaskPlanExecutor.java:79) at org.gradle.execution.taskgraph.AbstractTaskPlanExecutor$TaskExecutorWorker.processTask(AbstractTaskPlanExecutor.java:63) at org.gradle.execution.taskgraph.AbstractTaskPlanExecutor$TaskExecutorWorker.run(AbstractTaskPlanExecutor.java:51) at org.gradle.execution.taskgraph.ParallelTaskPlanExecutor.process(ParallelTaskPlanExecutor.java:51) at org.gradle.execution.taskgraph.DefaultTaskGraphExecuter.execute(DefaultTaskGraphExecuter.java:88) at org.gradle.execution.SelectedTaskExecutionAction.execute(SelectedTaskExecutionAction.java:29) at org.gradle.execution.DefaultBuildExecuter.execute(DefaultBuildExecuter.java:62) at org.gradle.execution.DefaultBuildExecuter.access$200(DefaultBuildExecuter.java:23) at org.gradle.execution.DefaultBuildExecuter$2.proceed(DefaultBuildExecuter.java:68) at org.gradle.execution.DryRunBuildExecutionAction.execute(DryRunBuildExecutionAction.java:32) at org.gradle.execution.DefaultBuildExecuter.execute(DefaultBuildExecuter.java:62) at org.gradle.execution.DefaultBuildExecuter.execute(DefaultBuildExecuter.java:55) at org.gradle.initialization.DefaultGradleLauncher.doBuildStages(DefaultGradleLauncher.java:149) at org.gradle.initialization.DefaultGradleLauncher.doBuild(DefaultGradleLauncher.java:106) at org.gradle.initialization.DefaultGradleLauncher.run(DefaultGradleLauncher.java:86) at org.gradle.launcher.exec.InProcessBuildActionExecuter$DefaultBuildController.run(InProcessBuildActionExecuter.java:80) at org.gradle.launcher.cli.ExecuteBuildAction.run(ExecuteBuildAction.java:33) at org.gradle.launcher.cli.ExecuteBuildAction.run(ExecuteBuildAction.java:24) at org.gradle.launcher.exec.InProcessBuildActionExecuter.execute(InProcessBuildActionExecuter.java:36) at org.gradle.launcher.exec.InProcessBuildActionExecuter.execute(InProcessBuildActionExecuter.java:26) at org.gradle.launcher.cli.RunBuildAction.run(RunBuildAction.java:51) at org.gradle.internal.Actions$RunnableActionAdapter.execute(Actions.java:171) at org.gradle.launcher.cli.CommandLineActionFactory$ParseAndBuildAction.execute(CommandLineActionFactory.java:237) at org.gradle.launcher.cli.CommandLineActionFactory$ParseAndBuildAction.execute(CommandLineActionFactory.java:210) at org.gradle.launcher.cli.JavaRuntimeValidationAction.execute(JavaRuntimeValidationAction.java:35) at org.gradle.launcher.cli.JavaRuntimeValidationAction.execute(JavaRuntimeValidationAction.java:24) at org.gradle.launcher.cli.CommandLineActionFactory$WithLogging.execute(CommandLineActionFactory.java:206) at org.gradle.launcher.cli.CommandLineActionFactory$WithLogging.execute(CommandLineActionFactory.java:169) at org.gradle.launcher.cli.ExceptionReportingAction.execute(ExceptionReportingAction.java:33) at org.gradle.launcher.cli.ExceptionReportingAction.execute(ExceptionReportingAction.java:22) at org.gradle.launcher.Main.doAction(Main.java:33) at org.gradle.launcher.bootstrap.EntryPoint.run(EntryPoint.java:45) at org.gradle.launcher.bootstrap.ProcessBootstrap.runNoExit(ProcessBootstrap.java:54) at org.gradle.launcher.bootstrap.ProcessBootstrap.run(ProcessBootstrap.java:35) at org.gradle.launcher.GradleMain.main(GradleMain.java:23) Caused by: org.gradle.api.GradleException: Javadoc generation failed. Generated Javadoc options file (useful for troubleshooting): '/Users/heart19901126/zhouli/codes/50AH-code-master/IPullToRefreshRecyclerSample/IPullToRefreshRecycler/build/tmp/androidJavadoc/javadoc.options' at org.gradle.api.tasks.javadoc.internal.JavadocGenerator.execute(JavadocGenerator.java:55) at org.gradle.api.tasks.javadoc.internal.JavadocGenerator.execute(JavadocGenerator.java:31) at org.gradle.api.tasks.javadoc.Javadoc.executeExternalJavadoc(Javadoc.java:140) at org.gradle.api.tasks.javadoc.Javadoc.generate(Javadoc.java:128) at org.gradle.internal.reflect.JavaMethod.invoke(JavaMethod.java:63) at org.gradle.api.internal.project.taskfactory.AnnotationProcessingTaskFactory$StandardTaskAction.doExecute(AnnotationProcessingTaskFactory.java:218) at org.gradle.api.internal.project.taskfactory.AnnotationProcessingTaskFactory$StandardTaskAction.execute(AnnotationProcessingTaskFactory.java:211) at org.gradle.api.internal.project.taskfactory.AnnotationProcessingTaskFactory$StandardTaskAction.execute(AnnotationProcessingTaskFactory.java:200) at org.gradle.api.internal.AbstractTask$TaskActionWrapper.execute(AbstractTask.java:579) at org.gradle.api.internal.AbstractTask$TaskActionWrapper.execute(AbstractTask.java:562) at org.gradle.api.internal.tasks.execution.ExecuteActionsTaskExecuter.executeAction(ExecuteActionsTaskExecuter.java:80) at org.gradle.api.internal.tasks.execution.ExecuteActionsTaskExecuter.executeActions(ExecuteActionsTaskExecuter.java:61) ... 44 more Caused by: org.gradle.process.internal.ExecException: Process 'command '/Library/Java/JavaVirtualMachines/jdk1.8.0_31.jdk/Contents/Home/bin/javadoc'' finished with non-zero exit value 1 at org.gradle.process.internal.DefaultExecHandle$ExecResultImpl.assertNormalExitValue(DefaultExecHandle.java:365) at org.gradle.process.internal.DefaultExecAction.execute(DefaultExecAction.java:31) at org.gradle.api.tasks.javadoc.internal.JavadocGenerator.execute(JavadocGenerator.java:52) ... 55 more
studio使用gradle成功build,idea却失败
报错如下: ``` Error:Gradle: A problem occurred configuring root project 'MyApplication1'. > Could not resolve all dependencies for configuration ':classpath'. > Could not resolve com.android.tools.build:gradle:2.2.2. Required by: :MyApplication1:unspecified > Could not resolve com.android.tools.build:gradle:2.2.2. > Could not get resource 'https://jcenter.bintray.com/com/android/tools/build/gradle/2.2.2/gradle-2.2.2.pom'. > Could not GET 'https://jcenter.bintray.com/com/android/tools/build/gradle/2.2.2/gradle-2.2.2.pom'. Received status code 400 from server: Bad Request ``` 十分诡异!studio和idea 的 gradle设置几乎是一样的!gradle对应的版本也是存在的 ![图片说明](https://img-ask.csdn.net/upload/201704/20/1492659180_279864.png) 看了下网上很多文章,并没有解决问题! 是否有人遇到过相似问题,并且成功解决问题呢?
Unity2018.3.0f2出现了gradle报错
Unity2018.3.0f2使用gradle进行android打包的时候出现了CommandInvokationFailure: Gradle build failed.报错 问题报错如图 ![图片说明](https://img-ask.csdn.net/upload/201908/10/1565410332_404874.png) 在网上查了很多方法,Android SDK与JDK也都已经更新了,但是每一次Build到这里的时候总是会出现CommandInvokationFailure: Gradle build failed报错,怀疑可能是gradle的版本太高了?不过却不知道怎么更改unity中的gradle,报错中提示的路径在Temp文件夹下面找不到,哪位大佬知道像这种情况要怎么解决呀。
OpenJdk platform binary idea64启动报错
parallel desktop 虚拟机中装了win7,win7中安装idea64,就简单写了个helloworld输出,运行就报以下错误,win7中的显卡也升级不了 Error:Abnormal build process termination: "C:\Me\JetBrains\IntelliJ IDEA 2018.3.3\jre64\bin\java.exe" -Xmx700m -Djava.awt.headless=true -Djava.endorsed.dirs=\"\" -Djdt.compiler.useSingleThread=true -Dcompile.parallel=false -Drebuild.on.dependency.change=true -Djava.net.preferIPv4Stack=true -Dio.netty.initialSeedUniquifier=5762697851691075053 -Dfile.encoding=GBK -Duser.language=zh -Duser.country=CN -Didea.paths.selector=IntelliJIdea2018.3 "-Didea.home.path=C:\Me\JetBrains\IntelliJ IDEA 2018.3.3" -Didea.config.path=C:\Users\Brazen\.IntelliJIdea2018.3\config -Didea.plugins.path=C:\Users\Brazen\.IntelliJIdea2018.3\config\plugins -Djps.log.dir=C:/Users/Brazen/.IntelliJIdea2018.3/system/log/build-log "-Djps.fallback.jdk.home=C:/Me/JetBrains/IntelliJ IDEA 2018.3.3/jre64" -Djps.fallback.jdk.version=1.8.0_152-release -Dio.netty.noUnsafe=true -Djava.io.tmpdir=C:/Users/Brazen/.IntelliJIdea2018.3/system/compile-server/test_f6da7a95/_temp_ -Djps.backward.ref.index.builder=true -Dkotlin.incremental.compilation=true -Dkotlin.daemon.enabled -Dkotlin.daemon.client.alive.path=\"C:\Users\Brazen\AppData\Local\Temp\kotlin-idea-3894503579951865671-is-running\" -classpath "C:/Me/JetBrains/IntelliJ IDEA 2018.3.3/lib/jps-launcher.jar;C:/Me/JetBrains/IntelliJ IDEA 2018.3.3/jre64/lib/tools.jar;C:/Me/JetBrains/IntelliJ IDEA 2018.3.3/lib/optimizedFileManager.jar" org.jetbrains.jps.cmdline.Launcher "C:/Me/JetBrains/IntelliJ IDEA 2018.3.3/lib/netty-common-4.1.30.Final.jar;C:/Me/JetBrains/IntelliJ IDEA 2018.3.3/lib/annotations.jar;C:/Me/JetBrains/IntelliJ IDEA 2018.3.3/lib/jps-builders.jar;C:/Me/JetBrains/IntelliJ IDEA 2018.3.3/lib/aether-spi-1.1.0.jar;C:/Me/JetBrains/IntelliJ IDEA 2018.3.3/lib/maven-builder-support-3.3.9.jar;C:/Me/JetBrains/IntelliJ IDEA 2018.3.3/lib/maven-aether-provider-3.3.9.jar;C:/Me/JetBrains/IntelliJ IDEA 2018.3.3/lib/oro-2.0.8.jar;C:/Me/JetBrains/IntelliJ IDEA 2018.3.3/lib/slf4j-api-1.7.25.jar;C:/Me/JetBrains/IntelliJ IDEA 2018.3.3/lib/httpcore-4.4.10.jar;C:/Me/JetBrains/IntelliJ IDEA 2018.3.3/lib/nanoxml-2.2.3.jar;C:/Me/JetBrains/IntelliJ IDEA 2018.3.3/lib/plexus-interpolation-1.21.jar;C:/Me/JetBrains/IntelliJ IDEA 2018.3.3/lib/aether-impl-1.1.0.jar;C:/Me/JetBrains/IntelliJ IDEA 2018.3.3/lib/commons-lang3-3.4.jar;C:/Me/JetBrains/IntelliJ IDEA 2018.3.3/lib/commons-codec-1.10.jar;C:/Me/JetBrains/IntelliJ IDEA 2018.3.3/lib/forms_rt.jar;C:/Me/JetBrains/IntelliJ IDEA 2018.3.3/lib/trove4j.jar;C:/Me/JetBrains/IntelliJ IDEA 2018.3.3/lib/maven-model-builder-3.3.9.jar;C:/Me/JetBrains/IntelliJ IDEA 2018.3.3/lib/jps-model.jar;C:/Me/JetBrains/IntelliJ IDEA 2018.3.3/lib/idea_rt.jar;C:/Me/JetBrains/IntelliJ IDEA 2018.3.3/lib/util.jar;C:/Me/JetBrains/IntelliJ IDEA 2018.3.3/lib/plexus-component-annotations-1.6.jar;C:/Me/JetBrains/IntelliJ IDEA 2018.3.3/lib/protobuf-java-3.4.0.jar;C:/Me/JetBrains/IntelliJ IDEA 2018.3.3/lib/netty-buffer-4.1.30.Final.jar;C:/Me/JetBrains/IntelliJ IDEA 2018.3.3/lib/asm-all-7.0.jar;C:/Me/JetBrains/IntelliJ IDEA 2018.3.3/lib/log4j.jar;C:/Me/JetBrains/IntelliJ IDEA 2018.3.3/lib/aether-dependency-resolver.jar;C:/Me/JetBrains/IntelliJ IDEA 2018.3.3/lib/guava-25.1-jre.jar;C:/Me/JetBrains/IntelliJ IDEA 2018.3.3/lib/aether-connector-basic-1.1.0.jar;C:/Me/JetBrains/IntelliJ IDEA 2018.3.3/lib/netty-resolver-4.1.30.Final.jar;C:/Me/JetBrains/IntelliJ IDEA 2018.3.3/lib/aether-transport-http-1.1.0.jar;C:/Me/JetBrains/IntelliJ IDEA 2018.3.3/lib/commons-logging-1.2.jar;C:/Me/JetBrains/IntelliJ IDEA 2018.3.3/lib/resources_en.jar;C:/Me/JetBrains/IntelliJ IDEA 2018.3.3/lib/aether-api-1.1.0.jar;C:/Me/JetBrains/IntelliJ IDEA 2018.3.3/lib/maven-repository-metadata-3.3.9.jar;C:/Me/JetBrains/IntelliJ IDEA 2018.3.3/lib/jna-platform.jar;C:/Me/JetBrains/IntelliJ IDEA 2018.3.3/lib/aether-util-1.1.0.jar;C:/Me/JetBrains/IntelliJ IDEA 2018.3.3/lib/netty-transport-4.1.30.Final.jar;C:/Me/JetBrains/IntelliJ IDEA 2018.3.3/lib/aether-transport-file-1.1.0.jar;C:/Me/JetBrains/IntelliJ IDEA 2018.3.3/lib/jna.jar;C:/Me/JetBrains/IntelliJ IDEA 2018.3.3/lib/netty-codec-4.1.30.Final.jar;C:/Me/JetBrains/IntelliJ IDEA 2018.3.3/lib/httpclient-4.5.6.jar;C:/Me/JetBrains/IntelliJ IDEA 2018.3.3/lib/lz4-1.3.0.jar;C:/Me/JetBrains/IntelliJ IDEA 2018.3.3/lib/platform-api.jar;C:/Me/JetBrains/IntelliJ IDEA 2018.3.3/lib/maven-artifact-3.3.9.jar;C:/Me/JetBrains/IntelliJ IDEA 2018.3.3/lib/jdom.jar;C:/Me/JetBrains/IntelliJ IDEA 2018.3.3/lib/maven-model-3.3.9.jar;C:/Me/JetBrains/IntelliJ IDEA 2018.3.3/lib/forms-1.1-preview.jar;C:/Me/JetBrains/IntelliJ IDEA 2018.3.3/lib/jps-builders-6.jar;C:/Me/JetBrains/IntelliJ IDEA 2018.3.3/lib/javac2.jar;C:/Me/JetBrains/IntelliJ IDEA 2018.3.3/lib/plexus-utils-3.0.22.jar;;C:/Me/JetBrains/IntelliJ IDEA 2018.3.3/lib/gson-2.8.5.jar;C:/Me/JetBrains/IntelliJ IDEA 2018.3.3/plugins/android/lib/jarutils.jar;C:/Me/JetBrains/IntelliJ IDEA 2018.3.3/lib/guava-25.1-jre.jar;C:/Me/JetBrains/IntelliJ IDEA 2018.3.3/plugins/android/lib/common-26.1.2.jar;C:/Me/JetBrains/IntelliJ IDEA 2018.3.3/plugins/android/lib/manifest-merger-26.1.2.jar;C:/Me/JetBrains/IntelliJ IDEA 2018.3.3/plugins/android/lib/sdk-common-26.1.2.jar;C:/Me/JetBrains/IntelliJ IDEA 2018.3.3/plugins/android/lib/builder-model-3.1.2.jar;C:/Me/JetBrains/IntelliJ IDEA 2018.3.3/plugins/android/lib/builder-test-api-3.1.2.jar;C:/Me/JetBrains/IntelliJ IDEA 2018.3.3/plugins/android/lib/ddmlib-26.1.2.jar;C:/Me/JetBrains/IntelliJ IDEA 2018.3.3/plugins/android/lib/repository-26.1.2.jar;C:/Me/JetBrains/IntelliJ IDEA 2018.3.3/plugins/gradle/lib/gradle-api-4.10.jar;C:/Me/JetBrains/IntelliJ IDEA 2018.3.3/lib/gson-2.8.5.jar;C:/Me/JetBrains/IntelliJ IDEA 2018.3.3/plugins/android/lib/jarutils.jar;C:/Me/JetBrains/IntelliJ IDEA 2018.3.3/lib/guava-25.1-jre.jar;C:/Me/JetBrains/IntelliJ IDEA 2018.3.3/plugins/android/lib/common-26.1.2.jar;C:/Me/JetBrains/IntelliJ IDEA 2018.3.3/plugins/android/lib/manifest-merger-26.1.2.jar;C:/Me/JetBrains/IntelliJ IDEA 2018.3.3/plugins/android/lib/sdk-common-26.1.2.jar;C:/Me/JetBrains/IntelliJ IDEA 2018.3.3/plugins/android/lib/builder-model-3.1.2.jar;C:/Me/JetBrains/IntelliJ IDEA 2018.3.3/plugins/android/lib/builder-test-api-3.1.2.jar;C:/Me/JetBrains/IntelliJ IDEA 2018.3.3/plugins/android/lib/ddmlib-26.1.2.jar;C:/Me/JetBrains/IntelliJ IDEA 2018.3.3/plugins/android/lib/repository-26.1.2.jar;C:/Me/JetBrains/IntelliJ IDEA 2018.3.3/plugins/gradle/lib/gradle-api-4.10.jar;C:/Me/JetBrains/IntelliJ IDEA 2018.3.3/plugins/ant/lib/ant-jps-plugin.jar;C:/Me/JetBrains/IntelliJ IDEA 2018.3.3/plugins/uiDesigner/lib/jps/ui-designer-jps-plugin.jar;C:/Me/JetBrains/IntelliJ IDEA 2018.3.3/plugins/IntelliLang/lib/intellilang-jps-plugin.jar;C:/Me/JetBrains/IntelliJ IDEA 2018.3.3/plugins/Groovy/lib/groovy-jps-plugin.jar;C:/Me/JetBrains/IntelliJ IDEA 2018.3.3/plugins/Groovy/lib/groovy-rt-constants.jar;C:/Me/JetBrains/IntelliJ IDEA 2018.3.3/plugins/eclipse/lib/eclipse-jps-plugin.jar;C:/Me/JetBrains/IntelliJ IDEA 2018.3.3/plugins/eclipse/lib/common-eclipse-util.jar;C:/Me/JetBrains/IntelliJ IDEA 2018.3.3/plugins/maven/lib/maven-jps-plugin.jar;C:/Me/JetBrains/IntelliJ IDEA 2018.3.3/plugins/osmorc/lib/osmorc-jps-plugin.jar;C:/Me/JetBrains/IntelliJ IDEA 2018.3.3/plugins/osmorc/lib/biz.aQute.bndlib-4.0.0.jar;C:/Me/JetBrains/IntelliJ IDEA 2018.3.3/plugins/osmorc/lib/biz.aQute.repository-4.0.0.jar;C:/Me/JetBrains/IntelliJ IDEA 2018.3.3/plugins/osmorc/lib/biz.aQute.resolve-4.0.0.jar;C:/Me/JetBrains/IntelliJ IDEA 2018.3.3/plugins/osmorc/lib/bundlor-all.jar;C:/Me/JetBrains/IntelliJ IDEA 2018.3.3/plugins/aspectj/lib/aspectj-jps-plugin.jar;C:/Me/JetBrains/IntelliJ IDEA 2018.3.3/plugins/gradle/lib/gradle-jps-plugin.jar;C:/Me/JetBrains/IntelliJ IDEA 2018.3.3/plugins/devkit/lib/devkit-jps-plugin.jar;C:/Me/JetBrains/IntelliJ IDEA 2018.3.3/plugins/JavaEE/lib/javaee-jps-plugin.jar;C:/Me/JetBrains/IntelliJ IDEA 2018.3.3/plugins/JavaEE/lib/jps/jpa-jps-plugin.jar;C:/Me/JetBrains/IntelliJ IDEA 2018.3.3/plugins/webSphereIntegration/lib/jps/webSphere-jps-plugin.jar;C:/Me/JetBrains/IntelliJ IDEA 2018.3.3/plugins/weblogicIntegration/lib/jps/weblogic-jps-plugin.jar;C:/Me/JetBrains/IntelliJ IDEA 2018.3.3/plugins/android/lib/jps/android-jps-plugin.jar;C:/Me/JetBrains/IntelliJ IDEA 2018.3.3/plugins/android/lib/android-common.jar;C:/Me/JetBrains/IntelliJ IDEA 2018.3.3/plugins/android/lib/build-common.jar;C:/Me/JetBrains/IntelliJ IDEA 2018.3.3/plugins/android/lib/android-rt.jar;C:/Me/JetBrains/IntelliJ IDEA 2018.3.3/plugins/android/lib/sdklib.jar;C:/Me/JetBrains/IntelliJ IDEA 2018.3.3/plugins/android/lib/common-26.1.2.jar;C:/Me/JetBrains/IntelliJ IDEA 2018.3.3/plugins/android/lib/jarutils.jar;C:/Me/JetBrains/IntelliJ IDEA 2018.3.3/plugins/android/lib/layoutlib-api.jar;C:/Me/JetBrains/IntelliJ IDEA 2018.3.3/plugins/javaFX/lib/javaFX-jps-plugin.jar;C:/Me/JetBrains/IntelliJ IDEA 2018.3.3/plugins/javaFX/lib/common-javaFX-plugin.jar;C:/Me/JetBrains/IntelliJ IDEA 2018.3.3/plugins/Kotlin/lib/jps/kotlin-jps-plugin.jar;C:/Me/JetBrains/IntelliJ IDEA 2018.3.3/plugins/Kotlin/lib/kotlin-stdlib.jar;C:/Me/JetBrains/IntelliJ IDEA 2018.3.3/plugins/Kotlin/lib/kotlin-reflect.jar;C:/Me/JetBrains/IntelliJ IDEA 2018.3.3/plugins/Kotlin/lib/kotlin-plugin.jar;C:/Me/JetBrains/IntelliJ IDEA 2018.3.3/plugins/Kotlin/lib/android-extensions-ide.jar;C:/Me/JetBrains/IntelliJ IDEA 2018.3.3/plugins/Kotlin/lib/android-extensions-compiler.jar;C:/Me/JetBrains/IntelliJ IDEA 2018.3.3/plugins/flex/lib/flex-jps-plugin.jar;C:/Me/JetBrains/IntelliJ IDEA 2018.3.3/plugins/flex/lib/flex-shared.jar;C:/Me/JetBrains/IntelliJ IDEA 2018.3.3/plugins/dmServer/lib/dmServer-jps-plugin.jar;C:/Me/JetBrains/IntelliJ IDEA 2018.3.3/plugins/GwtStudio/lib/gwt-jps-plugin.jar;C:/Me/JetBrains/IntelliJ IDEA 2018.3.3/plugins/GoogleAppEngine/lib/google-app-engine-jps-plugin.jar;C:/Me/JetBrains/IntelliJ IDEA 2018.3.3/plugins/GoogleAppEngine/lib/appEngine-runtime.jar;C:/Me/JetBrains/IntelliJ IDEA 2018.3.3/plugins/Grails/lib/grails-jps-plugin.jar;C:/Me/JetBrains/IntelliJ IDEA 2018.3.3/plugins/Grails/lib/grails-compiler-patch.jar" org.jetbrains.jps.cmdline.BuildMain 127.0.0.1 49669 1e1dfc85-eb4c-4dc1-b38c-ed6896c49276 C:/Users/Brazen/.IntelliJIdea2018.3/system/compile-server
ionic3打包出错,求大佬帮忙!!
今天打包的时候cordova build android就出现下面这个错误,以前都没有问题的,请问是哪的问题?该如何解决了,求具体如何操作。。。 C:\Users\Administrator\.gradle\caches\transforms-1\files-1.1\appcompat-v7-26.1.0.aar\ac54a0ace3996090bdb7ad492e3b5bcd\res\values\values.xml:246:5-69: AAPT: error: resource android:attr/fontVariationSettings not found. C:\Users\Administrator\.gradle\caches\transforms-1\files-1.1\appcompat-v7-26.1.0.aar\ac54a0ace3996090bdb7ad492e3b5bcd\res\values\values.xml:246:5-69: AAPT: error: resource android:attr/ttcIndex not found. D:\Code\YSDA\ysda\platforms\android\app\build\intermediates\incremental\mergeDebugResources\merged.dir\values\values.xml:248: error: resource android:attr/fontVariationSettings not found. D:\Code\YSDA\ysda\platforms\android\app\build\intermediates\incremental\mergeDebugResources\merged.dir\values\values.xml:248: error: resource android:attr/ttcIndex not found. error: failed linking references. =============== 全部的: PS D:\code\ysda\ysda> cordova build android cordova-android-support-gradle-release: Android platform: V7+ cordova-android-support-gradle-release: Wrote custom version '26.+' to D:\code\ysda\ysda\platforms\android\app\build.gra dle cordova-android-support-gradle-release: Wrote custom version '26.+' to D:\code\ysda\ysda\platforms\android\cordova-andro id-support-gradle-release\zxh-cordova-android-support-gradle-release.gradle Android Studio project detected cordova-android-support-gradle-release: Android platform: V7+ cordova-android-support-gradle-release: Wrote custom version '26.+' to D:\code\ysda\ysda\platforms\android\app\build.gra dle cordova-android-support-gradle-release: Wrote custom version '26.+' to D:\code\ysda\ysda\platforms\android\cordova-andro id-support-gradle-release\zxh-cordova-android-support-gradle-release.gradle ANDROID_HOME=C:\Users\Administrator\AppData\Local\Android\sdk JAVA_HOME=E:\Java\jdk1.8.0_91 studio Starting a Gradle Daemon (subsequent builds will be faster) BUILD SUCCESSFUL in 5s 1 actionable task: 1 executed Subproject Path: CordovaLib Subproject Path: app publishNonDefault is deprecated and has no effect anymore. All variants are now published. +----------------------------------------------------------------- | cordova-android-support-gradle-release: 26.+ +----------------------------------------------------------------- Configuration 'compile' in project ':app' is deprecated. Use 'implementation' instead. The Task.leftShift(Closure) method has been deprecated and is scheduled to be removed in Gradle 5.0. Please use Task.doL ast(Action) instead. at build_dxxuwns2wpt3q41rnhqfnnu3n.run(D:\Code\YSDA\ysda\platforms\android\app\build.gradle:152) :CordovaLib:preBuild UP-TO-DATE :CordovaLib:preDebugBuild UP-TO-DATE :CordovaLib:compileDebugAidl :CordovaLib:compileDebugRenderscript :CordovaLib:checkDebugManifest :CordovaLib:generateDebugBuildConfig :CordovaLib:prepareLintJar :CordovaLib:generateDebugResValues :CordovaLib:generateDebugResources :CordovaLib:packageDebugResources :CordovaLib:platformAttrExtractor :CordovaLib:processDebugManifest :CordovaLib:javaPreCompileDebug :CordovaLib:processDebugJavaRes NO-SOURCE :app:preBuild UP-TO-DATE :app:preDebugBuild :app:compileDebugAidl :CordovaLib:packageDebugRenderscript NO-SOURCE :app:compileDebugRenderscript :app:checkDebugManifest :app:generateDebugBuildConfig :app:prepareLintJar :app:generateDebugResValues :app:generateDebugResources :app:mergeDebugResources :app:createDebugCompatibleScreenManifests :app:processDebugManifest :app:splitsDiscoveryTaskDebug :app:compileDebugNdk NO-SOURCE :CordovaLib:mergeDebugShaders :CordovaLib:compileDebugShaders :CordovaLib:generateDebugAssets :CordovaLib:mergeDebugAssets :app:mergeDebugShaders :app:compileDebugShaders :app:generateDebugAssets :app:mergeDebugAssets :CordovaLib:compileDebugNdk NO-SOURCE :CordovaLib:mergeDebugJniLibFolders :CordovaLib:transformNativeLibsWithMergeJniLibsForDebug :CordovaLib:transformNativeLibsWithIntermediateJniLibsForDebug :app:mergeDebugJniLibFolders :app:processDebugJavaRes NO-SOURCE :app:validateSigningDebug :CordovaLib:processDebugResources :CordovaLib:generateDebugSources :CordovaLib:compileDebugJavaWithJavacע: ijЩ�����ļ�ʹ�û�����ѹ�ʱ�� API�� ע: �й���ϸ��Ϣ, ��ʹ�� -Xlint:deprecation ���±��롣 :CordovaLib:transformClassesAndResourcesWithPrepareIntermediateJarsForDebug :app:processDebugResourcesC:\Users\Administrator\.gradle\caches\transforms-1\files-1.1\appcompat-v7-26.1.0.aar\ac54a0ace 3996090bdb7ad492e3b5bcd\res\values\values.xml:246:5-69: AAPT: error: resource android:attr/fontVariationSettings not fou nd. C:\Users\Administrator\.gradle\caches\transforms-1\files-1.1\appcompat-v7-26.1.0.aar\ac54a0ace3996090bdb7ad492e3b5bcd\re s\values\values.xml:246:5-69: AAPT: error: resource android:attr/ttcIndex not found. D:\Code\YSDA\ysda\platforms\android\app\build\intermediates\incremental\mergeDebugResources\merged.dir\values\values.xml :248: error: resource android:attr/fontVariationSettings not found. D:\Code\YSDA\ysda\platforms\android\app\build\intermediates\incremental\mergeDebugResources\merged.dir\values\values.xml :248: error: resource android:attr/ttcIndex not found. error: failed linking references. Failed to execute aapt com.android.ide.common.process.ProcessException: Failed to execute aapt at com.android.builder.core.AndroidBuilder.processResources(AndroidBuilder.java:796) at com.android.build.gradle.tasks.ProcessAndroidResources.invokeAaptForSplit(ProcessAndroidResources.java:551) at com.android.build.gradle.tasks.ProcessAndroidResources.doFullTaskAction(ProcessAndroidResources.java:285) at com.android.build.gradle.internal.tasks.IncrementalTask.taskAction(IncrementalTask.java:109) at sun.reflect.GeneratedMethodAccessor182.invoke(Unknown Source) at sun.reflect.DelegatingMethodAccessorImpl.invoke(DelegatingMethodAccessorImpl.java:43) at java.lang.reflect.Method.invoke(Method.java:498) at org.gradle.internal.reflect.JavaMethod.invoke(JavaMethod.java:73) at org.gradle.api.internal.project.taskfactory.DefaultTaskClassInfoStore$IncrementalTaskAction.doExecute(Default TaskClassInfoStore.java:173) at org.gradle.api.internal.project.taskfactory.DefaultTaskClassInfoStore$StandardTaskAction.execute(DefaultTaskC lassInfoStore.java:134) at org.gradle.api.internal.project.taskfactory.DefaultTaskClassInfoStore$StandardTaskAction.execute(DefaultTaskC lassInfoStore.java:121) at org.gradle.api.internal.tasks.execution.ExecuteActionsTaskExecuter$1.run(ExecuteActionsTaskExecuter.java:122) at org.gradle.internal.progress.DefaultBuildOperationExecutor$RunnableBuildOperationWorker.execute(DefaultBuildO perationExecutor.java:336) at org.gradle.internal.progress.DefaultBuildOperationExecutor$RunnableBuildOperationWorker.execute(DefaultBuildO perationExecutor.java:328) at org.gradle.internal.progress.DefaultBuildOperationExecutor.execute(DefaultBuildOperationExecutor.java:197) at org.gradle.internal.progress.DefaultBuildOperationExecutor.run(DefaultBuildOperationExecutor.java:107) at org.gradle.api.internal.tasks.execution.ExecuteActionsTaskExecuter.executeAction(ExecuteActionsTaskExecuter.j ava:111) at org.gradle.api.internal.tasks.execution.ExecuteActionsTaskExecuter.executeActions(ExecuteActionsTaskExecuter. java:92) at org.gradle.api.internal.tasks.execution.ExecuteActionsTaskExecuter.execute(ExecuteActionsTaskExecuter.java:70 ) at org.gradle.api.internal.tasks.execution.SkipUpToDateTaskExecuter.execute(SkipUpToDateTaskExecuter.java:63) at org.gradle.api.internal.tasks.execution.ResolveTaskOutputCachingStateExecuter.execute(ResolveTaskOutputCachin gStateExecuter.java:54) at org.gradle.api.internal.tasks.execution.ValidatingTaskExecuter.execute(ValidatingTaskExecuter.java:58) at org.gradle.api.internal.tasks.execution.SkipEmptySourceFilesTaskExecuter.execute(SkipEmptySourceFilesTaskExec uter.java:88) at org.gradle.api.internal.tasks.execution.ResolveTaskArtifactStateTaskExecuter.execute(ResolveTaskArtifactState TaskExecuter.java:52) at org.gradle.api.internal.tasks.execution.SkipTaskWithNoActionsExecuter.execute(SkipTaskWithNoActionsExecuter.j ava:52) at org.gradle.api.internal.tasks.execution.SkipOnlyIfTaskExecuter.execute(SkipOnlyIfTaskExecuter.java:54) at org.gradle.api.internal.tasks.execution.ExecuteAtMostOnceTaskExecuter.execute(ExecuteAtMostOnceTaskExecuter.j ava:43) at org.gradle.api.internal.tasks.execution.CatchExceptionTaskExecuter.execute(CatchExceptionTaskExecuter.java:34 ) at org.gradle.execution.taskgraph.DefaultTaskGraphExecuter$EventFiringTaskWorker$1.run(DefaultTaskGraphExecuter. java:248) at org.gradle.internal.progress.DefaultBuildOperationExecutor$RunnableBuildOperationWorker.execute(DefaultBuildO perationExecutor.java:336) at org.gradle.internal.progress.DefaultBuildOperationExecutor$RunnableBuildOperationWorker.execute(DefaultBuildO perationExecutor.java:328) at org.gradle.internal.progress.DefaultBuildOperationExecutor.execute(DefaultBuildOperationExecutor.java:197) at org.gradle.internal.progress.DefaultBuildOperationExecutor.run(DefaultBuildOperationExecutor.java:107) at org.gradle.execution.taskgraph.DefaultTaskGraphExecuter$EventFiringTaskWorker.execute(DefaultTaskGraphExecute r.java:241) at org.gradle.execution.taskgraph.DefaultTaskGraphExecuter$EventFiringTaskWorker.execute(DefaultTaskGraphExecute r.java:230) at org.gradle.execution.taskgraph.DefaultTaskPlanExecutor$TaskExecutorWorker.processTask(DefaultTaskPlanExecutor .java:124) at org.gradle.execution.taskgraph.DefaultTaskPlanExecutor$TaskExecutorWorker.access$200(DefaultTaskPlanExecutor. java:80) at org.gradle.execution.taskgraph.DefaultTaskPlanExecutor$TaskExecutorWorker$1.execute(DefaultTaskPlanExecutor.j ava:105) at org.gradle.execution.taskgraph.DefaultTaskPlanExecutor$TaskExecutorWorker$1.execute(DefaultTaskPlanExecutor.j ava:99) at org.gradle.execution.taskgraph.DefaultTaskExecutionPlan.execute(DefaultTaskExecutionPlan.java:625) at org.gradle.execution.taskgraph.DefaultTaskExecutionPlan.executeWithTask(DefaultTaskExecutionPlan.java:580) at org.gradle.execution.taskgraph.DefaultTaskPlanExecutor$TaskExecutorWorker.run(DefaultTaskPlanExecutor.java:99 ) at org.gradle.execution.taskgraph.DefaultTaskPlanExecutor.process(DefaultTaskPlanExecutor.java:60) at org.gradle.execution.taskgraph.DefaultTaskGraphExecuter.execute(DefaultTaskGraphExecuter.java:128) at org.gradle.execution.SelectedTaskExecutionAction.execute(SelectedTaskExecutionAction.java:37) at org.gradle.execution.DefaultBuildExecuter.execute(DefaultBuildExecuter.java:37) at org.gradle.execution.DefaultBuildExecuter.access$000(DefaultBuildExecuter.java:23) at org.gradle.execution.DefaultBuildExecuter$1.proceed(DefaultBuildExecuter.java:43) at org.gradle.execution.DryRunBuildExecutionAction.execute(DryRunBuildExecutionAction.java:46) at org.gradle.execution.DefaultBuildExecuter.execute(DefaultBuildExecuter.java:37) at org.gradle.execution.DefaultBuildExecuter.execute(DefaultBuildExecuter.java:30) at org.gradle.initialization.DefaultGradleLauncher$ExecuteTasks.run(DefaultGradleLauncher.java:311) at org.gradle.internal.progress.DefaultBuildOperationExecutor$RunnableBuildOperationWorker.execute(DefaultBuildO perationExecutor.java:336) at org.gradle.internal.progress.DefaultBuildOperationExecutor$RunnableBuildOperationWorker.execute(DefaultBuildO perationExecutor.java:328) at org.gradle.internal.progress.DefaultBuildOperationExecutor.execute(DefaultBuildOperationExecutor.java:197) at org.gradle.internal.progress.DefaultBuildOperationExecutor.run(DefaultBuildOperationExecutor.java:107) at org.gradle.initialization.DefaultGradleLauncher.runTasks(DefaultGradleLauncher.java:202) at org.gradle.initialization.DefaultGradleLauncher.doBuildStages(DefaultGradleLauncher.java:132) at org.gradle.initialization.DefaultGradleLauncher.executeTasks(DefaultGradleLauncher.java:107) at org.gradle.internal.invocation.GradleBuildController$1.call(GradleBuildController.java:78) at org.gradle.internal.invocation.GradleBuildController$1.call(GradleBuildController.java:75) at org.gradle.internal.work.DefaultWorkerLeaseService.withLocks(DefaultWorkerLeaseService.java:152) at org.gradle.internal.invocation.GradleBuildController.doBuild(GradleBuildController.java:100) at org.gradle.internal.invocation.GradleBuildController.run(GradleBuildController.java:75) at org.gradle.tooling.internal.provider.ExecuteBuildActionRunner.run(ExecuteBuildActionRunner.java:28) at org.gradle.launcher.exec.ChainingBuildActionRunner.run(ChainingBuildActionRunner.java:35) at org.gradle.tooling.internal.provider.ValidatingBuildActionRunner.run(ValidatingBuildActionRunner.java:32) at org.gradle.launcher.exec.RunAsBuildOperationBuildActionRunner$1.run(RunAsBuildOperationBuildActionRunner.java :43) at org.gradle.internal.progress.DefaultBuildOperationExecutor$RunnableBuildOperationWorker.execute(DefaultBuildO perationExecutor.java:336) at org.gradle.internal.progress.DefaultBuildOperationExecutor$RunnableBuildOperationWorker.execute(DefaultBuildO perationExecutor.java:328) at org.gradle.internal.progress.DefaultBuildOperationExecutor.execute(DefaultBuildOperationExecutor.java:197) at org.gradle.internal.progress.DefaultBuildOperationExecutor.run(DefaultBuildOperationExecutor.java:107) at org.gradle.launcher.exec.RunAsBuildOperationBuildActionRunner.run(RunAsBuildOperationBuildActionRunner.java:4 0) at org.gradle.tooling.internal.provider.SubscribableBuildActionRunner.run(SubscribableBuildActionRunner.java:51) at org.gradle.launcher.exec.InProcessBuildActionExecuter.execute(InProcessBuildActionExecuter.java:45) at org.gradle.launcher.exec.InProcessBuildActionExecuter.execute(InProcessBuildActionExecuter.java:29) at org.gradle.launcher.exec.BuildTreeScopeBuildActionExecuter.execute(BuildTreeScopeBuildActionExecuter.java:39) at org.gradle.launcher.exec.BuildTreeScopeBuildActionExecuter.execute(BuildTreeScopeBuildActionExecuter.java:25) at org.gradle.tooling.internal.provider.ContinuousBuildActionExecuter.execute(ContinuousBuildActionExecuter.java :71) at org.gradle.tooling.internal.provider.ContinuousBuildActionExecuter.execute(ContinuousBuildActionExecuter.java :45) at org.gradle.tooling.internal.provider.ServicesSetupBuildActionExecuter.execute(ServicesSetupBuildActionExecute r.java:51) at org.gradle.tooling.internal.provider.ServicesSetupBuildActionExecuter.execute(ServicesSetupBuildActionExecute r.java:32) at org.gradle.tooling.internal.provider.GradleThreadBuildActionExecuter.execute(GradleThreadBuildActionExecuter. java:36) at org.gradle.tooling.internal.provider.GradleThreadBuildActionExecuter.execute(GradleThreadBuildActionExecuter. java:25) at org.gradle.tooling.internal.provider.ParallelismConfigurationBuildActionExecuter.execute(ParallelismConfigura tionBuildActionExecuter.java:43) at org.gradle.tooling.internal.provider.ParallelismConfigurationBuildActionExecuter.execute(ParallelismConfigura tionBuildActionExecuter.java:29) at org.gradle.tooling.internal.provider.StartParamsValidatingActionExecuter.execute(StartParamsValidatingActionE xecuter.java:64) at org.gradle.tooling.internal.provider.StartParamsValidatingActionExecuter.execute(StartParamsValidatingActionE xecuter.java:29) at org.gradle.tooling.internal.provider.SessionFailureReportingActionExecuter.execute(SessionFailureReportingAct ionExecuter.java:55) at org.gradle.tooling.internal.provider.SessionFailureReportingActionExecuter.execute(SessionFailureReportingAct ionExecuter.java:42) at org.gradle.tooling.internal.provider.SetupLoggingActionExecuter.execute(SetupLoggingActionExecuter.java:58) at org.gradle.tooling.internal.provider.SetupLoggingActionExecuter.execute(SetupLoggingActionExecuter.java:33) at org.gradle.launcher.daemon.server.exec.ExecuteBuild.doBuild(ExecuteBuild.java:67) at org.gradle.launcher.daemon.server.exec.BuildCommandOnly.execute(BuildCommandOnly.java:36) at org.gradle.launcher.daemon.server.api.DaemonCommandExecution.proceed(DaemonCommandExecution.java:120) at org.gradle.launcher.daemon.server.exec.WatchForDisconnection.execute(WatchForDisconnection.java:37) at org.gradle.launcher.daemon.server.api.DaemonCommandExecution.proceed(DaemonCommandExecution.java:120) at org.gradle.launcher.daemon.server.exec.ResetDeprecationLogger.execute(ResetDeprecationLogger.java:26) at org.gradle.launcher.daemon.server.api.DaemonCommandExecution.proceed(DaemonCommandExecution.java:120) at org.gradle.launcher.daemon.server.exec.RequestStopIfSingleUsedDaemon.execute(RequestStopIfSingleUsedDaemon.ja va:34) at org.gradle.launcher.daemon.server.api.DaemonCommandExecution.proceed(DaemonCommandExecution.java:120) at org.gradle.launcher.daemon.server.exec.ForwardClientInput$2.call(ForwardClientInput.java:74) at org.gradle.launcher.daemon.server.exec.ForwardClientInput$2.call(ForwardClientInput.java:72) at org.gradle.util.Swapper.swap(Swapper.java:38) at org.gradle.launcher.daemon.server.exec.ForwardClientInput.execute(ForwardClientInput.java:72) at org.gradle.launcher.daemon.server.api.DaemonCommandExecution.proceed(DaemonCommandExecution.java:120) at org.gradle.launcher.daemon.server.exec.LogAndCheckHealth.execute(LogAndCheckHealth.java:55) at org.gradle.launcher.daemon.server.api.DaemonCommandExecution.proceed(DaemonCommandExecution.java:120) at org.gradle.launcher.daemon.server.exec.LogToClient.doBuild(LogToClient.java:62) at org.gradle.launcher.daemon.server.exec.BuildCommandOnly.execute(BuildCommandOnly.java:36) at org.gradle.launcher.daemon.server.api.DaemonCommandExecution.proceed(DaemonCommandExecution.java:120) at org.gradle.launcher.daemon.server.exec.EstablishBuildEnvironment.doBuild(EstablishBuildEnvironment.java:82) at org.gradle.launcher.daemon.server.exec.BuildCommandOnly.execute(BuildCommandOnly.java:36) at org.gradle.launcher.daemon.server.api.DaemonCommandExecution.proceed(DaemonCommandExecution.java:120) at org.gradle.launcher.daemon.server.exec.StartBuildOrRespondWithBusy$1.run(StartBuildOrRespondWithBusy.java:50) at org.gradle.launcher.daemon.server.DaemonStateCoordinator$1.run(DaemonStateCoordinator.java:297) at org.gradle.internal.concurrent.ExecutorPolicy$CatchAndRecordFailures.onExecute(ExecutorPolicy.java:63) at org.gradle.internal.concurrent.ManagedExecutorImpl$1.run(ManagedExecutorImpl.java:46) at java.util.concurrent.ThreadPoolExecutor.runWorker(ThreadPoolExecutor.java:1142) at java.util.concurrent.ThreadPoolExecutor$Worker.run(ThreadPoolExecutor.java:617) at org.gradle.internal.concurrent.ThreadFactoryImpl$ManagedThreadRunnable.run(ThreadFactoryImpl.java:55) at java.lang.Thread.run(Thread.java:745) Caused by: java.util.concurrent.ExecutionException: java.util.concurrent.ExecutionException: com.android.tools.aapt2.Aap t2Exception: AAPT2 error: check logs for details at com.google.common.util.concurrent.AbstractFuture.getDoneValue(AbstractFuture.java:503) at com.google.common.util.concurrent.AbstractFuture.get(AbstractFuture.java:482) at com.google.common.util.concurrent.AbstractFuture$TrustedFuture.get(AbstractFuture.java:79) at com.android.builder.core.AndroidBuilder.processResources(AndroidBuilder.java:794) ... 121 more Caused by: java.util.concurrent.ExecutionException: com.android.tools.aapt2.Aapt2Exception: AAPT2 error: check logs for details at com.google.common.util.concurrent.AbstractFuture.getDoneValue(AbstractFuture.java:503) at com.google.common.util.concurrent.AbstractFuture.get(AbstractFuture.java:462) at com.google.common.util.concurrent.AbstractFuture$TrustedFuture.get(AbstractFuture.java:79) at com.android.builder.internal.aapt.v2.QueueableAapt2.lambda$makeValidatedPackage$1(QueueableAapt2.java:179) at java.util.concurrent.ThreadPoolExecutor.runWorker(ThreadPoolExecutor.java:1142) at java.util.concurrent.ThreadPoolExecutor$Worker.run(ThreadPoolExecutor.java:617) ... 1 more Caused by: com.android.tools.aapt2.Aapt2Exception: AAPT2 error: check logs for details at com.android.builder.png.AaptProcess$NotifierProcessOutput.handleOutput(AaptProcess.java:463) at com.android.builder.png.AaptProcess$NotifierProcessOutput.err(AaptProcess.java:415) at com.android.builder.png.AaptProcess$ProcessOutputFacade.err(AaptProcess.java:332) at com.android.utils.GrabProcessOutput$1.run(GrabProcessOutput.java:104) FAILED 36 actionable tasks: 36 executed FAILURE: Build failed with an exception. * What went wrong: Execution failed for task ':app:processDebugResources'. > Failed to execute aapt * Try: Run with --stacktrace option to get the stack trace. Run with --info or --debug option to get more log output. * Get more help at https://help.gradle.org BUILD FAILED in 31s cmd: Command failed with exit code 1 Error output: ע: ijЩ�����ļ�ʹ�û�����ѹ�ʱ�� API�� ע: �й���ϸ��Ϣ, ��ʹ�� -Xlint:deprecation ���±��롣 C:\Users\Administrator\.gradle\caches\transforms-1\files-1.1\appcompat-v7-26.1.0.aar\ac54a0ace3996090bdb7ad492e3b5bcd\re s\values\values.xml:246:5-69: AAPT: error: resource android:attr/fontVariationSettings not found. C:\Users\Administrator\.gradle\caches\transforms-1\files-1.1\appcompat-v7-26.1.0.aar\ac54a0ace3996090bdb7ad492e3b5bcd\re s\values\values.xml:246:5-69: AAPT: error: resource android:attr/ttcIndex not found. D:\Code\YSDA\ysda\platforms\android\app\build\intermediates\incremental\mergeDebugResources\merged.dir\values\values.xml :248: error: resource android:attr/fontVariationSettings not found. D:\Code\YSDA\ysda\platforms\android\app\build\intermediates\incremental\mergeDebugResources\merged.dir\values\values.xml :248: error: resource android:attr/ttcIndex not found. error: failed linking references. Failed to execute aapt com.android.ide.common.process.ProcessException: Failed to execute aapt at com.android.builder.core.AndroidBuilder.processResources(AndroidBuilder.java:796) at com.android.build.gradle.tasks.ProcessAndroidResources.invokeAaptForSplit(ProcessAndroidResources.java:551) at com.android.build.gradle.tasks.ProcessAndroidResources.doFullTaskAction(ProcessAndroidResources.java:285) at com.android.build.gradle.internal.tasks.IncrementalTask.taskAction(IncrementalTask.java:109) at sun.reflect.GeneratedMethodAccessor182.invoke(Unknown Source) at sun.reflect.DelegatingMethodAccessorImpl.invoke(DelegatingMethodAccessorImpl.java:43) at java.lang.reflect.Method.invoke(Method.java:498) at org.gradle.internal.reflect.JavaMethod.invoke(JavaMethod.java:73) at org.gradle.api.internal.project.taskfactory.DefaultTaskClassInfoStore$IncrementalTaskAction.doExecute(Default TaskClassInfoStore.java:173) at org.gradle.api.internal.project.taskfactory.DefaultTaskClassInfoStore$StandardTaskAction.execute(DefaultTaskC lassInfoStore.java:134) at org.gradle.api.internal.project.taskfactory.DefaultTaskClassInfoStore$StandardTaskAction.execute(DefaultTaskC lassInfoStore.java:121) at org.gradle.api.internal.tasks.execution.ExecuteActionsTaskExecuter$1.run(ExecuteActionsTaskExecuter.java:122) at org.gradle.internal.progress.DefaultBuildOperationExecutor$RunnableBuildOperationWorker.execute(DefaultBuildO perationExecutor.java:336) at org.gradle.internal.progress.DefaultBuildOperationExecutor$RunnableBuildOperationWorker.execute(DefaultBuildO perationExecutor.java:328) at org.gradle.internal.progress.DefaultBuildOperationExecutor.execute(DefaultBuildOperationExecutor.java:197) at org.gradle.internal.progress.DefaultBuildOperationExecutor.run(DefaultBuildOperationExecutor.java:107) at org.gradle.api.internal.tasks.execution.ExecuteActionsTaskExecuter.executeAction(ExecuteActionsTaskExecuter.j ava:111) at org.gradle.api.internal.tasks.execution.ExecuteActionsTaskExecuter.executeActions(ExecuteActionsTaskExecuter. java:92) at org.gradle.api.internal.tasks.execution.ExecuteActionsTaskExecuter.execute(ExecuteActionsTaskExecuter.java:70 ) at org.gradle.api.internal.tasks.execution.SkipUpToDateTaskExecuter.execute(SkipUpToDateTaskExecuter.java:63) at org.gradle.api.internal.tasks.execution.ResolveTaskOutputCachingStateExecuter.execute(ResolveTaskOutputCachin gStateExecuter.java:54) at org.gradle.api.internal.tasks.execution.ValidatingTaskExecuter.execute(ValidatingTaskExecuter.java:58) at org.gradle.api.internal.tasks.execution.SkipEmptySourceFilesTaskExecuter.execute(SkipEmptySourceFilesTaskExec uter.java:88) at org.gradle.api.internal.tasks.execution.ResolveTaskArtifactStateTaskExecuter.execute(ResolveTaskArtifactState TaskExecuter.java:52) at org.gradle.api.internal.tasks.execution.SkipTaskWithNoActionsExecuter.execute(SkipTaskWithNoActionsExecuter.j ava:52) at org.gradle.api.internal.tasks.execution.SkipOnlyIfTaskExecuter.execute(SkipOnlyIfTaskExecuter.java:54) at org.gradle.api.internal.tasks.execution.ExecuteAtMostOnceTaskExecuter.execute(ExecuteAtMostOnceTaskExecuter.j ava:43) at org.gradle.api.internal.tasks.execution.CatchExceptionTaskExecuter.execute(CatchExceptionTaskExecuter.java:34 ) at org.gradle.execution.taskgraph.DefaultTaskGraphExecuter$EventFiringTaskWorker$1.run(DefaultTaskGraphExecuter. java:248) at org.gradle.internal.progress.DefaultBuildOperationExecutor$RunnableBuildOperationWorker.execute(DefaultBuildO perationExecutor.java:336) at org.gradle.internal.progress.DefaultBuildOperationExecutor$RunnableBuildOperationWorker.execute(DefaultBuildO perationExecutor.java:328) at org.gradle.internal.progress.DefaultBuildOperationExecutor.execute(DefaultBuildOperationExecutor.java:197) at org.gradle.internal.progress.DefaultBuildOperationExecutor.run(DefaultBuildOperationExecutor.java:107) at org.gradle.execution.taskgraph.DefaultTaskGraphExecuter$EventFiringTaskWorker.execute(DefaultTaskGraphExecute r.java:241) at org.gradle.execution.taskgraph.DefaultTaskGraphExecuter$EventFiringTaskWorker.execute(DefaultTaskGraphExecute r.java:230) at org.gradle.execution.taskgraph.DefaultTaskPlanExecutor$TaskExecutorWorker.processTask(DefaultTaskPlanExecutor .java:124) at org.gradle.execution.taskgraph.DefaultTaskPlanExecutor$TaskExecutorWorker.access$200(DefaultTaskPlanExecutor. java:80) at org.gradle.execution.taskgraph.DefaultTaskPlanExecutor$TaskExecutorWorker$1.execute(DefaultTaskPlanExecutor.j ava:105) at org.gradle.execution.taskgraph.DefaultTaskPlanExecutor$TaskExecutorWorker$1.execute(DefaultTaskPlanExecutor.j ava:99) at org.gradle.execution.taskgraph.DefaultTaskExecutionPlan.execute(DefaultTaskExecutionPlan.java:625) at org.gradle.execution.taskgraph.DefaultTaskExecutionPlan.executeWithTask(DefaultTaskExecutionPlan.java:580) at org.gradle.execution.taskgraph.DefaultTaskPlanExecutor$TaskExecutorWorker.run(DefaultTaskPlanExecutor.java:99 ) at org.gradle.execution.taskgraph.DefaultTaskPlanExecutor.process(DefaultTaskPlanExecutor.java:60) at org.gradle.execution.taskgraph.DefaultTaskGraphExecuter.execute(DefaultTaskGraphExecuter.java:128) at org.gradle.execution.SelectedTaskExecutionAction.execute(SelectedTaskExecutionAction.java:37) at org.gradle.execution.DefaultBuildExecuter.execute(DefaultBuildExecuter.java:37) at org.gradle.execution.DefaultBuildExecuter.access$000(DefaultBuildExecuter.java:23) at org.gradle.execution.DefaultBuildExecuter$1.proceed(DefaultBuildExecuter.java:43) at org.gradle.execution.DryRunBuildExecutionAction.execute(DryRunBuildExecutionAction.java:46) at org.gradle.execution.DefaultBuildExecuter.execute(DefaultBuildExecuter.java:37) at org.gradle.execution.DefaultBuildExecuter.execute(DefaultBuildExecuter.java:30) at org.gradle.initialization.DefaultGradleLauncher$ExecuteTasks.run(DefaultGradleLauncher.java:311) at org.gradle.internal.progress.DefaultBuildOperationExecutor$RunnableBuildOperationWorker.execute(DefaultBuildO perationExecutor.java:336) at org.gradle.internal.progress.DefaultBuildOperationExecutor$RunnableBuildOperationWorker.execute(DefaultBuildO perationExecutor.java:328) at org.gradle.internal.progress.DefaultBuildOperationExecutor.execute(DefaultBuildOperationExecutor.java:197) at org.gradle.internal.progress.DefaultBuildOperationExecutor.run(DefaultBuildOperationExecutor.java:107) at org.gradle.initialization.DefaultGradleLauncher.runTasks(DefaultGradleLauncher.java:202) at org.gradle.initialization.DefaultGradleLauncher.doBuildStages(DefaultGradleLauncher.java:132) at org.gradle.initialization.DefaultGradleLauncher.executeTasks(DefaultGradleLauncher.java:107) at org.gradle.internal.invocation.GradleBuildController$1.call(GradleBuildController.java:78) at org.gradle.internal.invocation.GradleBuildController$1.call(GradleBuildController.java:75) at org.gradle.internal.work.DefaultWorkerLeaseService.withLocks(DefaultWorkerLeaseService.java:152) at org.gradle.internal.invocation.GradleBuildController.doBuild(GradleBuildController.java:100) at org.gradle.internal.invocation.GradleBuildController.run(GradleBuildController.java:75) at org.gradle.tooling.internal.provider.ExecuteBuildActionRunner.run(ExecuteBuildActionRunner.java:28) at org.gradle.launcher.exec.ChainingBuildActionRunner.run(ChainingBuildActionRunner.java:35) at org.gradle.tooling.internal.provider.ValidatingBuildActionRunner.run(ValidatingBuildActionRunner.java:32) at org.gradle.launcher.exec.RunAsBuildOperationBuildActionRunner$1.run(RunAsBuildOperationBuildActionRunner.java :43) at org.gradle.internal.progress.DefaultBuildOperationExecutor$RunnableBuildOperationWorker.execute(DefaultBuildO perationExecutor.java:336) at org.gradle.internal.progress.DefaultBuildOperationExecutor$RunnableBuildOperationWorker.execute(DefaultBuildO perationExecutor.java:328) at org.gradle.internal.progress.DefaultBuildOperationExecutor.execute(DefaultBuildOperationExecutor.java:197) at org.gradle.internal.progress.DefaultBuildOperationExecutor.run(DefaultBuildOperationExecutor.java:107) at org.gradle.launcher.exec.RunAsBuildOperationBuildActionRunner.run(RunAsBuildOperationBuildActionRunner.java:4 0) at org.gradle.tooling.internal.provider.SubscribableBuildActionRunner.run(SubscribableBuildActionRunner.java:51) at org.gradle.launcher.exec.InProcessBuildActionExecuter.execute(InProcessBuildActionExecuter.java:45) at org.gradle.launcher.exec.InProcessBuildActionExecuter.execute(InProcessBuildActionExecuter.java:29) at org.gradle.launcher.exec.BuildTreeScopeBuildActionExecuter.execute(BuildTreeScopeBuildActionExecuter.java:39) at org.gradle.launcher.exec.BuildTreeScopeBuildActionExecuter.execute(BuildTreeScopeBuildActionExecuter.java:25) at org.gradle.tooling.internal.provider.ContinuousBuildActionExecuter.execute(ContinuousBuildActionExecuter.java :71) at org.gradle.tooling.internal.provider.ContinuousBuildActionExecuter.execute(ContinuousBuildActionExecuter.java :45) at org.gradle.tooling.internal.provider.ServicesSetupBuildActionExecuter.execute(ServicesSetupBuildActionExecute r.java:51) at org.gradle.tooling.internal.provider.ServicesSetupBuildActionExecuter.execute(ServicesSetupBuildActionExecute r.java:32) at org.gradle.tooling.internal.provider.GradleThreadBuildActionExecuter.execute(GradleThreadBuildActionExecuter. java:36) at org.gradle.tooling.internal.provider.GradleThreadBuildActionExecuter.execute(GradleThreadBuildActionExecuter. java:25) at org.gradle.tooling.internal.provider.ParallelismConfigurationBuildActionExecuter.execute(ParallelismConfigura tionBuildActionExecuter.java:43) at org.gradle.tooling.internal.provider.ParallelismConfigurationBuildActionExecuter.execute(ParallelismConfigura tionBuildActionExecuter.java:29) at org.gradle.tooling.internal.provider.StartParamsValidatingActionExecuter.execute(StartParamsValidatingActionE xecuter.java:64) at org.gradle.tooling.internal.provider.StartParamsValidatingActionExecuter.execute(StartParamsValidatingActionE xecuter.java:29) at org.gradle.tooling.internal.provider.SessionFailureReportingActionExecuter.execute(SessionFailureReportingAct ionExecuter.java:55) at org.gradle.tooling.internal.provider.SessionFailureReportingActionExecuter.execute(SessionFailureReportingAct ionExecuter.java:42) at org.gradle.tooling.internal.provider.SetupLoggingActionExecuter.execute(SetupLoggingActionExecuter.java:58) at org.gradle.tooling.internal.provider.SetupLoggingActionExecuter.execute(SetupLoggingActionExecuter.java:33) at org.gradle.launcher.daemon.server.exec.ExecuteBuild.doBuild(ExecuteBuild.java:67) at org.gradle.launcher.daemon.server.exec.BuildCommandOnly.execute(BuildCommandOnly.java:36) at org.gradle.launcher.daemon.server.api.DaemonCommandExecution.proceed(DaemonCommandExecution.java:120) at org.gradle.launcher.daemon.server.exec.WatchForDisconnection.execute(WatchForDisconnection.java:37) at org.gradle.launcher.daemon.server.api.DaemonCommandExecution.proceed(DaemonCommandExecution.java:120) at org.gradle.launcher.daemon.server.exec.ResetDeprecationLogger.execute(ResetDeprecationLogger.java:26) at org.gradle.launcher.daemon.server.api.DaemonCommandExecution.proceed(DaemonCommandExecution.java:120) at org.gradle.launcher.daemon.server.exec.RequestStopIfSingleUsedDaemon.execute(RequestStopIfSingleUsedDaemon.ja va:34) at org.gradle.launcher.daemon.server.api.DaemonCommandExecution.proceed(DaemonCommandExecution.java:120) at org.gradle.launcher.daemon.server.exec.ForwardClientInput$2.call(ForwardClientInput.java:74) at org.gradle.launcher.daemon.server.exec.ForwardClientInput$2.call(ForwardClientInput.java:72) at org.gradle.util.Swapper.swap(Swapper.java:38) at org.gradle.launcher.daemon.server.exec.ForwardClientInput.execute(ForwardClientInput.java:72) at org.gradle.launcher.daemon.server.api.DaemonCommandExecution.proceed(DaemonCommandExecution.java:120) at org.gradle.launcher.daemon.server.exec.LogAndCheckHealth.execute(LogAndCheckHealth.java:55) at org.gradle.launcher.daemon.server.api.DaemonCommandExecution.proceed(DaemonCommandExecution.java:120) at org.gradle.launcher.daemon.server.exec.LogToClient.doBuild(LogToClient.java:62) at org.gradle.launcher.daemon.server.exec.BuildCommandOnly.execute(BuildCommandOnly.java:36) at org.gradle.launcher.daemon.server.api.DaemonCommandExecution.proceed(DaemonCommandExecution.java:120) at org.gradle.launcher.daemon.server.exec.EstablishBuildEnvironment.doBuild(EstablishBuildEnvironment.java:82) at org.gradle.launcher.daemon.server.exec.BuildCommandOnly.execute(BuildCommandOnly.java:36) at org.gradle.launcher.daemon.server.api.DaemonCommandExecution.proceed(DaemonCommandExecution.java:120) at org.gradle.launcher.daemon.server.exec.StartBuildOrRespondWithBusy$1.run(StartBuildOrRespondWithBusy.java:50) at org.gradle.launcher.daemon.server.DaemonStateCoordinator$1.run(DaemonStateCoordinator.java:297) at org.gradle.internal.concurrent.ExecutorPolicy$CatchAndRecordFailures.onExecute(ExecutorPolicy.java:63) at org.gradle.internal.concurrent.ManagedExecutorImpl$1.run(ManagedExecutorImpl.java:46) at java.util.concurrent.ThreadPoolExecutor.runWorker(ThreadPoolExecutor.java:1142) at java.util.concurrent.ThreadPoolExecutor$Worker.run(ThreadPoolExecutor.java:617) at org.gradle.internal.concurrent.ThreadFactoryImpl$ManagedThreadRunnable.run(ThreadFactoryImpl.java:55) at java.lang.Thread.run(Thread.java:745) Caused by: java.util.concurrent.ExecutionException: java.util.concurrent.ExecutionException: com.android.tools.aapt2.Aap t2Exception: AAPT2 error: check logs for details at com.google.common.util.concurrent.AbstractFuture.getDoneValue(AbstractFuture.java:503) at com.google.common.util.concurrent.AbstractFuture.get(AbstractFuture.java:482) at com.google.common.util.concurrent.AbstractFuture$TrustedFuture.get(AbstractFuture.java:79) at com.android.builder.core.AndroidBuilder.processResources(AndroidBuilder.java:794) ... 121 more Caused by: java.util.concurrent.ExecutionException: com.android.tools.aapt2.Aapt2Exception: AAPT2 error: check logs for details at com.google.common.util.concurrent.AbstractFuture.getDoneValue(AbstractFuture.java:503) at com.google.common.util.concurrent.AbstractFuture.get(AbstractFuture.java:462) at com.google.common.util.concurrent.AbstractFuture$TrustedFuture.get(AbstractFuture.java:79) at com.android.builder.internal.aapt.v2.QueueableAapt2.lambda$makeValidatedPackage$1(QueueableAapt2.java:179) at java.util.concurrent.ThreadPoolExecutor.runWorker(ThreadPoolExecutor.java:1142) at java.util.concurrent.ThreadPoolExecutor$Worker.run(ThreadPoolExecutor.java:617) ... 1 more Caused by: com.android.tools.aapt2.Aapt2Exception: AAPT2 error: check logs for details at com.android.builder.png.AaptProcess$NotifierProcessOutput.handleOutput(AaptProcess.java:463) at com.android.builder.png.AaptProcess$NotifierProcessOutput.err(AaptProcess.java:415) at com.android.builder.png.AaptProcess$ProcessOutputFacade.err(AaptProcess.java:332) at com.android.utils.GrabProcessOutput$1.run(GrabProcessOutput.java:104) FAILURE: Build failed with an exception. * What went wrong: Execution failed for task ':app:processDebugResources'. > Failed to execute aapt
android studio升级到3.4,gradle更新到5.1.1出现Could not get unknown property 'bootClasspath'....
把studio升级到3.4 gradle更新到5.1.1。在编译时出现: Could not get unknown property 'bootClasspath' for object of type org.gradle.api.tasks.compile.CompileOptions 的提示,从没遇到这样的问题,网上也很少有解决的方法,没有有大神知道该怎么处理?
idea导入安卓项目时出现错误
Process 'command 'C:\Users\daiyuhe\AppData\Local\Android\Sdk\build-tools\28.0.3\aapt.exe'' finished with non-zero exit value 1 org.gradle.initialization.ReportedException: org.gradle.internal.exceptions.LocationAwareException: Execution failed for task ':processDebugResources'. at org.gradle.initialization.DefaultGradleLauncher.doBuildStages(DefaultGradleLauncher.java:137) at org.gradle.initialization.DefaultGradleLauncher.executeTasks(DefaultGradleLauncher.java:107) at org.gradle.internal.invocation.GradleBuildController$1.call(GradleBuildController.java:78) at org.gradle.internal.invocation.GradleBuildController$1.call(GradleBuildController.java:75) at org.gradle.internal.work.DefaultWorkerLeaseService.withLocks(DefaultWorkerLeaseService.java:152) at org.gradle.internal.invocation.GradleBuildController.doBuild(GradleBuildController.java:100) at org.gradle.internal.invocation.GradleBuildController.run(GradleBuildController.java:75) at org.gradle.tooling.internal.provider.runner.BuildModelActionRunner.run(BuildModelActionRunner.java:53) at org.gradle.launcher.exec.ChainingBuildActionRunner.run(ChainingBuildActionRunner.java:35) at org.gradle.launcher.exec.ChainingBuildActionRunner.run(ChainingBuildActionRunner.java:35) at org.gradle.tooling.internal.provider.ValidatingBuildActionRunner.run(ValidatingBuildActionRunner.java:32) at org.gradle.launcher.exec.RunAsBuildOperationBuildActionRunner$1.run(RunAsBuildOperationBuildActionRunner.java:43) at org.gradle.internal.progress.DefaultBuildOperationExecutor$RunnableBuildOperationWorker.execute(DefaultBuildOperationExecutor.java:336) at org.gradle.internal.progress.DefaultBuildOperationExecutor$RunnableBuildOperationWorker.execute(DefaultBuildOperationExecutor.java:328) at org.gradle.internal.progress.DefaultBuildOperationExecutor.execute(DefaultBuildOperationExecutor.java:197) at org.gradle.internal.progress.DefaultBuildOperationExecutor.run(DefaultBuildOperationExecutor.java:107) at org.gradle.launcher.exec.RunAsBuildOperationBuildActionRunner.run(RunAsBuildOperationBuildActionRunner.java:40) at org.gradle.tooling.internal.provider.SubscribableBuildActionRunner.run(SubscribableBuildActionRunner.java:51) at org.gradle.launcher.exec.InProcessBuildActionExecuter.execute(InProcessBuildActionExecuter.java:45) at org.gradle.launcher.exec.InProcessBuildActionExecuter.execute(InProcessBuildActionExecuter.java:29) at org.gradle.launcher.exec.BuildTreeScopeBuildActionExecuter.execute(BuildTreeScopeBuildActionExecuter.java:39) at org.gradle.launcher.exec.BuildTreeScopeBuildActionExecuter.execute(BuildTreeScopeBuildActionExecuter.java:25) at org.gradle.tooling.internal.provider.ContinuousBuildActionExecuter.execute(ContinuousBuildActionExecuter.java:71) at org.gradle.tooling.internal.provider.ContinuousBuildActionExecuter.execute(ContinuousBuildActionExecuter.java:45) at org.gradle.tooling.internal.provider.ServicesSetupBuildActionExecuter.execute(ServicesSetupBuildActionExecuter.java:51) at org.gradle.tooling.internal.provider.ServicesSetupBuildActionExecuter.execute(ServicesSetupBuildActionExecuter.java:32) at org.gradle.tooling.internal.provider.GradleThreadBuildActionExecuter.execute(GradleThreadBuildActionExecuter.java:36) at org.gradle.tooling.internal.provider.GradleThreadBuildActionExecuter.execute(GradleThreadBuildActionExecuter.java:25) at org.gradle.tooling.internal.provider.ParallelismConfigurationBuildActionExecuter.execute(ParallelismConfigurationBuildActionExecuter.java:43) at org.gradle.tooling.internal.provider.ParallelismConfigurationBuildActionExecuter.execute(ParallelismConfigurationBuildActionExecuter.java:29) at org.gradle.tooling.internal.provider.StartParamsValidatingActionExecuter.execute(StartParamsValidatingActionExecuter.java:64) at org.gradle.tooling.internal.provider.StartParamsValidatingActionExecuter.execute(StartParamsValidatingActionExecuter.java:29) at org.gradle.tooling.internal.provider.SessionFailureReportingActionExecuter.execute(SessionFailureReportingActionExecuter.java:55) at org.gradle.tooling.internal.provider.SessionFailureReportingActionExecuter.execute(SessionFailureReportingActionExecuter.java:42) at org.gradle.tooling.internal.provider.SetupLoggingActionExecuter.execute(SetupLoggingActionExecuter.java:58) at org.gradle.tooling.internal.provider.SetupLoggingActionExecuter.execute(SetupLoggingActionExecuter.java:33) at org.gradle.launcher.daemon.server.exec.ExecuteBuild.doBuild(ExecuteBuild.java:67) at org.gradle.launcher.daemon.server.exec.BuildCommandOnly.execute(BuildCommandOnly.java:36) at org.gradle.launcher.daemon.server.api.DaemonCommandExecution.proceed(DaemonCommandExecution.java:120) at org.gradle.launcher.daemon.server.exec.WatchForDisconnection.execute(WatchForDisconnection.java:37) at org.gradle.launcher.daemon.server.api.DaemonCommandExecution.proceed(DaemonCommandExecution.java:120) at org.gradle.launcher.daemon.server.exec.ResetDeprecationLogger.execute(ResetDeprecationLogger.java:26) at org.gradle.launcher.daemon.server.api.DaemonCommandExecution.proceed(DaemonCommandExecution.java:120) at org.gradle.launcher.daemon.server.exec.RequestStopIfSingleUsedDaemon.execute(RequestStopIfSingleUsedDaemon.java:34) at org.gradle.launcher.daemon.server.api.DaemonCommandExecution.proceed(DaemonCommandExecution.java:120) at org.gradle.launcher.daemon.server.exec.ForwardClientInput$2.call(ForwardClientInput.java:74) at org.gradle.launcher.daemon.server.exec.ForwardClientInput$2.call(ForwardClientInput.java:72) at org.gradle.util.Swapper.swap(Swapper.java:38) at org.gradle.launcher.daemon.server.exec.ForwardClientInput.execute(ForwardClientInput.java:72) at org.gradle.launcher.daemon.server.api.DaemonCommandExecution.proceed(DaemonCommandExecution.java:120) at org.gradle.launcher.daemon.server.exec.LogAndCheckHealth.execute(LogAndCheckHealth.java:55) at org.gradle.launcher.daemon.server.api.DaemonCommandExecution.proceed(DaemonCommandExecution.java:120) at org.gradle.launcher.daemon.server.exec.LogToClient.doBuild(LogToClient.java:62) at org.gradle.launcher.daemon.server.exec.BuildCommandOnly.execute(BuildCommandOnly.java:36) at org.gradle.launcher.daemon.server.api.DaemonCommandExecution.proceed(DaemonCommandExecution.java:120) at org.gradle.launcher.daemon.server.exec.EstablishBuildEnvironment.doBuild(EstablishBuildEnvironment.java:82) at org.gradle.launcher.daemon.server.exec.BuildCommandOnly.execute(BuildCommandOnly.java:36) at org.gradle.launcher.daemon.server.api.DaemonCommandExecution.proceed(DaemonCommandExecution.java:120) at org.gradle.launcher.daemon.server.exec.StartBuildOrRespondWithBusy$1.run(StartBuildOrRespondWithBusy.java:50) at org.gradle.launcher.daemon.server.DaemonStateCoordinator$1.run(DaemonStateCoordinator.java:297) at org.gradle.internal.concurrent.ExecutorPolicy$CatchAndRecordFailures.onExecute(ExecutorPolicy.java:63) at org.gradle.internal.concurrent.ManagedExecutorImpl$1.run(ManagedExecutorImpl.java:46) at java.util.concurrent.ThreadPoolExecutor.runWorker(ThreadPoolExecutor.java:1149) at java.util.concurrent.ThreadPoolExecutor$Worker.run(ThreadPoolExecutor.java:624) at org.gradle.internal.concurrent.ThreadFactoryImpl$ManagedThreadRunnable.run(ThreadFactoryImpl.java:55) at java.lang.Thread.run(Thread.java:748) Caused by: org.gradle.internal.exceptions.LocationAwareException: Execution failed for task ':processDebugResources'. at org.gradle.initialization.DefaultExceptionAnalyser.transform(DefaultExceptionAnalyser.java:74) at org.gradle.initialization.MultipleBuildFailuresExceptionAnalyser.transform(MultipleBuildFailuresExceptionAnalyser.java:47) at org.gradle.initialization.StackTraceSanitizingExceptionAnalyser.transform(StackTraceSanitizingExceptionAnalyser.java:30) at org.gradle.initialization.DefaultGradleLauncher.doBuildStages(DefaultGradleLauncher.java:135) at org.gradle.initialization.DefaultGradleLauncher.executeTasks(DefaultGradleLauncher.java:107) at org.gradle.internal.invocation.GradleBuildController$1.call(GradleBuildController.java:78) at org.gradle.internal.invocation.GradleBuildController$1.call(GradleBuildController.java:75) at org.gradle.internal.work.DefaultWorkerLeaseService.withLocks(DefaultWorkerLeaseService.java:152) at org.gradle.internal.invocation.GradleBuildController.doBuild(GradleBuildController.java:100) at org.gradle.internal.invocation.GradleBuildController.run(GradleBuildController.java:75) at org.gradle.tooling.internal.provider.runner.BuildModelActionRunner.run(BuildModelActionRunner.java:53) at org.gradle.launcher.exec.ChainingBuildActionRunner.run(ChainingBuildActionRunner.java:35) at org.gradle.launcher.exec.ChainingBuildActionRunner.run(ChainingBuildActionRunner.java:35) at org.gradle.tooling.internal.provider.ValidatingBuildActionRunner.run(ValidatingBuildActionRunner.java:32) at org.gradle.launcher.exec.RunAsBuildOperationBuildActionRunner$1.run(RunAsBuildOperationBuildActionRunner.java:43) at org.gradle.internal.progress.DefaultBuildOperationExecutor$RunnableBuildOperationWorker.execute(DefaultBuildOperationExecutor.java:336) at org.gradle.internal.progress.DefaultBuildOperationExecutor$RunnableBuildOperationWorker.execute(DefaultBuildOperationExecutor.java:328) at org.gradle.internal.progress.DefaultBuildOperationExecutor.execute(DefaultBuildOperationExecutor.java:197) at org.gradle.internal.progress.DefaultBuildOperationExecutor.run(DefaultBuildOperationExecutor.java:107) at org.gradle.launcher.exec.RunAsBuildOperationBuildActionRunner.run(RunAsBuildOperationBuildActionRunner.java:40) at org.gradle.tooling.internal.provider.SubscribableBuildActionRunner.run(SubscribableBuildActionRunner.java:51) at org.gradle.launcher.exec.InProcessBuildActionExecuter.execute(InProcessBuildActionExecuter.java:45) at org.gradle.launcher.exec.InProcessBuildActionExecuter.execute(InProcessBuildActionExecuter.java:29) at org.gradle.launcher.exec.BuildTreeScopeBuildActionExecuter.execute(BuildTreeScopeBuildActionExecuter.java:39) at org.gradle.launcher.exec.BuildTreeScopeBuildActionExecuter.execute(BuildTreeScopeBuildActionExecuter.java:25) at org.gradle.tooling.internal.provider.ContinuousBuildActionExecuter.execute(ContinuousBuildActionExecuter.java:71) at org.gradle.tooling.internal.provider.ContinuousBuildActionExecuter.execute(ContinuousBuildActionExecuter.java:45) at org.gradle.tooling.internal.provider.ServicesSetupBuildActionExecuter.execute(ServicesSetupBuildActionExecuter.java:51) at org.gradle.tooling.internal.provider.ServicesSetupBuildActionExecuter.execute(ServicesSetupBuildActionExecuter.java:32) at org.gradle.tooling.internal.provider.GradleThreadBuildActionExecuter.execute(GradleThreadBuildActionExecuter.java:36) at org.gradle.tooling.internal.provider.GradleThreadBuildActionExecuter.execute(GradleThreadBuildActionExecuter.java:25) at org.gradle.tooling.internal.provider.ParallelismConfigurationBuildActionExecuter.execute(ParallelismConfigurationBuildActionExecuter.java:43) at org.gradle.tooling.internal.provider.ParallelismConfigurationBuildActionExecuter.execute(ParallelismConfigurationBuildActionExecuter.java:29) at org.gradle.tooling.internal.provider.StartParamsValidatingActionExecuter.execute(StartParamsValidatingActionExecuter.java:64) at org.gradle.tooling.internal.provider.StartParamsValidatingActionExecuter.execute(StartParamsValidatingActionExecuter.java:29) at org.gradle.tooling.internal.provider.SessionFailureReportingActionExecuter.execute(SessionFailureReportingActionExecuter.java:55) at org.gradle.tooling.internal.provider.SessionFailureReportingActionExecuter.execute(SessionFailureReportingActionExecuter.java:42) at org.gradle.tooling.internal.provider.SetupLoggingActionExecuter.execute(SetupLoggingActionExecuter.java:58) at org.gradle.tooling.internal.provider.SetupLoggingActionExecuter.execute(SetupLoggingActionExecuter.java:33) at org.gradle.launcher.daemon.server.exec.ExecuteBuild.doBuild(ExecuteBuild.java:67) at org.gradle.launcher.daemon.server.exec.BuildCommandOnly.execute(BuildCommandOnly.java:36) at org.gradle.launcher.daemon.server.api.DaemonCommandExecution.proceed(DaemonCommandExecution.java:120) at org.gradle.launcher.daemon.server.exec.WatchForDisconnection.execute(WatchForDisconnection.java:37) at org.gradle.launcher.daemon.server.api.DaemonCommandExecution.proceed(DaemonCommandExecution.java:120) at org.gradle.launcher.daemon.server.exec.ResetDeprecationLogger.execute(ResetDeprecationLogger.java:26) at org.gradle.launcher.daemon.server.api.DaemonCommandExecution.proceed(DaemonCommandExecution.java:120) at org.gradle.launcher.daemon.server.exec.RequestStopIfSingleUsedDaemon.execute(RequestStopIfSingleUsedDaemon.java:34) at org.gradle.launcher.daemon.server.api.DaemonCommandExecution.proceed(DaemonCommandExecution.java:120) at org.gradle.launcher.daemon.server.exec.ForwardClientInput$2.call(ForwardClientInput.java:74) at org.gradle.launcher.daemon.server.exec.ForwardClientInput$2.call(ForwardClientInput.java:72) at org.gradle.util.Swapper.swap(Swapper.java:38) at org.gradle.launcher.daemon.server.exec.ForwardClientInput.execute(ForwardClientInput.java:72) at org.gradle.launcher.daemon.server.api.DaemonCommandExecution.proceed(DaemonCommandExecution.java:120) at org.gradle.launcher.daemon.server.exec.LogAndCheckHealth.execute(LogAndCheckHealth.java:55) at org.gradle.launcher.daemon.server.api.DaemonCommandExecution.proceed(DaemonCommandExecution.java:120) at org.gradle.launcher.daemon.server.exec.LogToClient.doBuild(LogToClient.java:62) at org.gradle.launcher.daemon.server.exec.BuildCommandOnly.execute(BuildCommandOnly.java:36) at org.gradle.launcher.daemon.server.api.DaemonCommandExecution.proceed(DaemonCommandExecution.java:120) at org.gradle.launcher.daemon.server.exec.EstablishBuildEnvironment.doBuild(EstablishBuildEnvironment.java:82) at org.gradle.launcher.daemon.server.exec.BuildCommandOnly.execute(BuildCommandOnly.java:36) at org.gradle.launcher.daemon.server.api.DaemonCommandExecution.proceed(DaemonCommandExecution.java:120) at org.gradle.launcher.daemon.server.exec.StartBuildOrRespondWithBusy$1.run(StartBuildOrRespondWithBusy.java:50) at org.gradle.launcher.daemon.server.DaemonStateCoordinator$1.run(DaemonStateCoordinator.java:297) at org.gradle.internal.concurrent.ExecutorPolicy$CatchAndRecordFailures.onExecute(ExecutorPolicy.java:63) at org.gradle.internal.concurrent.ManagedExecutorImpl$1.run(ManagedExecutorImpl.java:46) at org.gradle.internal.concurrent.ThreadFactoryImpl$ManagedThreadRunnable.run(ThreadFactoryImpl.java:55) Caused by: org.gradle.api.tasks.TaskExecutionException: Execution failed for task ':processDebugResources'. at org.gradle.api.internal.tasks.execution.ExecuteActionsTaskExecuter.executeActions(ExecuteActionsTaskExecuter.java:100) at org.gradle.api.internal.tasks.execution.ExecuteActionsTaskExecuter.execute(ExecuteActionsTaskExecuter.java:70) at org.gradle.api.internal.tasks.execution.SkipUpToDateTaskExecuter.execute(SkipUpToDateTaskExecuter.java:63) at org.gradle.api.internal.tasks.execution.ResolveTaskOutputCachingStateExecuter.execute(ResolveTaskOutputCachingStateExecuter.java:54) at org.gradle.api.internal.tasks.execution.ValidatingTaskExecuter.execute(ValidatingTaskExecuter.java:58) at org.gradle.api.internal.tasks.execution.SkipEmptySourceFilesTaskExecuter.execute(SkipEmptySourceFilesTaskExecuter.java:88) at org.gradle.api.internal.tasks.execution.ResolveTaskArtifactStateTaskExecuter.execute(ResolveTaskArtifactStateTaskExecuter.java:52) at org.gradle.api.internal.tasks.execution.SkipTaskWithNoActionsExecuter.execute(SkipTaskWithNoActionsExecuter.java:52) at org.gradle.api.internal.tasks.execution.SkipOnlyIfTaskExecuter.execute(SkipOnlyIfTaskExecuter.java:54) at org.gradle.api.internal.tasks.execution.ExecuteAtMostOnceTaskExecuter.execute(ExecuteAtMostOnceTaskExecuter.java:43) at org.gradle.api.internal.tasks.execution.CatchExceptionTaskExecuter.execute(CatchExceptionTaskExecuter.java:34) at org.gradle.execution.taskgraph.DefaultTaskGraphExecuter$EventFiringTaskWorker$1.run(DefaultTaskGraphExecuter.java:248) at org.gradle.internal.progress.DefaultBuildOperationExecutor$RunnableBuildOperationWorker.execute(DefaultBuildOperationExecutor.java:336) at org.gradle.internal.progress.DefaultBuildOperationExecutor$RunnableBuildOperationWorker.execute(DefaultBuildOperationExecutor.java:328) at org.gradle.internal.progress.DefaultBuildOperationExecutor.execute(DefaultBuildOperationExecutor.java:197) at org.gradle.internal.progress.DefaultBuildOperationExecutor.run(DefaultBuildOperationExecutor.java:107) at org.gradle.execution.taskgraph.DefaultTaskGraphExecuter$EventFiringTaskWorker.execute(DefaultTaskGraphExecuter.java:241) at org.gradle.execution.taskgraph.DefaultTaskGraphExecuter$EventFiringTaskWorker.execute(DefaultTaskGraphExecuter.java:230) at org.gradle.execution.taskgraph.DefaultTaskPlanExecutor$TaskExecutorWorker.processTask(DefaultTaskPlanExecutor.java:124) at org.gradle.execution.taskgraph.DefaultTaskPlanExecutor$TaskExecutorWorker.access$200(DefaultTaskPlanExecutor.java:80) at org.gradle.execution.taskgraph.DefaultTaskPlanExecutor$TaskExecutorWorker$1.execute(DefaultTaskPlanExecutor.java:105) at org.gradle.execution.taskgraph.DefaultTaskPlanExecutor$TaskExecutorWorker$1.execute(DefaultTaskPlanExecutor.java:99) at org.gradle.execution.taskgraph.DefaultTaskExecutionPlan.execute(DefaultTaskExecutionPlan.java:625) at org.gradle.execution.taskgraph.DefaultTaskExecutionPlan.executeWithTask(DefaultTaskExecutionPlan.java:580) at org.gradle.execution.taskgraph.DefaultTaskPlanExecutor$TaskExecutorWorker.run(DefaultTaskPlanExecutor.java:99) ... 3 more Caused by: java.lang.RuntimeException: com.android.ide.common.process.ProcessException: Failed to execute aapt at com.android.build.gradle.tasks.ProcessAndroidResources.doFullTaskAction(ProcessAndroidResources.java:201) at com.android.build.gradle.internal.tasks.IncrementalTask.taskAction(IncrementalTask.java:82) at org.gradle.internal.reflect.JavaMethod.invoke(JavaMethod.java:73) at org.gradle.api.internal.project.taskfactory.DefaultTaskClassInfoStore$IncrementalTaskAction.doExecute(DefaultTaskClassInfoStore.java:173) at org.gradle.api.internal.project.taskfactory.DefaultTaskClassInfoStore$StandardTaskAction.execute(DefaultTaskClassInfoStore.java:134) at org.gradle.api.internal.project.taskfactory.DefaultTaskClassInfoStore$StandardTaskAction.execute(DefaultTaskClassInfoStore.java:121) at org.gradle.api.internal.tasks.execution.ExecuteActionsTaskExecuter$1.run(ExecuteActionsTaskExecuter.java:122) at org.gradle.internal.progress.DefaultBuildOperationExecutor$RunnableBuildOperationWorker.execute(DefaultBuildOperationExecutor.java:336) at org.gradle.internal.progress.DefaultBuildOperationExecutor$RunnableBuildOperationWorker.execute(DefaultBuildOperationExecutor.java:328) at org.gradle.internal.progress.DefaultBuildOperationExecutor.execute(DefaultBuildOperationExecutor.java:197) at org.gradle.internal.progress.DefaultBuildOperationExecutor.run(DefaultBuildOperationExecutor.java:107) at org.gradle.api.internal.tasks.execution.ExecuteActionsTaskExecuter.executeAction(ExecuteActionsTaskExecuter.java:111) at org.gradle.api.internal.tasks.execution.ExecuteActionsTaskExecuter.executeActions(ExecuteActionsTaskExecuter.java:92) ... 27 more Caused by: com.android.ide.common.process.ProcessException: Failed to execute aapt at com.android.builder.core.AndroidBuilder.processResources(AndroidBuilder.java:867) at com.android.build.gradle.tasks.ProcessAndroidResources.doFullTaskAction(ProcessAndroidResources.java:194) ... 39 more Caused by: java.util.concurrent.ExecutionException: com.android.ide.common.process.ProcessException: Error while executing process C:\Users\daiyuhe\AppData\Local\Android\Sdk\build-tools\28.0.3\aapt.exe with arguments {package -f --no-crunch -I C:\Users\daiyuhe\AppData\Local\Android\Sdk\platforms\android-28\android.jar -M \\?\C:\Users\daiyuhe\Documents\Java_workspace\Calculator\build\intermediates\manifests\full\debug\AndroidManifest.xml -S C:\Users\daiyuhe\Documents\Java_workspace\Calculator\build\intermediates\res\merged\debug -m -J \\?\C:\Users\daiyuhe\Documents\Java_workspace\Calculator\build\generated\source\r\debug -F C:\Users\daiyuhe\Documents\Java_workspace\Calculator\build\intermediates\res\resources-debug.ap_ --debug-mode --custom-package com.daiyuhe.app.calculator -0 apk --output-text-symbols \\?\C:\Users\daiyuhe\Documents\Java_workspace\Calculator\build\intermediates\symbols\debug --no-version-vectors} at com.google.common.util.concurrent.AbstractFuture$Sync.getValue(AbstractFuture.java:299) at com.google.common.util.concurrent.AbstractFuture$Sync.get(AbstractFuture.java:286) at com.google.common.util.concurrent.AbstractFuture.get(AbstractFuture.java:116) at com.android.builder.core.AndroidBuilder.processResources(AndroidBuilder.java:865) ... 40 more Caused by: com.android.ide.common.process.ProcessException: Error while executing process C:\Users\daiyuhe\AppData\Local\Android\Sdk\build-tools\28.0.3\aapt.exe with arguments {package -f --no-crunch -I C:\Users\daiyuhe\AppData\Local\Android\Sdk\platforms\android-28\android.jar -M \\?\C:\Users\daiyuhe\Documents\Java_workspace\Calculator\build\intermediates\manifests\full\debug\AndroidManifest.xml -S C:\Users\daiyuhe\Documents\Java_workspace\Calculator\build\intermediates\res\merged\debug -m -J \\?\C:\Users\daiyuhe\Documents\Java_workspace\Calculator\build\generated\source\r\debug -F C:\Users\daiyuhe\Documents\Java_workspace\Calculator\build\intermediates\res\resources-debug.ap_ --debug-mode --custom-package com.daiyuhe.app.calculator -0 apk --output-text-symbols \\?\C:\Users\daiyuhe\Documents\Java_workspace\Calculator\build\intermediates\symbols\debug --no-version-vectors} at com.android.build.gradle.internal.process.GradleProcessResult.buildProcessException(GradleProcessResult.java:74) at com.android.build.gradle.internal.process.GradleProcessResult.assertNormalExitValue(GradleProcessResult.java:49) at com.android.builder.internal.aapt.AbstractProcessExecutionAapt$1.onSuccess(AbstractProcessExecutionAapt.java:78) at com.android.builder.internal.aapt.AbstractProcessExecutionAapt$1.onSuccess(AbstractProcessExecutionAapt.java:74) at com.google.common.util.concurrent.Futures$6.run(Futures.java:1319) at com.google.common.util.concurrent.MoreExecutors$DirectExecutor.execute(MoreExecutors.java:457) at com.google.common.util.concurrent.ExecutionList.executeListener(ExecutionList.java:156) at com.google.common.util.concurrent.ExecutionList.execute(ExecutionList.java:145) at com.google.common.util.concurrent.AbstractFuture.set(AbstractFuture.java:185) at com.google.common.util.concurrent.SettableFuture.set(SettableFuture.java:53) at com.android.build.gradle.internal.process.GradleProcessExecutor$1.run(GradleProcessExecutor.java:60) Caused by: org.gradle.process.internal.ExecException: Process 'command 'C:\Users\daiyuhe\AppData\Local\Android\Sdk\build-tools\28.0.3\aapt.exe'' finished with non-zero exit value 1 at org.gradle.process.internal.DefaultExecHandle$ExecResultImpl.assertNormalExitValue(DefaultExecHandle.java:380) at com.android.build.gradle.internal.process.GradleProcessResult.assertNormalExitValue(GradleProcessResult.java:47) ... 9 more
Android Studio Gradle project sync failed,Configure project:app 前出现红叹号
Android Studio Gradle project sync failed,Configure project:app 前出现红叹号 ![图片说明](https://img-ask.csdn.net/upload/201905/13/1557746272_155433.jpg) 提示为 ``` org.gradle.api.ProjectConfigurationException: A problem occurred configuring project ':app' at java.util.concurrent.ThreadPoolExecutor.runWorker(ThreadPoolExecutor.java:1142) at java.util.concurrent.ThreadPoolExecutor$Worker.run(ThreadPoolExecutor.java:617) at org.gradle.internal.concurrent.ThreadFactoryImpl$ManagedThreadRunnable.run(ThreadFactoryImpl.java:55) at java.lang.Thread.run(Thread.java:745) Caused by: com.android.builder.errors.EvalIssueException: Failed to install the following Android SDK packages as some licences have not been accepted. build-tools;28.0.2 Android SDK Build-Tools 28.0.2 To build this project, accept the SDK license agreements and install the missing components using the Android Studio SDK Manager. Alternatively, to transfer the license agreements from one workstation to another, see http://d.android.com/r/studio-ui/export-licenses.html Using Android SDK: D:\Android\SDK at com.android.build.gradle.internal.SdkHandler.initTarget(SdkHandler.java:194) at com.android.build.gradle.BasePlugin.ensureTargetSetup(BasePlugin.java:980) at com.android.build.gradle.BasePlugin.createAndroidTasks(BasePlugin.java:752) at com.android.build.gradle.BasePlugin.lambda$null$4(BasePlugin.java:690) at com.android.builder.profile.ThreadRecorder.record(ThreadRecorder.java:81) at com.android.build.gradle.BasePlugin.lambda$createTasks$5(BasePlugin.java:686) at org.gradle.internal.event.BroadcastDispatch$ActionInvocationHandler.dispatch(BroadcastDispatch.java:91) at org.gradle.internal.event.BroadcastDispatch$ActionInvocationHandler.dispatch(BroadcastDispatch.java:80) at org.gradle.internal.event.AbstractBroadcastDispatch.dispatch(AbstractBroadcastDispatch.java:42) at org.gradle.internal.event.BroadcastDispatch$SingletonDispatch.dispatch(BroadcastDispatch.java:230) at org.gradle.internal.event.BroadcastDispatch$SingletonDispatch.dispatch(BroadcastDispatch.java:149) at org.gradle.internal.event.AbstractBroadcastDispatch.dispatch(AbstractBroadcastDispatch.java:58) at org.gradle.internal.event.BroadcastDispatch$CompositeDispatch.dispatch(BroadcastDispatch.java:324) at org.gradle.internal.event.BroadcastDispatch$CompositeDispatch.dispatch(BroadcastDispatch.java:234) at org.gradle.internal.event.ListenerBroadcast.dispatch(ListenerBroadcast.java:140) at org.gradle.internal.event.ListenerBroadcast.dispatch(ListenerBroadcast.java:37) at org.gradle.internal.dispatch.ProxyDispatchAdapter$DispatchingInvocationHandler.invoke(ProxyDispatchAdapter.java:93) at com.sun.proxy.$Proxy27.afterEvaluate(Unknown Source) at org.gradle.configuration.project.LifecycleProjectEvaluator.notifyAfterEvaluate(LifecycleProjectEvaluator.java:76) ... 85 more ```
AS升级到3.0.1 项目里Databinding报错
* Exception is: org.gradle.execution.TaskSelectionException: Task 'compileDebug' is ambiguous in root project 'cashloan-android'. Candidates are: 'compileDebugAidl', 'compileDebugAndroidTestAidl', 'compileDebugAndroidTestJavaWithJavac', 'compileDebugAndroidTestNdk', 'compileDebugAndroidTestRenderscript', 'compileDebugAndroidTestShaders', 'compileDebugAndroidTestSources', 'compileDebugJavaWithJavac', 'compileDebugNdk', 'compileDebugRenderscript', 'compileDebugShaders', 'compileDebugSources', 'compileDebugUnitTestJavaWithJavac', 'compileDebugUnitTestSources'. at org.gradle.execution.TaskSelector.getSelection(TaskSelector.java:116) at org.gradle.execution.TaskSelector.getSelection(TaskSelector.java:81) at org.gradle.execution.commandline.CommandLineTaskParser.parseTasks(CommandLineTaskParser.java:42) at org.gradle.execution.TaskNameResolvingBuildConfigurationAction.configure(TaskNameResolvingBuildConfigurationAction.java:44) at org.gradle.execution.DefaultBuildConfigurationActionExecuter.configure(DefaultBuildConfigurationActionExecuter.java:48) at org.gradle.execution.DefaultBuildConfigurationActionExecuter.access$000(DefaultBuildConfigurationActionExecuter.java:25) at org.gradle.execution.DefaultBuildConfigurationActionExecuter$1.proceed(DefaultBuildConfigurationActionExecuter.java:54) at org.gradle.execution.DefaultTasksBuildExecutionAction.configure(DefaultTasksBuildExecutionAction.java:44) at org.gradle.execution.DefaultBuildConfigurationActionExecuter.configure(DefaultBuildConfigurationActionExecuter.java:48) at org.gradle.execution.DefaultBuildConfigurationActionExecuter.access$000(DefaultBuildConfigurationActionExecuter.java:25) at org.gradle.execution.DefaultBuildConfigurationActionExecuter$1.proceed(DefaultBuildConfigurationActionExecuter.java:54) at org.gradle.execution.ExcludedTaskFilteringBuildConfigurationAction.configure(ExcludedTaskFilteringBuildConfigurationAction.java:47) at org.gradle.execution.DefaultBuildConfigurationActionExecuter.configure(DefaultBuildConfigurationActionExecuter.java:48) at org.gradle.execution.DefaultBuildConfigurationActionExecuter.select(DefaultBuildConfigurationActionExecuter.java:36) at org.gradle.initialization.DefaultGradleLauncher$CalculateTaskGraph.run(DefaultGradleLauncher.java:265) at org.gradle.internal.progress.DefaultBuildOperationExecutor$RunnableBuildOperationWorker.execute(DefaultBuildOperationExecutor.java:336) at org.gradle.internal.progress.DefaultBuildOperationExecutor$RunnableBuildOperationWorker.execute(DefaultBuildOperationExecutor.java:328) at org.gradle.internal.progress.DefaultBuildOperationExecutor.execute(DefaultBuildOperationExecutor.java:197) at org.gradle.internal.progress.DefaultBuildOperationExecutor.run(DefaultBuildOperationExecutor.java:107) at org.gradle.initialization.DefaultGradleLauncher.constructTaskGraph(DefaultGradleLauncher.java:173) at org.gradle.initialization.DefaultGradleLauncher.doBuildStages(DefaultGradleLauncher.java:128) at org.gradle.initialization.DefaultGradleLauncher.executeTasks(DefaultGradleLauncher.java:107) at org.gradle.internal.invocation.GradleBuildController$1.call(GradleBuildController.java:78) at org.gradle.internal.invocation.GradleBuildController$1.call(GradleBuildController.java:75) at org.gradle.internal.work.DefaultWorkerLeaseService.withLocks(DefaultWorkerLeaseService.java:152) at org.gradle.internal.invocation.GradleBuildController.doBuild(GradleBuildController.java:100) at org.gradle.internal.invocation.GradleBuildController.run(GradleBuildController.java:75) at org.gradle.tooling.internal.provider.ExecuteBuildActionRunner.run(ExecuteBuildActionRunner.java:28) at org.gradle.launcher.exec.ChainingBuildActionRunner.run(ChainingBuildActionRunner.java:35) at org.gradle.tooling.internal.provider.ValidatingBuildActionRunner.run(ValidatingBuildActionRunner.java:32) at org.gradle.launcher.exec.RunAsBuildOperationBuildActionRunner$1.run(RunAsBuildOperationBuildActionRunner.java:43) at org.gradle.internal.progress.DefaultBuildOperationExecutor$RunnableBuildOperationWorker.execute(DefaultBuildOperationExecutor.java:336) at org.gradle.internal.progress.DefaultBuildOperationExecutor$RunnableBuildOperationWorker.execute(DefaultBuildOperationExecutor.java:328) at org.gradle.internal.progress.DefaultBuildOperationExecutor.execute(DefaultBuildOperationExecutor.java:197) at org.gradle.internal.progress.DefaultBuildOperationExecutor.run(DefaultBuildOperationExecutor.java:107) at org.gradle.launcher.exec.RunAsBuildOperationBuildActionRunner.run(RunAsBuildOperationBuildActionRunner.java:40) at org.gradle.tooling.internal.provider.SubscribableBuildActionRunner.run(SubscribableBuildActionRunner.java:51) at org.gradle.launcher.exec.InProcessBuildActionExecuter.execute(InProcessBuildActionExecuter.java:45) at org.gradle.launcher.exec.InProcessBuildActionExecuter.execute(InProcessBuildActionExecuter.java:29) at org.gradle.launcher.exec.BuildTreeScopeBuildActionExecuter.execute(BuildTreeScopeBuildActionExecuter.java:39) at org.gradle.launcher.exec.BuildTreeScopeBuildActionExecuter.execute(BuildTreeScopeBuildActionExecuter.java:25) at org.gradle.tooling.internal.provider.ContinuousBuildActionExecuter.execute(ContinuousBuildActionExecuter.java:71) at org.gradle.tooling.internal.provider.ContinuousBuildActionExecuter.execute(ContinuousBuildActionExecuter.java:45) at org.gradle.tooling.internal.provider.ServicesSetupBuildActionExecuter.execute(ServicesSetupBuildActionExecuter.java:51) at org.gradle.tooling.internal.provider.ServicesSetupBuildActionExecuter.execute(ServicesSetupBuildActionExecuter.java:32) at org.gradle.tooling.internal.provider.GradleThreadBuildActionExecuter.execute(GradleThreadBuildActionExecuter.java:36) at org.gradle.tooling.internal.provider.GradleThreadBuildActionExecuter.execute(GradleThreadBuildActionExecuter.java:25) at org.gradle.tooling.internal.provider.ParallelismConfigurationBuildActionExecuter.execute(ParallelismConfigurationBuildActionExecuter.java:43) at org.gradle.tooling.internal.provider.ParallelismConfigurationBuildActionExecuter.execute(ParallelismConfigurationBuildActionExecuter.java:29) at org.gradle.tooling.internal.provider.StartParamsValidatingActionExecuter.execute(StartParamsValidatingActionExecuter.java:64) at org.gradle.tooling.internal.provider.StartParamsValidatingActionExecuter.execute(StartParamsValidatingActionExecuter.java:29) at org.gradle.tooling.internal.provider.SessionFailureReportingActionExecuter.execute(SessionFailureReportingActionExecuter.java:55) at org.gradle.tooling.internal.provider.SessionFailureReportingActionExecuter.execute(SessionFailureReportingActionExecuter.java:42) at org.gradle.tooling.internal.provider.SetupLoggingActionExecuter.execute(SetupLoggingActionExecuter.java:58) at org.gradle.tooling.internal.provider.SetupLoggingActionExecuter.execute(SetupLoggingActionExecuter.java:33) at org.gradle.launcher.daemon.server.exec.ExecuteBuild.doBuild(ExecuteBuild.java:67) at org.gradle.launcher.daemon.server.exec.BuildCommandOnly.execute(BuildCommandOnly.java:36) at org.gradle.launcher.daemon.server.api.DaemonCommandExecution.proceed(DaemonCommandExecution.java:120) at org.gradle.launcher.daemon.server.exec.WatchForDisconnection.execute(WatchForDisconnection.java:37) at org.gradle.launcher.daemon.server.api.DaemonCommandExecution.proceed(DaemonCommandExecution.java:120) at org.gradle.launcher.daemon.server.exec.ResetDeprecationLogger.execute(ResetDeprecationLogger.java:26) at org.gradle.launcher.daemon.server.api.DaemonCommandExecution.proceed(DaemonCommandExecution.java:120) at org.gradle.launcher.daemon.server.exec.RequestStopIfSingleUsedDaemon.execute(RequestStopIfSingleUsedDaemon.java:34) at org.gradle.launcher.daemon.server.api.DaemonCommandExecution.proceed(DaemonCommandExecution.java:120) at org.gradle.launcher.daemon.server.exec.ForwardClientInput$2.call(ForwardClientInput.java:74) at org.gradle.launcher.daemon.server.exec.ForwardClientInput$2.call(ForwardClientInput.java:72) at org.gradle.util.Swapper.swap(Swapper.java:38) at org.gradle.launcher.daemon.server.exec.ForwardClientInput.execute(ForwardClientInput.java:72) at org.gradle.launcher.daemon.server.api.DaemonCommandExecution.proceed(DaemonCommandExecution.java:120) at org.gradle.launcher.daemon.server.exec.LogAndCheckHealth.execute(LogAndCheckHealth.java:55) at org.gradle.launcher.daemon.server.api.DaemonCommandExecution.proceed(DaemonCommandExecution.java:120) at org.gradle.launcher.daemon.server.exec.LogToClient.doBuild(LogToClient.java:62) at org.gradle.launcher.daemon.server.exec.BuildCommandOnly.execute(BuildCommandOnly.java:36) at org.gradle.launcher.daemon.server.api.DaemonCommandExecution.proceed(DaemonCommandExecution.java:120) at org.gradle.launcher.daemon.server.exec.EstablishBuildEnvironment.doBuild(EstablishBuildEnvironment.java:82) at org.gradle.launcher.daemon.server.exec.BuildCommandOnly.execute(BuildCommandOnly.java:36) at org.gradle.launcher.daemon.server.api.DaemonCommandExecution.proceed(DaemonCommandExecution.java:120) at org.gradle.launcher.daemon.server.exec.StartBuildOrRespondWithBusy$1.run(StartBuildOrRespondWithBusy.java:50) at org.gradle.launcher.daemon.server.DaemonStateCoordinator$1.run(DaemonStateCoordinator.java:297) at org.gradle.internal.concurrent.ExecutorPolicy$CatchAndRecordFailures.onExecute(ExecutorPolicy.java:63) at org.gradle.internal.concurrent.ManagedExecutorImpl$1.run(ManagedExecutorImpl.java:46) at org.gradle.internal.concurrent.ThreadFactoryImpl$ManagedThreadRunnable.run(ThreadFactoryImpl.java:55) ![图片说明](https://img-ask.csdn.net/upload/201908/07/1565167925_925733.png) ![图片说明](https://img-ask.csdn.net/upload/201908/07/1565167518_141331.png) ![图片说明](https://img-ask.csdn.net/upload/201908/07/1565167553_712451.png) 各位 大神 帮帮忙
adnroid 开发编译mqtt报错
android studio 下载并打开paho.mqtt.android 编译报错,我的gradle版本4.4 as版本3.1.3 下载地址https://github.com/eclipse/paho.mqtt.android 直接git到的原始的项目,打开编译就报错,我本地新建空内容项目都能编译成功,adnroid 开发编译mqtt报错× 报错如下: Cannot create variant 'android-lint' after configuration ':org.eclipse.paho.android.service:debugRuntimeElements' has been resolved ![图片说明](https://img-ask.csdn.net/upload/201808/10/1533894738_767361.png) org.gradle.initialization.ReportedException: org.gradle.internal.exceptions.LocationAwareException: A problem occurred configuring project ':org.eclipse.paho.android.service'. at org.gradle.initialization.DefaultGradleLauncher.doBuildStages(DefaultGradleLauncher.java:139) at org.gradle.initialization.DefaultGradleLauncher.executeTasks(DefaultGradleLauncher.java:109) at org.gradle.internal.invocation.GradleBuildController$1.call(GradleBuildController.java:78) at org.gradle.internal.invocation.GradleBuildController$1.call(GradleBuildController.java:75) at org.gradle.internal.work.DefaultWorkerLeaseService.withLocks(DefaultWorkerLeaseService.java:152) at org.gradle.internal.invocation.GradleBuildController.doBuild(GradleBuildController.java:100) at org.gradle.internal.invocation.GradleBuildController.run(GradleBuildController.java:75) at org.gradle.tooling.internal.provider.runner.BuildModelActionRunner.run(BuildModelActionRunner.java:53) at org.gradle.launcher.exec.ChainingBuildActionRunner.run(ChainingBuildActionRunner.java:35) at org.gradle.launcher.exec.ChainingBuildActionRunner.run(ChainingBuildActionRunner.java:35) 。。。 at java.util.concurrent.ThreadPoolExecutor.runWorker(ThreadPoolExecutor.java:1142) at java.util.concurrent.ThreadPoolExecutor$Worker.run(ThreadPoolExecutor.java:617) at org.gradle.internal.concurrent.ThreadFactoryImpl$ManagedThreadRunnable.run(ThreadFactoryImpl.java:55) at java.lang.Thread.run(Thread.java:745) Caused by: org.gradle.internal.exceptions.LocationAwareException: A problem occurred configuring project ':org.eclipse.paho.android.service'. at org.gradle.initialization.DefaultExceptionAnalyser.transform(DefaultExceptionAnalyser.java:74) at org.gradle.initialization.MultipleBuildFailuresExceptionAnalyser.transform(MultipleBuildFailuresExceptionAnalyser.java:47) at org.gradle.initialization.StackTraceSanitizingExceptionAnalyser.transform(StackTraceSanitizingExceptionAnalyser.java:30) at org.gradle.initialization.DefaultGradleLauncher.doBuildStages(DefaultGradleLauncher.java:137) at org.gradle.initialization.DefaultGradleLauncher.executeTasks(DefaultGradleLauncher.java:109) at org.gradle.internal.invocation.GradleBuildController$1.call(GradleBuildController.java:78) at org.gradle.internal.invocation.GradleBuildController$1.call(GradleBuildController.java:75) at org.gradle.internal.work.DefaultWorkerLeaseService.withLocks(DefaultWorkerLeaseService.java:152) at org.gradle.internal.invocation.GradleBuildController.doBuild(GradleBuildController.java:100) at org.gradle.internal.invocation.GradleBuildController.run(GradleBuildController.java:75) at org.gradle.tooling.internal.provider.runner.BuildModelActionRunner.run(BuildModelActionRunner.java:53) at org.gradle.launcher.exec.ChainingBuildActionRunner.run(ChainingBuildActionRunner.java:35) at org.gradle.launcher.exec.ChainingBuildActionRunner.run(ChainingBuildActionRunner.java:35) at org.gradle.tooling.internal.provider.ValidatingBuildActionRunner.run(ValidatingBuildActionRunner.java:32) at org.gradle.launcher.exec.RunAsBuildOperationBuildActionRunner$1.run(RunAsBuildOperationBuildActionRunner.java:43) at org.gradle.internal.progress.DefaultBuildOperationExecutor$RunnableBuildOperationWorker.execute(DefaultBuildOperationExecutor.java:336) at org.gradle.internal.progress.DefaultBuildOperationExecutor$RunnableBuildOperationWorker.execute(DefaultBuildOperationExecutor.java:328) at org.gradle.internal.progress.DefaultBuildOperationExecutor.execute(DefaultBuildOperationExecutor.java:199) at org.gradle.internal.progress.DefaultBuildOperationExecutor.run(DefaultBuildOperationExecutor.java:110) at org.gradle.launcher.exec.RunAsBuildOperationBuildActionRunner.run(RunAsBuildOperationBuildActionRunner.java:40) 。。。 at org.gradle.launcher.daemon.server.exec.BuildCommandOnly.execute(BuildCommandOnly.java:36) at org.gradle.launcher.daemon.server.api.DaemonCommandExecution.proceed(DaemonCommandExecution.java:122) at org.gradle.launcher.daemon.server.exec.EstablishBuildEnvironment.doBuild(EstablishBuildEnvironment.java:82) at org.gradle.launcher.daemon.server.exec.BuildCommandOnly.execute(BuildCommandOnly.java:36) at org.gradle.launcher.daemon.server.api.DaemonCommandExecution.proceed(DaemonCommandExecution.java:122) at org.gradle.launcher.daemon.server.exec.StartBuildOrRespondWithBusy$1.run(StartBuildOrRespondWithBusy.java:50) at org.gradle.launcher.daemon.server.DaemonStateCoordinator$1.run(DaemonStateCoordinator.java:295) at org.gradle.internal.concurrent.ExecutorPolicy$CatchAndRecordFailures.onExecute(ExecutorPolicy.java:63) at org.gradle.internal.concurrent.ManagedExecutorImpl$1.run(ManagedExecutorImpl.java:46) at org.gradle.internal.concurrent.ThreadFactoryImpl$ManagedThreadRunnable.run(ThreadFactoryImpl.java:55) Caused by: org.gradle.api.ProjectConfigurationException: A problem occurred configuring project ':org.eclipse.paho.android.service'. at org.gradle.configuration.project.LifecycleProjectEvaluator.addConfigurationFailure(LifecycleProjectEvaluator.java:94) at org.gradle.configuration.project.LifecycleProjectEvaluator.notifyAfterEvaluate(LifecycleProjectEvaluator.java:89) 。。。 ... 62 more Caused by: org.gradle.api.InvalidUserCodeException: Cannot create variant 'android-lint' after configuration ':org.eclipse.paho.android.service:debugRuntimeElements' has been resolved at org.gradle.api.internal.artifacts.configurations.DefaultConfigurationPublications$ConfigurationVariantFactory.create(DefaultConfigurationPublications.java:158) at org.gradle.api.internal.artifacts.configurations.DefaultConfigurationPublications$ConfigurationVariantFactory.create(DefaultConfigurationPublications.java:151) at org.gradle.api.internal.FactoryNamedDomainObjectContainer.doCreate(FactoryNamedDomainObjectContainer.java:100) at org.gradle.api.internal.AbstractNamedDomainObjectContainer.create(AbstractNamedDomainObjectContainer.java:67) at com.android.build.gradle.internal.scope.VariantScopeImpl.lambda$publishArtifactToConfiguration$2(VariantScopeImpl.java:378) at org.gradle.api.internal.artifacts.configurations.DefaultConfigurationPublications.variants(DefaultConfigurationPublications.java:139) at com.android.build.gradle.internal.scope.VariantScopeImpl.publishArtifactToConfiguration(VariantScopeImpl.java:376) at com.android.build.gradle.internal.scope.VariantScopeImpl.publishIntermediateArtifact(VariantScopeImpl.java:347) at com.android.build.gradle.internal.scope.VariantScopeImpl.addTaskOutput(VariantScopeImpl.java:298) at com.android.build.gradle.internal.TaskManager.configureGlobalLintTask(TaskManager.java:536) at com.android.build.gradle.BasePlugin.createAndroidTasks(BasePlugin.java:7
用gradle构建的springboot项目,为什么在cmd中java -jar命令执行build/libs下的jar包会出错
java javac java-version控制台都正常 jdk版本是1.8 gradle版本是5.1.1 springboot版本是1.5.2 使用gradle build构建完spring boot项目后 再用java -jar命令执行后就出错了 ![图片说明](https://img-ask.csdn.net/upload/201901/21/1548075253_617950.png) D:\Program Files\eclipse2018\eclipse2018workspace\init-start\build\libs>java -jar init-start-0.0.1-SNAPSHOT.jar Exception in thread "main" java.lang.reflect.InvocationTargetException at sun.reflect.NativeMethodAccessorImpl.invoke0(Native Method) at sun.reflect.NativeMethodAccessorImpl.invoke(Unknown Source) at sun.reflect.DelegatingMethodAccessorImpl.invoke(Unknown Source) at java.lang.reflect.Method.invoke(Unknown Source) at org.springframework.boot.loader.MainMethodRunner.run(MainMethodRunner.java:48) at org.springframework.boot.loader.Launcher.launch(Launcher.java:87) at org.springframework.boot.loader.Launcher.launch(Launcher.java:50) at org.springframework.boot.loader.JarLauncher.main(JarLauncher.java:51) Caused by: java.lang.NoClassDefFoundError: org/springframework/boot/SpringApplication at com.zhou.spring.boot.blog.initstart.InitStartApplication.main(InitStartApplication.java:10) ... 8 more Caused by: java.lang.ClassNotFoundException: org.springframework.boot.SpringApplication at java.net.URLClassLoader.findClass(Unknown Source) at java.lang.ClassLoader.loadClass(Unknown Source) at org.springframework.boot.loader.LaunchedURLClassLoader.loadClass(LaunchedURLClassLoader.java:94) at java.lang.ClassLoader.loadClass(Unknown Source) ... 9 more 一天了弄不好,是什么原因,其他文件javac编译和java执行都是正常的
android studio编译项目时遇到这个问题。
Caused by: java.lang.NoClassDefFoundError: Could not initialize class com.google.wireless.android.sdk.stats.AndroidStudioStats$GradleBuildProfile at com.android.builder.profile.ProcessRecorder.<init>(ProcessRecorder.java:96) at com.android.builder.profile.ProcessRecorderFactory.get(ProcessRecorderFactory.java:222) at com.android.builder.profile.ProcessRecorderFactory.initialize(ProcessRecorderFactory.java:122) at com.android.build.gradle.internal.profile.ProfilerInitializer.init(ProfilerInitializer.java:66) at com.android.build.gradle.BasePlugin.apply(BasePlugin.java:310) at com.android.build.gradle.LibraryPlugin.apply(LibraryPlugin.java:85) at com.android.build.gradle.LibraryPlugin.apply(LibraryPlugin.java:40) at org.gradle.api.internal.plugins.ImperativeOnlyPluginApplicator.applyImperative(ImperativeOnlyPluginApplicator.java:35) at org.gradle.api.internal.plugins.RuleBasedPluginApplicator.applyImperative(RuleBasedPluginApplicator.java:43) at org.gradle.api.internal.plugins.DefaultPluginManager.doApply(DefaultPluginManager.java:139) at org.gradle.api.internal.plugins.DefaultPluginManager.apply(DefaultPluginManager.java:112) at org.gradle.api.internal.plugins.DefaultObjectConfigurationAction.applyType(DefaultObjectConfigurationAction.java:113) at org.gradle.api.internal.plugins.DefaultObjectConfigurationAction.access$200(DefaultObjectConfigurationAction.java:36) at org.gradle.api.internal.plugins.DefaultObjectConfigurationAction$3.run(DefaultObjectConfigurationAction.java:80) at org.gradle.api.internal.plugins.DefaultObjectConfigurationAction.execute(DefaultObjectConfigurationAction.java:136) at org.gradle.api.internal.project.AbstractPluginAware.apply(AbstractPluginAware.java:44) at org.gradle.api.internal.project.ProjectScript.apply(ProjectScript.java:34) at org.gradle.api.Script$apply$0.callCurrent(Unknown Source) at build_1ztzbib3h4rketyrpodndoubp.run(F:\yjyl_android_studio_work_space\teacher_svn\pIMlibs\build.gradle:1) at org.gradle.groovy.scripts.internal.DefaultScriptRunnerFactory$ScriptRunnerImpl.run(DefaultScriptRunnerFactory.java:90)
Java学习的正确打开方式
在博主认为,对于入门级学习java的最佳学习方法莫过于视频+博客+书籍+总结,前三者博主将淋漓尽致地挥毫于这篇博客文章中,至于总结在于个人,实际上越到后面你会发现学习的最好方式就是阅读参考官方文档其次就是国内的书籍,博客次之,这又是一个层次了,这里暂时不提后面再谈。博主将为各位入门java保驾护航,各位只管冲鸭!!!上天是公平的,只要不辜负时间,时间自然不会辜负你。 何谓学习?博主所理解的学习,它是一个过程,是一个不断累积、不断沉淀、不断总结、善于传达自己的个人见解以及乐于分享的过程。
程序员必须掌握的核心算法有哪些?
由于我之前一直强调数据结构以及算法学习的重要性,所以就有一些读者经常问我,数据结构与算法应该要学习到哪个程度呢?,说实话,这个问题我不知道要怎么回答你,主要取决于你想学习到哪些程度,不过针对这个问题,我稍微总结一下我学过的算法知识点,以及我觉得值得学习的算法。这些算法与数据结构的学习大多数是零散的,并没有一本把他们全部覆盖的书籍。下面是我觉得值得学习的一些算法以及数据结构,当然,我也会整理一些看过...
大学四年自学走来,这些私藏的实用工具/学习网站我贡献出来了
大学四年,看课本是不可能一直看课本的了,对于学习,特别是自学,善于搜索网上的一些资源来辅助,还是非常有必要的,下面我就把这几年私藏的各种资源,网站贡献出来给你们。主要有:电子书搜索、实用工具、在线视频学习网站、非视频学习网站、软件下载、面试/求职必备网站。 注意:文中提到的所有资源,文末我都给你整理好了,你们只管拿去,如果觉得不错,转发、分享就是最大的支持了。 一、电子书搜索 对于大部分程序员...
linux系列之常用运维命令整理笔录
本博客记录工作中需要的linux运维命令,大学时候开始接触linux,会一些基本操作,可是都没有整理起来,加上是做开发,不做运维,有些命令忘记了,所以现在整理成博客,当然vi,文件操作等就不介绍了,慢慢积累一些其它拓展的命令,博客不定时更新 free -m 其中:m表示兆,也可以用g,注意都要小写 Men:表示物理内存统计 total:表示物理内存总数(total=used+free) use...
比特币原理详解
一、什么是比特币 比特币是一种电子货币,是一种基于密码学的货币,在2008年11月1日由中本聪发表比特币白皮书,文中提出了一种去中心化的电子记账系统,我们平时的电子现金是银行来记账,因为银行的背后是国家信用。去中心化电子记账系统是参与者共同记账。比特币可以防止主权危机、信用风险。其好处不多做赘述,这一层面介绍的文章很多,本文主要从更深层的技术原理角度进行介绍。 二、问题引入 假设现有4个人...
程序员接私活怎样防止做完了不给钱?
首先跟大家说明一点,我们做 IT 类的外包开发,是非标品开发,所以很有可能在开发过程中会有这样那样的需求修改,而这种需求修改很容易造成扯皮,进而影响到费用支付,甚至出现做完了项目收不到钱的情况。 那么,怎么保证自己的薪酬安全呢? 我们在开工前,一定要做好一些证据方面的准备(也就是“讨薪”的理论依据),这其中最重要的就是需求文档和验收标准。一定要让需求方提供这两个文档资料作为开发的基础。之后开发...
网页实现一个简单的音乐播放器(大佬别看。(⊙﹏⊙))
今天闲着无事,就想写点东西。然后听了下歌,就打算写个播放器。 于是乎用h5 audio的加上js简单的播放器完工了。 演示地点演示 html代码如下` music 这个年纪 七月的风 音乐 ` 然后就是css`*{ margin: 0; padding: 0; text-decoration: none; list-...
Python十大装B语法
Python 是一种代表简单思想的语言,其语法相对简单,很容易上手。不过,如果就此小视 Python 语法的精妙和深邃,那就大错特错了。本文精心筛选了最能展现 Python 语法之精妙的十个知识点,并附上详细的实例代码。如能在实战中融会贯通、灵活使用,必将使代码更为精炼、高效,同时也会极大提升代码B格,使之看上去更老练,读起来更优雅。
数据库优化 - SQL优化
以实际SQL入手,带你一步一步走上SQL优化之路!
2019年11月中国大陆编程语言排行榜
2019年11月2日,我统计了某招聘网站,获得有效程序员招聘数据9万条。针对招聘信息,提取编程语言关键字,并统计如下: 编程语言比例 rank pl_ percentage 1 java 33.62% 2 cpp 16.42% 3 c_sharp 12.82% 4 javascript 12.31% 5 python 7.93% 6 go 7.25% 7 p...
通俗易懂地给女朋友讲:线程池的内部原理
餐盘在灯光的照耀下格外晶莹洁白,女朋友拿起红酒杯轻轻地抿了一小口,对我说:“经常听你说线程池,到底线程池到底是个什么原理?”
《奇巧淫技》系列-python!!每天早上八点自动发送天气预报邮件到QQ邮箱
将代码部署服务器,每日早上定时获取到天气数据,并发送到邮箱。 也可以说是一个小型人工智障。 知识可以运用在不同地方,不一定非是天气预报。
经典算法(5)杨辉三角
杨辉三角 是经典算法,这篇博客对它的算法思想进行了讲解,并有完整的代码实现。
英特尔不为人知的 B 面
从 PC 时代至今,众人只知在 CPU、GPU、XPU、制程、工艺等战场中,英特尔在与同行硬件芯片制造商们的竞争中杀出重围,且在不断的成长进化中,成为全球知名的半导体公司。殊不知,在「刚硬」的背后,英特尔「柔性」的软件早已经做到了全方位的支持与支撑,并持续发挥独特的生态价值,推动产业合作共赢。 而对于这一不知人知的 B 面,很多人将其称之为英特尔隐形的翅膀,虽低调,但是影响力却不容小觑。 那么,在...
腾讯算法面试题:64匹马8个跑道需要多少轮才能选出最快的四匹?
昨天,有网友私信我,说去阿里面试,彻底的被打击到了。问了为什么网上大量使用ThreadLocal的源码都会加上private static?他被难住了,因为他从来都没有考虑过这个问题。无独有偶,今天笔者又发现有网友吐槽了一道腾讯的面试题,我们一起来看看。 腾讯算法面试题:64匹马8个跑道需要多少轮才能选出最快的四匹? 在互联网职场论坛,一名程序员发帖求助到。二面腾讯,其中一个算法题:64匹...
面试官:你连RESTful都不知道我怎么敢要你?
干货,2019 RESTful最贱实践
刷了几千道算法题,这些我私藏的刷题网站都在这里了!
遥想当年,机缘巧合入了 ACM 的坑,周边巨擘林立,从此过上了"天天被虐似死狗"的生活… 然而我是谁,我可是死狗中的战斗鸡,智力不够那刷题来凑,开始了夜以继日哼哧哼哧刷题的日子,从此"读题与提交齐飞, AC 与 WA 一色 ",我惊喜的发现被题虐既刺激又有快感,那一刻我泪流满面。这么好的事儿作为一个正直的人绝不能自己独享,经过激烈的颅内斗争,我决定把我私藏的十几个 T 的,阿不,十几个刷题网...
为啥国人偏爱Mybatis,而老外喜欢Hibernate/JPA呢?
关于SQL和ORM的争论,永远都不会终止,我也一直在思考这个问题。昨天又跟群里的小伙伴进行了一番讨论,感触还是有一些,于是就有了今天这篇文。 声明:本文不会下关于Mybatis和JPA两个持久层框架哪个更好这样的结论。只是摆事实,讲道理,所以,请各位看官勿喷。 一、事件起因 关于Mybatis和JPA孰优孰劣的问题,争论已经很多年了。一直也没有结论,毕竟每个人的喜好和习惯是大不相同的。我也看...
白话阿里巴巴Java开发手册高级篇
不久前,阿里巴巴发布了《阿里巴巴Java开发手册》,总结了阿里巴巴内部实际项目开发过程中开发人员应该遵守的研发流程规范,这些流程规范在一定程度上能够保证最终的项目交付质量,通过在时间中总结模式,并推广给广大开发人员,来避免研发人员在实践中容易犯的错误,确保最终在大规模协作的项目中达成既定目标。 无独有偶,笔者去年在公司里负责升级和制定研发流程、设计模板、设计标准、代码标准等规范,并在实际工作中进行...
SQL-小白最佳入门sql查询一
不要偷偷的查询我的个人资料,即使你再喜欢我,也不要这样,真的不好;
项目中的if else太多了,该怎么重构?
介绍 最近跟着公司的大佬开发了一款IM系统,类似QQ和微信哈,就是聊天软件。我们有一部分业务逻辑是这样的 if (msgType = "文本") { // dosomething } else if(msgType = "图片") { // doshomething } else if(msgType = "视频") { // doshomething } else { // doshom...
Nginx 原理和架构
Nginx 是一个免费的,开源的,高性能的 HTTP 服务器和反向代理,以及 IMAP / POP3 代理服务器。Nginx 以其高性能,稳定性,丰富的功能,简单的配置和低资源消耗而闻名。 Nginx 的整体架构 Nginx 里有一个 master 进程和多个 worker 进程。master 进程并不处理网络请求,主要负责调度工作进程:加载配置、启动工作进程及非停升级。worker 进程负责处...
【图解经典算法题】如何用一行代码解决约瑟夫环问题
约瑟夫环问题算是很经典的题了,估计大家都听说过,然后我就在一次笔试中遇到了,下面我就用 3 种方法来详细讲解一下这道题,最后一种方法学了之后保证让你可以让你装逼。 问题描述:编号为 1-N 的 N 个士兵围坐在一起形成一个圆圈,从编号为 1 的士兵开始依次报数(1,2,3…这样依次报),数到 m 的 士兵会被杀死出列,之后的士兵再从 1 开始报数。直到最后剩下一士兵,求这个士兵的编号。 1、方...
吐血推荐珍藏的Visual Studio Code插件
作为一名Java工程师,由于工作需要,最近一个月一直在写NodeJS,这种经历可以说是一部辛酸史了。好在有神器Visual Studio Code陪伴,让我的这段经历没有更加困难。眼看这段经历要告一段落了,今天就来给大家分享一下我常用的一些VSC的插件。 VSC的插件安装方法很简单,只需要点击左侧最下方的插件栏选项,然后就可以搜索你想要的插件了。 下面我们进入正题 Material Theme ...
如何防止抄袭PCB电路板
目录 1、抄板是什么 2、抄板是否属于侵权 3、如何防止抄板 1、抄板是什么 抄板也叫克隆或仿制,是对设计出来的PCB板进行反向技术研究;目前全新的定义:从狭义上来说,抄板仅指对电子产品电路板PCB文件的提取还原和利用文件进行电路板克隆的过程;从广义上来说,抄板不仅包括对电路板文件提取、电路板克隆、电路板仿制等技术过程,而且包括对电路板文件进行修改(即改板)、对电子产品外形模具进行三维...
“狗屁不通文章生成器”登顶GitHub热榜,分分钟写出万字形式主义大作
一、垃圾文字生成器介绍 最近在浏览GitHub的时候,发现了这样一个骨骼清奇的雷人项目,而且热度还特别高。 项目中文名:狗屁不通文章生成器 项目英文名:BullshitGenerator 根据作者的介绍,他是偶尔需要一些中文文字用于GUI开发时测试文本渲染,因此开发了这个废话生成器。但由于生成的废话实在是太过富于哲理,所以最近已经被小伙伴们给玩坏了。 他的文风可能是这样的: 你发现,...
程序员:我终于知道post和get的区别
是一个老生常谈的话题,然而随着不断的学习,对于以前的认识有很多误区,所以还是需要不断地总结的,学而时习之,不亦说乎
《程序人生》系列-这个程序员只用了20行代码就拿了冠军
你知道的越多,你不知道的越多 点赞再看,养成习惯GitHub上已经开源https://github.com/JavaFamily,有一线大厂面试点脑图,欢迎Star和完善 前言 这一期不算《吊打面试官》系列的,所有没前言我直接开始。 絮叨 本来应该是没有这期的,看过我上期的小伙伴应该是知道的嘛,双十一比较忙嘛,要值班又要去帮忙拍摄年会的视频素材,还得搞个程序员一天的Vlog,还要写BU...
加快推动区块链技术和产业创新发展,2019可信区块链峰会在京召开
11月8日,由中国信息通信研究院、中国通信标准化协会、中国互联网协会、可信区块链推进计划联合主办,科技行者协办的2019可信区块链峰会将在北京悠唐皇冠假日酒店开幕。   区块链技术被认为是继蒸汽机、电力、互联网之后,下一代颠覆性的核心技术。如果说蒸汽机释放了人类的生产力,电力解决了人类基本的生活需求,互联网彻底改变了信息传递的方式,区块链作为构造信任的技术有重要的价值。   1...
Python 植物大战僵尸代码实现(2):植物卡片选择和种植
这篇文章要介绍的是: - 上方植物卡片栏的实现。 - 点击植物卡片,鼠标切换为植物图片。 - 鼠标移动时,判断当前在哪个方格中,并显示半透明的植物作为提示。
相关热词 c# 引用mysql c#动态加载非托管dll c# 两个表数据同步 c# 返回浮点json c# imap 链接状态 c# 漂亮字 c# 上取整 除法 c#substring c#中延时关闭 c#线段拖拉
立即提问