caffe生成解决方案时出错 20C

编译环境:win10 vs2017 15.5.6 boost_1_70_0

主要报错:
Unknown compiler version - please run the configure tests and report the results

再次点生成解决方案时的主要报错:
for each 语句不能在“std::array *”类型的变量上操作 ;
“std::array”: 模板 参数太少 ;
无法打开文件“libboost_date_time-vc140-mt-gd-1_59.lib” 等等;
因为只能一条条复制,所以如有需要,可提供详细错误;

下面是重新生成解决方案的具体报错,有大佬来救救我吗,感激不尽!需要更详细信息可以直说。

报错:1>------ 已启动全部重新生成: 项目: libcaffe, 配置: Debug x64 ------
1>ProtoCompile.cmd : Create proto temp directory "C:\Users\Kay Chow\Documents\caffe-master\windows..\src\caffe\proto\temp"
1>ProtoCompile.cmd : Generating "C:\Users\Kay Chow\Documents\caffe-master\windows..\src\caffe\proto\temp\caffe.pb.h" and "C:\Users\Kay Chow\Documents\caffe-master\windows..\src\caffe\proto\temp\caffe.pb.cc"
1>ProtoCompile.cmd : Create proto include directory
1>子目录或文件 C:\Users\Kay Chow\Documents\caffe-master\windows..\include\caffe\proto 已经存在。
1>ProtoCompile.cmd : Compare newly compiled caffe.pb.h with existing one
1>blob.cpp
1>common.cpp
1>data_reader.cpp
1>data_transformer.cpp
1>internal_thread.cpp
1>layer.cpp
1>absval_layer.cpp
1>accuracy_layer.cpp
1>Unknown compiler version - please run the configure tests and report the results
1>Unknown compiler version - please run the configure tests and report the results
1>Unknown compiler version - please run the configure tests and report the results
1>Unknown compiler version - please run the configure tests and report the results
1>Unknown compiler version - please run the configure tests and report the results
1>Unknown compiler version - please run the configure tests and report the results
1>Unknown compiler version - please run the configure tests and report the results
1>Unknown compiler version - please run the configure tests and report the results
1>argmax_layer.cpp
1>base_conv_layer.cpp
1>base_data_layer.cpp
1>Unknown compiler version - please run the configure tests and report the results
1>Unknown compiler version - please run the configure tests and report the results
1>Unknown compiler version - please run the configure tests and report the results
1>batch_norm_layer.cpp
1>Unknown compiler version - please run the configure tests and report the results
1>batch_reindex_layer.cpp
1>bias_layer.cpp
1>Unknown compiler version - please run the configure tests and report the results
1>Unknown compiler version - please run the configure tests and report the results
1>bnll_layer.cpp
1>box_annotator_ohem_layer.cpp
1>Unknown compiler version - please run the configure tests and report the results
1>concat_layer.cpp
1>contrastive_loss_layer.cpp
1>Unknown compiler version - please run the configure tests and report the results
1>Unknown compiler version - please run the configure tests and report the results
1>Unknown compiler version - please run the configure tests and report the results
1>conv_layer.cpp
1>Unknown compiler version - please run the configure tests and report the results
1>crop_layer.cpp
1>cudnn_conv_layer.cpp
1>cudnn_lcn_layer.cpp
1>cudnn_lrn_layer.cpp
1>cudnn_pooling_layer.cpp
1>Unknown compiler version - please run the configure tests and report the results
1>cudnn_relu_layer.cpp
1>cudnn_sigmoid_layer.cpp
1>cudnn_softmax_layer.cpp
1>cudnn_tanh_layer.cpp
1>data_layer.cpp
1>deconv_layer.cpp
1>dropout_layer.cpp
1>dummy_data_layer.cpp
1>eltwise_layer.cpp
1>elu_layer.cpp
1>Unknown compiler version - please run the configure tests and report the results
1>Unknown compiler version - please run the configure tests and report the results
1>Unknown compiler version - please run the configure tests and report the results
1>Unknown compiler version - please run the configure tests and report the results
1>Unknown compiler version - please run the configure tests and report the results
1>Unknown compiler version - please run the configure tests and report the results
1>embed_layer.cpp
1>Unknown compiler version - please run the configure tests and report the results
1>euclidean_loss_layer.cpp
1>Unknown compiler version - please run the configure tests and report the results
1>exp_layer.cpp
1>filter_layer.cpp
1>flatten_layer.cpp
1>hdf5_data_layer.cpp
1>Unknown compiler version - please run the configure tests and report the results
1>Unknown compiler version - please run the configure tests and report the results
1>hdf5_output_layer.cpp
1>Unknown compiler version - please run the configure tests and report the results
1>Unknown compiler version - please run the configure tests and report the results
1>Unknown compiler version - please run the configure tests and report the results
1>hinge_loss_layer.cpp
1>Unknown compiler version - please run the configure tests and report the results
1>im2col_layer.cpp
1>image_data_layer.cpp
1>infogain_loss_layer.cpp
1>inner_product_layer.cpp
1>Unknown compiler version - please run the configure tests and report the results
1>input_layer.cpp
1>Unknown compiler version - please run the configure tests and report the results
1>log_layer.cpp
1>loss_layer.cpp
1>Unknown compiler version - please run the configure tests and report the results
1>Unknown compiler version - please run the configure tests and report the results
1>Unknown compiler version - please run the configure tests and report the results
1>Unknown compiler version - please run the configure tests and report the results
1>Unknown compiler version - please run the configure tests and report the results
1>lrn_layer.cpp
1>Unknown compiler version - please run the configure tests and report the results
1>memory_data_layer.cpp
1>multinomial_logistic_loss_layer.cpp
1>mvn_layer.cpp
1>neuron_layer.cpp
1>Unknown compiler version - please run the configure tests and report the results
1>parameter_layer.cpp
1>Unknown compiler version - please run the configure tests and report the results
1>Unknown compiler version - please run the configure tests and report the results
1>pooling_layer.cpp
1>Unknown compiler version - please run the configure tests and report the results
1>Unknown compiler version - please run the configure tests and report the results
1>Unknown compiler version - please run the configure tests and report the results
1>power_layer.cpp
1>Unknown compiler version - please run the configure tests and report the results
1>prelu_layer.cpp
1>psroi_pooling_layer.cpp
1>reduction_layer.cpp
1>relu_layer.cpp
1>reshape_layer.cpp
1>scale_layer.cpp
1>sigmoid_cross_entropy_loss_layer.cpp
1>Unknown compiler version - please run the configure tests and report the results
1>Unknown compiler version - please run the configure tests and report the results
1>Unknown compiler version - please run the configure tests and report the results
1>Unknown compiler version - please run the configure tests and report the results
1>Unknown compiler version - please run the configure tests and report the results
1>Unknown compiler version - please run the configure tests and report the results
1>Unknown compiler version - please run the configure tests and report the results
1>sigmoid_layer.cpp
1>Unknown compiler version - please run the configure tests and report the results
1>silence_layer.cpp
1>slice_layer.cpp
1>smooth_l1_loss_layer.cpp
1>smooth_L1_loss_ohem_layer.cpp
1>Unknown compiler version - please run the configure tests and report the results
1>softmax_layer.cpp
1>Unknown compiler version - please run the configure tests and report the results
1>Unknown compiler version - please run the configure tests and report the results
1>softmax_loss_layer.cpp
1>Unknown compiler version - please run the configure tests and report the results
1>softmax_loss_ohem_layer.cpp
1>Unknown compiler version - please run the configure tests and report the results
1>split_layer.cpp
1>Unknown compiler version - please run the configure tests and report the results
1>Unknown compiler version - please run the configure tests and report the results
1>Unknown compiler version - please run the configure tests and report the results
1>spp_layer.cpp
1>tanh_layer.cpp
1>threshold_layer.cpp
1>tile_layer.cpp
1>window_data_layer.cpp
1>Unknown compiler version - please run the configure tests and report the results
1>Unknown compiler version - please run the configure tests and report the results
1>Unknown compiler version - please run the configure tests and report the results
1>Unknown compiler version - please run the configure tests and report the results
1>layer_factory.cpp
1>net.cpp
1>parallel.cpp
1>Unknown compiler version - please run the configure tests and report the results
1>Unknown compiler version - please run the configure tests and report the results
1>Unknown compiler version - please run the configure tests and report the results
1>Unknown compiler version - please run the configure tests and report the results
1>caffe.pb.cc
1>solver.cpp
1>adadelta_solver.cpp
1>adagrad_solver.cpp
1>Unknown compiler version - please run the configure tests and report the results
1>Unknown compiler version - please run the configure tests and report the results
1>Unknown compiler version - please run the configure tests and report the results
1>adam_solver.cpp
1>Unknown compiler version - please run the configure tests and report the results
1>nesterov_solver.cpp
1>Unknown compiler version - please run the configure tests and report the results
1>rmsprop_solver.cpp
1>sgd_solver.cpp
1>syncedmem.cpp
1>Unknown compiler version - please run the configure tests and report the results
1>Unknown compiler version - please run the configure tests and report the results
1>benchmark.cpp
1>Unknown compiler version - please run the configure tests and report the results
1>Unknown compiler version - please run the configure tests and report the results
1>blocking_queue.cpp
1>Unknown compiler version - please run the configure tests and report the results
1>cudnn.cpp
1>db.cpp
1>db_leveldb.cpp
1>Unknown compiler version - please run the configure tests and report the results
1>db_lmdb.cpp
1>Unknown compiler version - please run the configure tests and report the results
1>Unknown compiler version - please run the configure tests and report the results
1>hdf5.cpp
1>Unknown compiler version - please run the configure tests and report the results
1>im2col.cpp
1>insert_splits.cpp
1>io.cpp
1>Unknown compiler version - please run the configure tests and report the results
1>math_functions.cpp
1>signal_handler.cpp
1>Unknown compiler version - please run the configure tests and report the results
1>Unknown compiler version - please run the configure tests and report the results
1>Unknown compiler version - please run the configure tests and report the results
1>upgrade_proto.cpp
1>Unknown compiler version - please run the configure tests and report the results
1>Unknown compiler version - please run the configure tests and report the results
1>libcaffe.vcxproj -> C:\Users\Kay Chow\Documents\caffe-master\windows..\Build\x64\Debug\libcaffe.lib
1>BinplaceCudaDependencies : CPU only build, don't copy cuda dependencies.
2>------ 已启动全部重新生成: 项目: caffe, 配置: Debug x64 ------
3>------ 已启动全部重新生成: 项目: caffe.managed, 配置: Debug x64 ------
4>------ 已启动全部重新生成: 项目: convert_cifar_data, 配置: Debug x64 ------
5>------ 已启动全部重新生成: 项目: classification, 配置: Debug x64 ------
6>------ 已启动全部重新生成: 项目: convert_mnist_data, 配置: Debug x64 ------
7>------ 已启动全部重新生成: 项目: convert_mnist_siamese_data, 配置: Debug x64 ------
8>------ 已启动全部重新生成: 项目: upgrade_net_proto_binary, 配置: Debug x64 ------
9>------ 已启动全部重新生成: 项目: upgrade_net_proto_text, 配置: Debug x64 ------
2>caffe.cpp
9>upgrade_net_proto_text.cpp
2>Unknown compiler version - please run the configure tests and report the results
4>convert_cifar_data.cpp
3>Stdafx.cpp
9>Unknown compiler version - please run the configure tests and report the results
5>classification.cpp
6>convert_mnist_data.cpp
7>convert_mnist_siamese_data.cpp
4>Unknown compiler version - please run the configure tests and report the results
5>Unknown compiler version - please run the configure tests and report the results
8>upgrade_net_proto_binary.cpp
6>Unknown compiler version - please run the configure tests and report the results
8>Unknown compiler version - please run the configure tests and report the results
7>Unknown compiler version - please run the configure tests and report the results
3>AssemblyInfo.cpp
3>caffelib.cpp
3>caffelib.cpp(61): error C2976: “std::array”: 模板 参数太少
3>D:\VS2017\VC\Tools\MSVC\14.12.25827\include\utility(474): note: 参见“std::array”的声明
3>caffelib.cpp(62): error C3699: “^”: 不能在类型“std::array”上使用此间接寻址
3>caffelib.cpp(62): note: 编译器将“^”替换为“*”以继续进行分析
3>caffelib.cpp(68): error C2976: “std::array”: 模板 参数太少
3>D:\VS2017\VC\Tools\MSVC\14.12.25827\include\utility(474): note: 参见“std::array”的声明
3>caffelib.cpp(68): error C3699: “^”: 不能在类型“std::array”上使用此间接寻址
3>caffelib.cpp(68): note: 编译器将“^”替换为“*”以继续进行分析
3>caffelib.cpp(69): error C3699: “^”: 不能在类型“std::array”上使用此间接寻址
3>caffelib.cpp(69): note: 编译器将“^”替换为“*”以继续进行分析
3>caffelib.cpp(127): error C2976: “std::array”: 模板 参数太少
3>D:\VS2017\VC\Tools\MSVC\14.12.25827\include\utility(474): note: 参见“std::array”的声明
3>caffelib.cpp(128): error C3699: “^”: 不能在类型“std::array”上使用此间接寻址
3>caffelib.cpp(128): note: 编译器将“^”替换为“*”以继续进行分析
3>caffelib.cpp(136): error C2976: “std::array”: 模板 参数太少
3>D:\VS2017\VC\Tools\MSVC\14.12.25827\include\utility(474): note: 参见“std::array”的声明
3>caffelib.cpp(136): error C3699: “^”: 不能在类型“std::array”上使用此间接寻址
3>caffelib.cpp(136): note: 编译器将“^”替换为“*”以继续进行分析
3>caffelib.cpp(137): error C3699: “^”: 不能在类型“std::array”上使用此间接寻址
3>caffelib.cpp(137): note: 编译器将“^”替换为“*”以继续进行分析
3>caffelib.cpp(64): error C2976: “std::array”: 模板 参数太少
3>D:\VS2017\VC\Tools\MSVC\14.12.25827\include\utility(474): note: 参见“std::array”的声明
3>caffelib.cpp(64): error C2027: 使用了未定义类型“std::array”
3>D:\VS2017\VC\Tools\MSVC\14.12.25827\include\utility(474): note: 参见“std::array”的声明
3>caffelib.cpp(64): error C3536: “outputs”: 初始化之前无法使用
3>caffelib.cpp(64): error C2109: 下标要求数组或指针类型
3>caffelib.cpp(65): error C2440: “return”: 无法从“int”转换为“std::array
3>caffelib.cpp(65): note: 从整型转换为指针类型要求 reinterpret_cast、C 样式转换或函数样式转换
3>caffelib.cpp(71): error C3285: for each 语句不能在“std::array *”类型的变量上操作
3>caffelib.cpp(72): error C2065: “name”: 未声明的标识符
3>caffelib.cpp(74): error C2976: “std::array”: 模板 参数太少
3>D:\VS2017\VC\Tools\MSVC\14.12.25827\include\utility(474): note: 参见“std::array”的声明
3>caffelib.cpp(74): error C3699: “^”: 不能在类型“std::array”上使用此间接寻址
3>caffelib.cpp(74): note: 编译器将“^”替换为“
”以继续进行分析
3>caffelib.cpp(74): error C2027: 使用了未定义类型“std::array”
3>D:\VS2017\VC\Tools\MSVC\14.12.25827\include\utility(474): note: 参见“std::array”的声明
3>caffelib.cpp(78): error C2976: “std::array”: 模板 参数太少
3>D:\VS2017\VC\Tools\MSVC\14.12.25827\include\utility(474): note: 参见“std::array”的声明
3>caffelib.cpp(78): error C2027: 使用了未定义类型“std::array”
3>D:\VS2017\VC\Tools\MSVC\14.12.25827\include\utility(474): note: 参见“std::array”的声明
3>caffelib.cpp(78): error C3536: “values”: 初始化之前无法使用
3>caffelib.cpp(78): error C2109: 下标要求数组或指针类型
3>caffelib.cpp(79): error C3536: “outputs”: 初始化之前无法使用
3>caffelib.cpp(79): error C2109: 下标要求数组或指针类型
3>caffelib.cpp(81): error C2440: “return”: 无法从“int”转换为“std::array
3>caffelib.cpp(81): note: 从整型转换为指针类型要求 reinterpret_cast、C 样式转换或函数样式转换
3>caffelib.cpp(132): error C2976: “std::array”: 模板 参数太少
3>D:\VS2017\VC\Tools\MSVC\14.12.25827\include\utility(474): note: 参见“std::array”的声明
3>caffelib.cpp(132): error C2027: 使用了未定义类型“std::array”
3>D:\VS2017\VC\Tools\MSVC\14.12.25827\include\utility(474): note: 参见“std::array”的声明
3>caffelib.cpp(132): error C3536: “outputs”: 初始化之前无法使用
3>caffelib.cpp(132): error C2109: 下标要求数组或指针类型
3>caffelib.cpp(133): error C2440: “return”: 无法从“int”转换为“std::array *”
3>caffelib.cpp(133): note: 从整型转换为指针类型要求 reinterpret_cast、C 样式转换或函数样式转换
3>caffelib.cpp(141): error C3285: for each 语句不能在“std::array *”类型的变量上操作
3>caffelib.cpp(142): error C2065: “name”: 未声明的标识符
3>caffelib.cpp(144): error C2976: “std::array”: 模板 参数太少
3>D:\VS2017\VC\Tools\MSVC\14.12.25827\include\utility(474): note: 参见“std::array”的声明
3>caffelib.cpp(144): error C3699: “^”: 不能在类型“std::array”上使用此间接寻址
3>caffelib.cpp(144): note: 编译器将“^”替换为“
”以继续进行分析
3>caffelib.cpp(144): error C2027: 使用了未定义类型“std::array”
3>D:\VS2017\VC\Tools\MSVC\14.12.25827\include\utility(474): note: 参见“std::array”的声明
3>caffelib.cpp(148): error C2976: “std::array”: 模板 参数太少
3>D:\VS2017\VC\Tools\MSVC\14.12.25827\include\utility(474): note: 参见“std::array”的声明
3>caffelib.cpp(148): error C2027: 使用了未定义类型“std::array”
3>D:\VS2017\VC\Tools\MSVC\14.12.25827\include\utility(474): note: 参见“std::array”的声明
3>caffelib.cpp(148): error C3536: “values”: 初始化之前无法使用
3>caffelib.cpp(148): error C2109: 下标要求数组或指针类型
3>caffelib.cpp(149): error C3536: “outputs”: 初始化之前无法使用
3>caffelib.cpp(149): error C2109: 下标要求数组或指针类型
3>caffelib.cpp(151): error C2440: “return”: 无法从“int”转换为“std::array *”
3>caffelib.cpp(151): note: 从整型转换为指针类型要求 reinterpret_cast、C 样式转换或函数样式转换
3>已完成生成项目“caffe.managed.vcxproj”的操作 - 失败。
4>LINK : fatal error LNK1104: 无法打开文件“libboost_thread-vc140-mt-gd-1_59.lib”
10>------ 已启动全部重新生成: 项目: upgrade_solver_proto_text, 配置: Debug x64 ------
4>已完成生成项目“convert_cifar_data.vcxproj”的操作 - 失败。
6>LINK : fatal error LNK1104: 无法打开文件“libboost_thread-vc140-mt-gd-1_59.lib”
6>已完成生成项目“convert_mnist_data.vcxproj”的操作 - 失败。
10>upgrade_solver_proto_text.cpp
7>LINK : fatal error LNK1104: 无法打开文件“libboost_thread-vc140-mt-gd-1_59.lib”
7>已完成生成项目“convert_mnist_siamese_data.vcxproj”的操作 - 失败。
10>Unknown compiler version - please run the configure tests and report the results
9>LINK : fatal error LNK1104: 无法打开文件“libboost_date_time-vc140-mt-gd-1_59.lib”
9>已完成生成项目“upgrade_net_proto_text.vcxproj”的操作 - 失败。
8>LINK : fatal error LNK1104: 无法打开文件“libboost_date_time-vc140-mt-gd-1_59.lib”
8>已完成生成项目“upgrade_net_proto_binary.vcxproj”的操作 - 失败。
5>LINK : fatal error LNK1104: 无法打开文件“libboost_date_time-vc140-mt-gd-1_59.lib”
5>已完成生成项目“classification.vcxproj”的操作 - 失败。
2>LINK : fatal error LNK1104: 无法打开文件“libboost_date_time-vc140-mt-gd-1_59.lib”
2>已完成生成项目“caffe.vcxproj”的操作 - 失败。
11>------ 已启动全部重新生成: 项目: compute_image_mean, 配置: Debug x64 ------
12>------ 已启动全部重新生成: 项目: convert_imageset, 配置: Debug x64 ------
13>------ 已启动全部重新生成: 项目: extract_features, 配置: Debug x64 ------
14>------ 已启动全部重新生成: 项目: test_all, 配置: Debug x64 ------
15>------ 已启动全部重新生成: 项目: pycaffe, 配置: Debug x64 ------
16>------ 已启动全部重新生成: 项目: matcaffe, 配置: Debug x64 ------
15>Skipping project pycaffe, Python support is not enabled in CommonSettings.props.
16>Skipping project matcaffe, Matlab support is not enabled in CommonSettings.props.
12>convert_imageset.cpp
11>compute_image_mean.cpp
13>extract_features.cpp
14>test_accuracy_layer.cpp
14>test_argmax_layer.cpp
14>test_batch_norm_layer.cpp
14>test_batch_reindex_layer.cpp
14>test_benchmark.cpp
14>test_bias_layer.cpp
14>test_blob.cpp
14>test_caffe_main.cpp
14>Unknown compiler version - please run the configure tests and report the results
13>Unknown compiler version - please run the configure tests and report the results
12>Unknown compiler version - please run the configure tests and report the results
11>Unknown compiler version - please run the configure tests and report the results
14>Unknown compiler version - please run the configure tests and report the results
10>LINK : fatal error LNK1104: 无法打开文件“libboost_date_time-vc140-mt-gd-1_59.lib”
10>已完成生成项目“upgrade_solver_proto_text.vcxproj”的操作 - 失败。
14>Unknown compiler version - please run the configure tests and report the results
14>Unknown compiler version - please run the configure tests and report the results
14>Unknown compiler version - please run the configure tests and report the results
14>Unknown compiler version - please run the configure tests and report the results
14>Unknown compiler version - please run the configure tests and report the results
14>Unknown compiler version - please run the configure tests and report the results
11>LINK : fatal error LNK1104: 无法打开文件“libboost_filesystem-vc140-mt-gd-1_59.lib”
11>已完成生成项目“compute_image_mean.vcxproj”的操作 - 失败。
12>LINK : fatal error LNK1104: 无法打开文件“libboost_filesystem-vc140-mt-gd-1_59.lib”
12>已完成生成项目“convert_imageset.vcxproj”的操作 - 失败。
13>LINK : fatal error LNK1104: 无法打开文件“libboost_filesystem-vc140-mt-gd-1_59.lib”
13>已完成生成项目“extract_features.vcxproj”的操作 - 失败。
14>test_common.cpp
14>test_concat_layer.cpp
14>test_contrastive_loss_layer.cpp
14>test_convolution_layer.cpp
14>test_crop_layer.cpp
14>test_data_layer.cpp
14>Unknown compiler version - please run the configure tests and report the results
14>Unknown compiler version - please run the configure tests and report the results
14>Unknown compiler version - please run the configure tests and report the results
14>Unknown compiler version - please run the configure tests and report the results
14>Unknown compiler version - please run the configure tests and report the results
14>Unknown compiler version - please run the configure tests and report the results
14>test_data_transformer.cpp
14>Unknown compiler version - please run the configure tests and report the results
14>test_db.cpp
14>test_deconvolution_layer.cpp
14>Unknown compiler version - please run the configure tests and report the results
14>test_dummy_data_layer.cpp
14>test_eltwise_layer.cpp
14>Unknown compiler version - please run the configure tests and report the results
14>test_embed_layer.cpp
14>test_euclidean_loss_layer.cpp
14>test_filler.cpp
14>Unknown compiler version - please run the configure tests and report the results
14>Unknown compiler version - please run the configure tests and report the results
14>Unknown compiler version - please run the configure tests and report the results
14>Unknown compiler version - please run the configure tests and report the results
14>Unknown compiler version - please run the configure tests and report the results
14>test_filter_layer.cpp
14>Unknown compiler version - please run the configure tests and report the results
14>test_flatten_layer.cpp
14>test_gradient_based_solver.cpp
14>Unknown compiler version - please run the configure tests and report the results
14>test_hdf5data_layer.cpp
14>test_hdf5_output_layer.cpp
14>test_hinge_loss_layer.cpp
14>Unknown compiler version - please run the configure tests and report the results
14>test_im2col_layer.cpp
14>test_image_data_layer.cpp
14>Unknown compiler version - please run the configure tests and report the results
14>Unknown compiler version - please run the configure tests and report the results
14>Unknown compiler version - please run the configure tests and report the results
14>Unknown compiler version - please run the configure tests and report the results
14>Unknown compiler version - please run the configure tests and report the results
14>test_infogain_loss_layer.cpp
14>Unknown compiler version - please run the configure tests and report the results
14>test_inner_product_layer.cpp
14>Unknown compiler version - please run the configure tests and report the results
14>test_internal_thread.cpp
14>test_io.cpp
14>test_layer_factory.cpp
14>test_lrn_layer.cpp
14>Unknown compiler version - please run the configure tests and report the results
14>test_math_functions.cpp
14>Unknown compiler version - please run the configure tests and report the results
14>Unknown compiler version - please run the configure tests and report the results
14>Unknown compiler version - please run the configure tests and report the results
14>Unknown compiler version - please run the configure tests and report the results
14>test_maxpool_dropout_layers.cpp
14>Unknown compiler version - please run the configure tests and report the results
14>test_memory_data_layer.cpp
14>test_multinomial_logistic_loss_layer.cpp
14>test_mvn_layer.cpp
14>Unknown compiler version - please run the configure tests and report the results
14>Unknown compiler version - please run the configure tests and report the results
14>Unknown compiler version - please run the configure tests and report the results
14>test_net.cpp
14>test_neuron_layer.cpp
14>test_platform.cpp
14>test_pooling_layer.cpp
14>test_power_layer.cpp
14>Unknown compiler version - please run the configure tests and report the results
14>Unknown compiler version - please run the configure tests and report the results
14>Unknown compiler version - please run the configure tests and report the results
14>Unknown compiler version - please run the configure tests and report the results
14>test_protobuf.cpp
14>test_random_number_generator.cpp
14>Unknown compiler version - please run the configure tests and report the results
14>test_reduction_layer.cpp
14>c:\users\kay chow\documents\caffe-master\src\caffe\test\test_net.cpp(1010): error C2220: 警告被视为错误 - 没有生成“object”文件
14>c:\users\kay chow\documents\caffe-master\src\caffe\test\test_net.cpp(992): note: 编译 类 模板 成员函数 "void caffe::NetTest_TestLossWeightMidNet_Test::TestBody(void)" 时
14> with
14> [
14> T=Type
14> ]
14>c:\users\kay chow\documents\caffe-master\src\gtest\gtest.h(7341): note: 参见对正在编译的 类 模板 实例化 "caffe::NetTest_TestLossWeightMidNet_Test" 的引用
14> with
14>
14> T=Type
14>

14>c:\users\kay chow\documents\caffe-master\src\gtest\gtest.h(7327): note: 编译 类 模板 成员函数 "bool testing::internal::TypeParameterizedTestcaffe::NetTest,testing::internal::TemplateSel<caffe::NetTest_TestLossWeightMidNet_Test,caffe::gtest_type_params_NetTest_>::Register(const char *,const char *,const char *,int)" 时 (编译源文件 ....\src\caffe\test\test_net.cpp)
14>c:\users\kay chow\documents\caffe-master\src\caffe\test\test_net.cpp(992): note: 参见对正在编译的函数 模板 实例化“bool testing::internal::TypeParameterizedTestcaffe::NetTest,testing::internal::TemplateSel<caffe::NetTest_TestLossWeightMidNet_Test,caffe::gtest_type_params_NetTest_>::Register(const char *,const char *,const char *,int)”的引用
14>c:\users\kay chow\documents\caffe-master\src\caffe\test\test_net.cpp(992): note: 参见对正在编译的 类 模板 实例化 "testing::internal::TypeParameterizedTestcaffe::NetTest,testing::internal::TemplateSel<caffe::NetTest_TestLossWeightMidNet_Test,caffe::gtest_type_params_NetTest_>" 的引用
14>c:\users\kay chow\documents\caffe-master\src\caffe\test\test_net.cpp(1010): warning C4838: 从“double”转换到“Dtype”需要收缩转换
14>c:\users\kay chow\documents\caffe-master\src\caffe\test\test_net.cpp(961): warning C4838: 从“double”转换到“Dtype”需要收缩转换
14>c:\users\kay chow\documents\caffe-master\src\caffe\test\test_net.cpp(941): note: 编译 类 模板 成员函数 "void caffe::NetTest_TestLossWeight_Test::TestBody(void)" 时
14> with
14> [
14> T=Type
14> ]
14>c:\users\kay chow\documents\caffe-master\src\gtest\gtest.h(7341): note: 参见对正在编译的 类 模板 实例化 "caffe::NetTest_TestLossWeight_Test" 的引用
14> with
14>
14> T=Type
14>

14>c:\users\kay chow\documents\caffe-master\src\gtest\gtest.h(7327): note: 编译 类 模板 成员函数 "bool testing::internal::TypeParameterizedTestcaffe::NetTest,testing::internal::TemplateSel<caffe::NetTest_TestLossWeight_Test,caffe::gtest_type_params_NetTest_>::Register(const char *,const char *,const char *,int)" 时 (编译源文件 ....\src\caffe\test\test_net.cpp)
14>c:\users\kay chow\documents\caffe-master\src\caffe\test\test_net.cpp(941): note: 参见对正在编译的函数 模板 实例化“bool testing::internal::TypeParameterizedTestcaffe::NetTest,testing::internal::TemplateSel<caffe::NetTest_TestLossWeight_Test,caffe::gtest_type_params_NetTest_>::Register(const char *,const char *,const char *,int)”的引用
14>c:\users\kay chow\documents\caffe-master\src\caffe\test\test_net.cpp(941): note: 参见对正在编译的 类 模板 实例化 "testing::internal::TypeParameterizedTestcaffe::NetTest,testing::internal::TemplateSel<caffe::NetTest_TestLossWeight_Test,caffe::gtest_type_params_NetTest_>" 的引用
14>test_reshape_layer.cpp
14>Unknown compiler version - please run the configure tests and report the results
14>Unknown compiler version - please run the configure tests and report the results
14>Unknown compiler version - please run the configure tests and report the results
14>test_scale_layer.cpp
14>test_sigmoid_cross_entropy_loss_layer.cpp
14>test_slice_layer.cpp
14>test_softmax_layer.cpp
14>Unknown compiler version - please run the configure tests and report the results
14>Unknown compiler version - please run the configure tests and report the results
14>test_softmax_with_loss_layer.cpp
14>Unknown compiler version - please run the configure tests and report the results
14>Unknown compiler version - please run the configure tests and report the results
14>Unknown compiler version - please run the configure tests and report the results
14>test_solver.cpp
14>Unknown compiler version - please run the configure tests and report the results
14>test_solver_factory.cpp
14>test_split_layer.cpp
14>Unknown compiler version - please run the configure tests and report the results
14>test_spp_layer.cpp
14>Unknown compiler version - please run the configure tests and report the results
14>test_stochastic_pooling.cpp
14>test_syncedmem.cpp
14>test_tanh_layer.cpp
14>Unknown compiler version - please run the configure tests and report the results
14>test_threshold_layer.cpp
14>Unknown compiler version - please run the configure tests and report the results
14>Unknown compiler version - please run the configure tests and report the results
14>Unknown compiler version - please run the configure tests and report the results
14>Unknown compiler version - please run the configure tests and report the results
14>test_tile_layer.cpp
14>Unknown compiler version - please run the configure tests and report the results
14>test_upgrade_proto.cpp
14>test_util_blas.cpp
14>gtest-all.cpp
14>Unknown compiler version - please run the configure tests and report the results
14>已完成生成项目“test_all.vcxproj”的操作 - 失败。
========== 全部重新生成: 成功 3 个,失败 13 个,跳过 0 个 ==========

2个回答

第1个: Unknown compiler version - please run the configure tests and report the results 不是个错误,是个警告,我在编译的时候也会出现,这个是boost库的警告;
第2个: 无法打开文件“libboost_date_time-vc140-mt-gd-1_59.lib”见图:
图片说明

其他的问题需要看到具体代码才能解决了;看着感觉错误很多,其实估计就是个别地方的问题

Csdn user default icon
上传中...
上传图片
插入图片
抄袭、复制答案,以达到刷声望分或其他目的的行为,在CSDN问答是严格禁止的,一经发现立刻封号。是时候展现真正的技术了!
其他相关推荐
深度学习配置caffe,生成解决方案时一直出错
C1083 无法打开包括文件: “boost/thread.hpp”: No such file or directory...,生成解决方案一直出错,无法打开文件(boost,glog,google,hdf5.h等等) ![图片说明](https://img-ask.csdn.net/upload/201906/19/1560931792_667312.jpg)
用VS对caffe生成解决方案的时候不能生成object
![图片说明](https://img-ask.csdn.net/upload/201905/30/1559203483_435406.png)
Windows 下安装 caffe
按照 深度学习 21天实战caffe 里面的步骤在Windows下安装caffe,最后在生成解决方案时出错为:CommomSettings.props not found!(里面参数按照教程已改),网上搜索一直未果,有人知道解决办法吗?
caffe框架 训练ImageNet时出错
在imagenet的数据预处理中,我并未产生任何错误,可是终端出现了killed的结果,而且并没生成caffemodel,结果如图。 另外,我的solver、train等都是参考网上的教程来设计的。![图片说明](https://img-ask.csdn.net/upload/201703/24/1490368020_725943.png)
服务器无root权限配置caffe安装snappy时make出错
根据教程https://blog.csdn.net/jiajinrang93/article/details/80337513,安装snappy进行make时报错,cmake版本为3.5.1.请问这要怎样解决?? ``` CMakeFiles/snappy_unittest.dir/snappy_unittest.cc.o:(.rodata._ZTIN6snappy31Snappy_ReadPastEndOfBuffer_TestE[_ZTIN6snappy31Snappy_ReadPastEndOfBuffer_TestE]+0x10): more undefined references to `typeinfo for testing::Test' follow collect2: error: ld returned 1 exit status CMakeFiles/snappy_unittest.dir/build.make:122: recipe for target 'snappy_unittest' failed make[2]: *** [snappy_unittest] Error 1 CMakeFiles/Makefile2:104: recipe for target 'CMakeFiles/snappy_unittest.dir/all' failed make[1]: *** [CMakeFiles/snappy_unittest.dir/all] Error 2 Makefile:138: recipe for target 'all' failed make: *** [all] Error 2 ```
Mac 安装caffe,wget时出错,求解答
安装caffe时,安装wget,执行./configure --with-ssl=openssl --with-libssl-prefix=/usr/local/ssl时总出错,提示: configure: error: --with-ssl=openssl was given, but SSL is not available.
ubuntu14.04环境下安装配置caffe,最后编译caffe时出错
我按照http://www.linuxdiyf.com/linux/13008.html 这篇博客配置caffe,前面都没有问题, 但是到这一步之后 ![图片说明](https://img-ask.csdn.net/upload/201601/29/1454060895_988771.png), 出现了问题,问题如下 ![![图片说明](https://img-ask.csdn.net/upload/201601/29/1454060916_9479.png) ![图片说明](https://img-ask.csdn.net/upload/201601/29/1454060959_210537.png), 提示的是这个 make: *** [.build_release/src/caffe/layer_factory.o] 错误 1 make: *** 正在等待未完成的任务.... 我本人不太懂,请问怎么处理啊,急。。 谢谢各位
caffe 运行mnist实例出错
在使用Caffe运行mnist examples时报错,所有步骤都是按照网上步骤一步一步进行的,相当崩溃! 目前错误出现在最后一步,自己间了一个train_mnist_bat,写入 ..\..\Build\x64\Release\caffe.exe train--solver=../../examples/mnist/lenet_solver.prototxt Pause 后,双击运行,结果报错。错误如下: Unknown action: train--solver=../../examples/mnist/lenet_solver.prototxt 反复检查过路径这些,代码都是按照网上步骤撸的,就是报错训练不了,欲哭无泪啊。。。希望大神解答!DL小白跪谢!
关于window下安装caffe环境matcaffe接口的问题
按照网上的博客,配置好工程文件,然后编译libcaffe,然后再编译解决方案‘Caffe’,都没有 出错,成功了16个。但是Build/X64/Release/matcaffe/+caffe/private文件中没有生成caffe_.mexw6,文件,甚至文件夹为空。不知道这是什么情况。请大神帮忙解决。
caffe编译时出现make: protoc:命令未找到
make all -j8 时出现下面问题: ``` PROTOC src/caffe/proto/caffe.proto make: protoc:命令未找到 Makefile:629: recipe for target '.build_release/src/caffe/proto/caffe.pb.cc' failed make: *** [.build_release/src/caffe/proto/caffe.pb.cc] Error 127 make: *** 正在等待未完成的任务.... ```
在caffe安装中 make 出错 怎么解决啊
caffe make 中出现错误 LD -o .build_release/lib/libcaffe-nv.so.0.17.2 /usr/bin/ld: 找不到 -lnvidia-ml /usr/bin/ld: /usr/lib/x86_64-linux-gnu/libturbojpeg.a(libturbojpeg_la-turbojpeg.o): relocation R_X86_64_32 against `.data' can not be used when making a shared object; recompile with -fPIC /usr/lib/x86_64-linux-gnu/libturbojpeg.a: 无法添加符号: 错误的值 collect2: error: ld returned 1 exit status Makefile:601: recipe for target '.build_release/lib/libcaffe-nv.so.0.17.2' failed make: *** [.build_release/lib/libcaffe-nv.so.0.17.2] Error 1
ubuntu14 下 Caffe编译问题 出错
# .build_release/lib/libcaffe.so: undefined reference to `cudnnConvolutionBackwardData_v3'.build_release/lib/libcaffe.so: undefined reference to `cudnnConvolutionBackwardData_v3' .build_release/lib/libcaffe.so: undefined reference to `cudnnConvolutionBackwardFilter_v3' collect2: error: ld returned 1 exit status make: *** [.build_release/tools/upgrade_solver_proto_text.bin] Error 1 make: *** Waiting for unfinished jobs.... .build_release/lib/libcaffe.so: undefined reference to `cudnnConvolutionBackwardData_v3' .build_release/lib/libcaffe.so: undefined reference to `cudnnConvolutionBackwardFilter_v3' collect2: error: ld returned 1 exit status make: *** [.build_release/tools/upgrade_net_proto_binary.bin] Error 1 .build_release/lib/libcaffe.so: undefined reference to `cudnnConvolutionBackwardData_v3' .build_release/lib/libcaffe.so: undefined reference to `cudnnConvolutionBackwardFilter_v3' collect2: error: ld returned 1 exit status .build_release/lib/make: libcaffe.so: undefined reference to *** [.build_release/tools/compute_image_mean.bin] Error 1`cudnnConvolutionBackwardData_v3 ' .build_release/lib/libcaffe.so: undefined reference to `cudnnConvolutionBackwardFilter_v3' collect2: error: ld returned 1 exit status make: *** [.build_release/tools/caffe.bin] Error 1 .build_release/lib/libcaffe.so: undefined reference to `cudnnConvolutionBackwardData_v3' .build_release/lib/libcaffe.so: undefined reference to `cudnnConvolutionBackwardFilter_v3' collect2: error: ld returned 1 exit status make: *** [.build_release/examples/cifar10/convert_cifar_data.bin] Error 1 .build_release/lib/libcaffe.so: undefined reference to `cudnnConvolutionBackwardData_v3' .build_release/lib/libcaffe.so: undefined reference to `cudnnConvolutionBackwardFilter_v3' collect2: error: ld returned 1 exit status make: *** [.build_release/tools/convert_imageset.bin] Error 1 .build_release/lib/libcaffe.so: undefined reference to `cudnnConvolutionBackwardData_v3' .build_release/lib/libcaffe.so: undefined reference to `cudnnConvolutionBackwardFilter_v3' collect2: error: ld returned 1 exit status make: *** [.build_release/tools/extract_features.bin] Error 1 .build_release/lib/libcaffe.so: undefined reference to `cudnnConvolutionBackwardData_v3' .build_release/lib/libcaffe.so: undefined reference to `cudnnConvolutionBackwardFilter_v3' collect2: error: ld returned 1 exit status make: *** [.build_release/tools/upgrade_net_proto_text.bin] Error 1_**
caffe make 出错 boost重装了也没有用 求高手!支付宝发红包
sun@sunwin:/RMPE$ cp Makefile.config.example Makefile.config sun@sunwin:/RMPE$ sudo make all -j4 [sudo] sun 的密码: PROTOC src/caffe/proto/caffe.proto CXX src/caffe/blob.cpp CXX src/caffe/layer_factory.cpp CXX src/caffe/syncedmem.cpp CXX src/caffe/common.cpp CXX src/caffe/solvers/nesterov_solver.cpp In file included from /usr/local/include/boost/config.hpp:61:0, from /usr/local/include/boost/thread/detail/platform.hpp:14, from /usr/local/include/boost/thread/thread_only.hpp:12, from /usr/local/include/boost/thread/thread.hpp:12, from /usr/local/include/boost/thread.hpp:13, from src/caffe/common.cpp:1: /usr/local/include/boost/core/ignore_unused.hpp:17:19: error: ‘constexpr’ does not name a type BOOST_FORCEINLINE BOOST_CXX14_CONSTEXPR void ignore_unused(Ts const& ...) ^ /usr/local/include/boost/core/ignore_unused.hpp:17:19: note: C++11 ‘constexpr’ only available with -std=c++11 or -std=gnu++11 /usr/local/include/boost/core/ignore_unused.hpp:21:19: error: ‘constexpr’ does not name a type BOOST_FORCEINLINE BOOST_CXX14_CONSTEXPR void ignore_unused() ^ /usr/local/include/boost/core/ignore_unused.hpp:21:19: note: C++11 ‘constexpr’ only available with -std=c++11 or -std=gnu++11 In file included from /usr/local/include/boost/thread/mutex.hpp:16:0, from /usr/local/include/boost/thread/pthread/thread_data.hpp:13, from src/caffe/common.cpp:1: /usr/include/c++/5/bits/stl_pair.h:214:5: note: template argument deduction/substitution failed: In file included from /usr/local/include/boost/type_index/stl_type_index.hpp:22:0, from /usr/local/include/boost/type_index.hpp:29, from /usr/local/include/boost/function/function_base.hpp:21, from /usr/local/include/boost/function/detail/prologue.hpp:17, from /usr/local/include/boost/function/function_template.hpp:13, from /usr/local/include/boost/function/detail/maybe_include.hpp:13, from /usr/local/include/boost/function/function0.hpp:11, from /usr/local/include/boost/python/errors.hpp:13, from /usr/local/include/boost/python/handle.hpp:11, from /usr/local/include/boost/python/args_fwd.hpp:10, from /usr/local/include/boost/python/args.hpp:10, from /usr/local/include/boost/python.hpp:11, from src/caffe/layer_factory.cpp:4: /usr/local/include/boost/type_index/type_index_facade.hpp:191:25: note: ‘boost::typeindex::stl_type_index’ is not derived from ‘const std::pair<_T1, _T2>’ return Derived(lhs) == rhs; ^ src/caffe/layer_factory.cpp: In function ‘boost::shared_ptrcaffe::Layer<Dtype > caffe::GetTanHLayer(const caffe::LayerParameter&) [with Dtype = double]’: src/caffe/layer_factory.cpp:237:1: warning: control reaches end of non-void function [-Wreturn-type] } ^ src/caffe/layer_factory.cpp: In function ‘boost::shared_ptrcaffe::Layer<Dtype > caffe::GetTanHLayer(const caffe::LayerParameter&) [with Dtype = float]’: src/caffe/layer_factory.cpp: In function ‘boost::shared_ptrcaffe::Layer<Dtype > caffe::GetConvolutionLayer(const caffe::LayerParameter&) [with Dtype = double]’: src/caffe/layer_factory.cpp:71:1: warning: control reaches end of non-void function [-Wreturn-type] } ^ src/caffe/layer_factory.cpp: In function ‘boost::shared_ptrcaffe::Layer<Dtype > caffe::GetConvolutionLayer(const caffe::LayerParameter&) [with Dtype = float]’: src/caffe/layer_factory.cpp:71:1: warning: control reaches end of non-void function [-Wreturn-type] } ^ Makefile:575: recipe for target '.build_release/src/caffe/layer_factory.o' failed make: *** [.build_release/src/caffe/layer_factory.o] Error 1 Steps to reproduce If you are having difficulty building Caffe or training a model, please ask the caffe-users mailing list. If you are reporting a build error that seems to be due to a bug in Caffe, please attach your build configuration (either Makefile.config or CMakeCache.txt) and the output of the make (or cmake) command. MY system configuration Operating system: ubuntu16.04 CUDA version (if applicable):CUDA 8.0 CUDNN version (if applicable): CUDnn5.0 Python or MATLAB version (for pycaffe and matcaffe respectively):Python 2.7 MATLAB2014a 急求高手解决 ! 解决了支付宝直接发红包!
mac下安装caffe,make时遇到的问题
mac下安装caffe,make时遇到的问题 CXX/LD -o .build_release/tools/caffe.bin clang: warning: argument unused during compilation: '-pthread' Undefined symbols for architecture x86_64: "google::SetUsageMessage(std::__1::basic_string<char, std::__1::char_traits<char>, std::__1::allocator<char> > const&)", referenced from: _main in caffe.o "google::SetVersionString(std::__1::basic_string<char, std::__1::char_traits<char>, std::__1::allocator<char> > const&)", referenced from: _main in caffe.o ld: symbol(s) not found for architecture x86_64 clang: error: linker command failed with exit code 1 (use -v to see invocation) make: *** [.build_release/tools/caffe.bin] Error 1 如上,该怎么解决,谢谢
紧急求助!!ubuntu16.04 caffe make clean报错!!
我的系统ubuntu16.04,昨天make 了一下没马上清,今天开机在caffe根目录下水make clean 发现报错 rm:无法删除 ".build_release" : 不允许操作 makefile:660:recipe for target "clean" failed make:[clean] error 1 (ignored) rm:无法删除 "build ": 不允许操作 makefile:660:recipe for target "clean" failed make:[clean] error 1 (ignored) rm:无法删除 "distribute": 不允许操作 makefile:660:recipe for target "clean" failed make:[clean] error 1 (ignored) 我什么文件都没改呀!以前一直正常。 跪求各位大侠赐教!! 请问“输出目录”或“输出文件夹”在哪个位置,本人小白请楼下大侠指点,多谢!
caffe如何对同一个blob内部数据进行操作?
例如,输入blob为A,大小为1×1×32×96,对A进行行间逐项递减,输出blob为B,大小为1×1×32×94的blob,B[1, 1, i, j] = A[1, 1, i, j+1] - A[1, 1, i, j-1]
关于caffe修改源码和编译的疑问
配置完caffe之后,最近想做一件事情,就是我想对制作lmdb文件的过程做一点修改,所以我打算改一下原来的convert_imageset.cpp文件,并重新编译生成可执行文件convert_imageset。 首先,我尝试着用: g++ convert_imageset.cpp -o convert_imageset 编译,这时候终端提醒的错误是: convert_imageset.cpp:22:29: fatal error: caffe/util/db.hpp: 没有那个文件或目录 #include "caffe/util/db.hpp" 意识到是头文件的问题,那我就重新试了一下: g++ convert_imageset.cpp -o convert_imageset -I/home/lichenyang/caffe/include 结果出现了下面的错误: /home/lichenyang/caffe/include/caffe/util/device_alternate.hpp:34:23: fatal error: cublas_v2.h: 没有那个文件或目录 #include <cublas_v2.h> 这个我估计是CPU和GPU的问题。 我的显卡是A卡,当时在配置caffe的时候修改了Makefile.config,将CPU_ONLY := 1的注释去掉了,caffe的配置也没有出错。 所以我的疑问是:如果我想对caffe的某个.cpp文件进行修改(比如:convert_imageset.cpp),那么我在修改完成之后,应该如何正确变编译出可执行文件?有没有大神能够指点一下,或者提供一下这方面的博文,感激不尽!
caffe安装中出现msb4062
错误 1 error MSB4062: 未能从程序集 E:\caffe\caffe-master\NugetPackages\OpenCV.2.4.10\build\native\\private\coapp.NuGetNativeMSBuildTasks.dll 加载任务“NuGetPackageOverlay”。未能加载文件或程序集“file:///E:\caffe\caffe-master\NugetPackages\OpenCV.2.4.10\build\native\private\coapp.NuGetNativeMSBuildTasks.dll”或它的某一个依赖项。系统找不到指定的文件。 请确认 <UsingTask> 声明正确,该程序集及其所有依赖项都可用,并且该任务包含实现 Microsoft.Build.Framework.ITask 的公共类。 E:\caffe\caffe-master\NugetPackages\OpenCV.2.4.10\build\native\OpenCV.targets 772 5 libcaffe 全是这一个问题,有解决的方法么?谢谢!
windows 编译配置caffe 出错
版本:Windows 10 Visual Studio 2013 Matlab R2016b CUDA 8.0.44 cuDNN v4 步骤按照 http://blog.csdn.net/lk274857347/article/details/53588049 这个博主的教程来的 在4.7编译那一步的时候,出现了这个错误:error msb4030: "否" 对于"CL"任务中的 "TreatWarningAsError" 参数是一个无效值 - 另外原教程中的Anaconda我没下载,因为是新手不太懂,而且看后面没有用到就没有下载 请教大神们,本例中msb4030的错误该怎么解决呢? 非常感谢!!!
爬虫福利二 之 妹子图网MM批量下载
爬虫福利一:27报网MM批量下载    点击 看了本文,相信大家对爬虫一定会产生强烈的兴趣,激励自己去学习爬虫,在这里提前祝:大家学有所成! 目标网站:妹子图网 环境:Python3.x 相关第三方模块:requests、beautifulsoup4 Re:各位在测试时只需要将代码里的变量 path 指定为你当前系统要保存的路径,使用 python xxx.py 或IDE运行即可。
字节跳动视频编解码面经
引言 本文主要是记录一下面试字节跳动的经历。 三四月份投了字节跳动的实习(图形图像岗位),然后hr打电话过来问了一下会不会opengl,c++,shador,当时只会一点c++,其他两个都不会,也就直接被拒了。 七月初内推了字节跳动的提前批,因为内推没有具体的岗位,hr又打电话问要不要考虑一下图形图像岗,我说实习投过这个岗位不合适,不会opengl和shador,然后hr就说秋招更看重基础。我当时
开源一个功能完整的SpringBoot项目框架
福利来了,给大家带来一个福利。 最近想了解一下有关Spring Boot的开源项目,看了很多开源的框架,大多是一些demo或者是一个未成形的项目,基本功能都不完整,尤其是用户权限和菜单方面几乎没有完整的。 想到我之前做的框架,里面通用模块有:用户模块,权限模块,菜单模块,功能模块也齐全了,每一个功能都是完整的。 打算把这个框架分享出来,供大家使用和学习。 为什么用框架? 框架可以学习整体
小白如何学习java?
在博主认为,对于入门级学习java的最佳学习方法莫过于视频+博客+书籍+总结,前三者博主将淋漓尽致地挥毫于这篇博客文章中,至于总结在于个人,实际上越到后面你会发现学习的最好方式就是阅读参考官方文档其次就是国内的书籍,博客次之,这又是一个层次了,这里暂时不提后面再谈。博主将为各位入门java保驾护航,各位只管冲鸭!!!上天是公平的,只要不辜负时间,时间自然不会辜负你。 何谓学习?博主所理解的学习,它
程序员必须掌握的核心算法有哪些?
由于我之前一直强调数据结构以及算法学习的重要性,所以就有一些读者经常问我,数据结构与算法应该要学习到哪个程度呢?,说实话,这个问题我不知道要怎么回答你,主要取决于你想学习到哪些程度,不过针对这个问题,我稍微总结一下我学过的算法知识点,以及我觉得值得学习的算法。这些算法与数据结构的学习大多数是零散的,并没有一本把他们全部覆盖的书籍。下面是我觉得值得学习的一些算法以及数据结构,当然,我也会整理一些看过
程序员接私活怎样防止做完了不给钱?
首先跟大家说明一点,我们做 IT 类的外包开发,是非标品开发,所以很有可能在开发过程中会有这样那样的需求修改,而这种需求修改很容易造成扯皮,进而影响到费用支付,甚至出现做完了项目收不到钱的情况。 那么,怎么保证自己的薪酬安全呢? 我们在开工前,一定要做好一些证据方面的准备(也就是“讨薪”的理论依据),这其中最重要的就是需求文档和验收标准。一定要让需求方提供这两个文档资料作为开发的基础。之后开发
Python十大装B语法
Python 是一种代表简单思想的语言,其语法相对简单,很容易上手。不过,如果就此小视 Python 语法的精妙和深邃,那就大错特错了。本文精心筛选了最能展现 Python 语法之精妙的十个知识点,并附上详细的实例代码。如能在实战中融会贯通、灵活使用,必将使代码更为精炼、高效,同时也会极大提升代码B格,使之看上去更老练,读起来更优雅。 1. for - else 什么?不是 if 和 else 才
数据库优化 - SQL优化
前面一篇文章从实例的角度进行数据库优化,通过配置一些参数让数据库性能达到最优。但是一些“不好”的SQL也会导致数据库查询变慢,影响业务流程。本文从SQL角度进行数据库优化,提升SQL运行效率。 判断问题SQL 判断SQL是否有问题时可以通过两个表象进行判断: 系统级别表象 CPU消耗严重 IO等待严重 页面响应时间过长
2019年11月中国大陆编程语言排行榜
2019年11月2日,我统计了某招聘网站,获得有效程序员招聘数据9万条。针对招聘信息,提取编程语言关键字,并统计如下: 编程语言比例 rank pl_ percentage 1 java 33.62% 2 c/c++ 16.42% 3 c_sharp 12.82% 4 javascript 12.31% 5 python 7.93% 6 go 7.25% 7
通俗易懂地给女朋友讲:线程池的内部原理
餐厅的约会 餐盘在灯光的照耀下格外晶莹洁白,女朋友拿起红酒杯轻轻地抿了一小口,对我说:“经常听你说线程池,到底线程池到底是个什么原理?”我楞了一下,心里想女朋友今天是怎么了,怎么突然问出这么专业的问题,但做为一个专业人士在女朋友面前也不能露怯啊,想了一下便说:“我先给你讲讲我前同事老王的故事吧!” 大龄程序员老王 老王是一个已经北漂十多年的程序员,岁数大了,加班加不动了,升迁也无望,于是拿着手里
经典算法(5)杨辉三角
杨辉三角 是经典算法,这篇博客对它的算法思想进行了讲解,并有完整的代码实现。
腾讯算法面试题:64匹马8个跑道需要多少轮才能选出最快的四匹?
昨天,有网友私信我,说去阿里面试,彻底的被打击到了。问了为什么网上大量使用ThreadLocal的源码都会加上private static?他被难住了,因为他从来都没有考虑过这个问题。无独有偶,今天笔者又发现有网友吐槽了一道腾讯的面试题,我们一起来看看。 腾讯算法面试题:64匹马8个跑道需要多少轮才能选出最快的四匹? 在互联网职场论坛,一名程序员发帖求助到。二面腾讯,其中一个算法题:64匹
面试官:你连RESTful都不知道我怎么敢要你?
面试官:了解RESTful吗? 我:听说过。 面试官:那什么是RESTful? 我:就是用起来很规范,挺好的 面试官:是RESTful挺好的,还是自我感觉挺好的 我:都挺好的。 面试官:… 把门关上。 我:… 要干嘛?先关上再说。 面试官:我说出去把门关上。 我:what ?,夺门而去 文章目录01 前言02 RESTful的来源03 RESTful6大原则1. C-S架构2. 无状态3.统一的接
为啥国人偏爱Mybatis,而老外喜欢Hibernate/JPA呢?
关于SQL和ORM的争论,永远都不会终止,我也一直在思考这个问题。昨天又跟群里的小伙伴进行了一番讨论,感触还是有一些,于是就有了今天这篇文。 声明:本文不会下关于Mybatis和JPA两个持久层框架哪个更好这样的结论。只是摆事实,讲道理,所以,请各位看官勿喷。 一、事件起因 关于Mybatis和JPA孰优孰劣的问题,争论已经很多年了。一直也没有结论,毕竟每个人的喜好和习惯是大不相同的。我也看
SQL-小白最佳入门sql查询一
一 说明 如果是初学者,建议去网上寻找安装Mysql的文章安装,以及使用navicat连接数据库,以后的示例基本是使用mysql数据库管理系统; 二 准备前提 需要建立一张学生表,列分别是id,名称,年龄,学生信息;本示例中文章篇幅原因SQL注释略; 建表语句: CREATE TABLE `student` ( `id` int(11) NOT NULL AUTO_INCREMENT, `
项目中的if else太多了,该怎么重构?
介绍 最近跟着公司的大佬开发了一款IM系统,类似QQ和微信哈,就是聊天软件。我们有一部分业务逻辑是这样的 if (msgType = "文本") { // dosomething } else if(msgType = "图片") { // doshomething } else if(msgType = "视频") { // doshomething } else { // dosho
致 Python 初学者
文章目录1. 前言2. 明确学习目标,不急于求成,不好高骛远3. 在开始学习 Python 之前,你需要做一些准备2.1 Python 的各种发行版2.2 安装 Python2.3 选择一款趁手的开发工具3. 习惯使用IDLE,这是学习python最好的方式4. 严格遵从编码规范5. 代码的运行、调试5. 模块管理5.1 同时安装了py2/py35.2 使用Anaconda,或者通过IDE来安装模
“狗屁不通文章生成器”登顶GitHub热榜,分分钟写出万字形式主义大作
一、垃圾文字生成器介绍 最近在浏览GitHub的时候,发现了这样一个骨骼清奇的雷人项目,而且热度还特别高。 项目中文名:狗屁不通文章生成器 项目英文名:BullshitGenerator 根据作者的介绍,他是偶尔需要一些中文文字用于GUI开发时测试文本渲染,因此开发了这个废话生成器。但由于生成的废话实在是太过富于哲理,所以最近已经被小伙伴们给玩坏了。 他的文风可能是这样的: 你发现,...
程序员:我终于知道post和get的区别
是一个老生常谈的话题,然而随着不断的学习,对于以前的认识有很多误区,所以还是需要不断地总结的,学而时习之,不亦说乎
羞,Java 字符串拼接竟然有这么多姿势
二哥,我今年大二,看你分享的《阿里巴巴 Java 开发手册》上有一段内容说:“循环体内,拼接字符串最好使用 StringBuilder 的 append 方法,而不是 + 号操作符。”到底为什么啊,我平常一直就用的‘+’号操作符啊!二哥有空的时候能否写一篇文章分析一下呢? 就在昨天,一位叫小菜的读者微信我说了上面这段话。 我当时看到这条微信的第一感觉是:小菜你也太菜了吧,这都不知道为啥啊!我估
"狗屁不通文章生成器"登顶GitHub热榜,分分钟写出万字形式主义大作
GitHub 被誉为全球最大的同性交友网站,……,陪伴我们已经走过 10+ 年时间,它托管了大量的软件代码,同时也承载了程序员无尽的欢乐。 万字申请,废话报告,魔幻形式主义大作怎么写?兄dei,狗屁不通文章生成器了解一下。这个富有灵魂的项目名吸引了众人的目光。项目仅仅诞生一周,便冲上了GitHub趋势榜榜首(Js中文网 -前端进阶资源教程)、是榜首哦
推荐几款比较实用的工具,网站
1.盘百度PanDownload   这个云盘工具是免费的,可以进行资源搜索,提速(偶尔会抽风......) 不要去某站买付费的......   PanDownload下载地址   2.BeJSON 这是一款拥有各种在线工具的网站,推荐它的主要原因是网站简洁,功能齐全,广告相比其他广告好太多了     bejson网站   3.二维码美化 这个网站的二维码美化很好看,网站界面
《程序人生》系列-这个程序员只用了20行代码就拿了冠军
你知道的越多,你不知道的越多 点赞再看,养成习惯GitHub上已经开源https://github.com/JavaFamily,有一线大厂面试点脑图,欢迎Star和完善 前言 这一期不算《吊打面试官》系列的,所有没前言我直接开始。 絮叨 本来应该是没有这期的,看过我上期的小伙伴应该是知道的嘛,双十一比较忙嘛,要值班又要去帮忙拍摄年会的视频素材,还得搞个程序员一天的Vlog,还要写BU...
程序员把地府后台管理系统做出来了,还有3.0版本!12月7号最新消息:已在开发中有github地址
第一幕:缘起 听说阎王爷要做个生死簿后台管理系统,我们派去了一个程序员…… 996程序员做的梦: 第一场:团队招募 为了应对地府管理危机,阎王打算找“人”开发一套地府后台管理系统,于是就在地府总经办群中发了项目需求。 话说还是中国电信的信号好,地府都是满格,哈哈!!! 经常会有外行朋友问:看某网站做的不错,功能也简单,你帮忙做一下? 而这次,面对这样的需求,这个程序员...
网易云6亿用户音乐推荐算法
网易云音乐是音乐爱好者的集聚地,云音乐推荐系统致力于通过 AI 算法的落地,实现用户千人千面的个性化推荐,为用户带来不一样的听歌体验。 本次分享重点介绍 AI 算法在音乐推荐中的应用实践,以及在算法落地过程中遇到的挑战和解决方案。 将从如下两个部分展开: AI算法在音乐推荐中的应用 音乐场景下的 AI 思考 从 2013 年 4 月正式上线至今,网易云音乐平台持续提供着:乐屏社区、UGC...
8年经验面试官详解 Java 面试秘诀
作者 |胡书敏 责编 | 刘静 出品 | CSDN(ID:CSDNnews) 本人目前在一家知名外企担任架构师,而且最近八年来,在多家外企和互联网公司担任Java技术面试官,前后累计面试了有两三百位候选人。在本文里,就将结合本人的面试经验,针对Java初学者、Java初级开发和Java开发,给出若干准备简历和准备面试的建议。 Java程序员准备和投递简历的实...
面试官如何考察你的思维方式?
1.两种思维方式在求职面试中,经常会考察这种问题:北京有多少量特斯拉汽车?某胡同口的煎饼摊一年能卖出多少个煎饼?深圳有多少个产品经理?一辆公交车里能装下多少个乒乓球?一个正常成年人有多少根头发?这类估算问题,被称为费米问题,是以科学家费米命名的。为什么面试会问这种问题呢?这类问题能把两类人清楚地区分出来。一类是具有文科思维的人,擅长赞叹和模糊想象,它主要依靠的是人的第一反应和直觉,比如小孩...
碎片化的时代,如何学习
今天周末,和大家聊聊学习这件事情。 在如今这个社会,我们的时间被各类 APP 撕的粉碎。 刷知乎、刷微博、刷朋友圈; 看论坛、看博客、看公号; 等等形形色色的信息和知识获取方式一个都不错过。 貌似学了很多,但是却感觉没什么用。 要解决上面这些问题,首先要分清楚一点,什么是信息,什么是知识。 那什么是信息呢? 你一切听到的、看到的,都是信息,比如微博上的明星出轨、微信中的表情大战、抖音上的段子
so easy! 10行代码写个"狗屁不通"文章生成器
前几天,GitHub 有个开源项目特别火,只要输入标题就可以生成一篇长长的文章。 背后实现代码一定很复杂吧,里面一定有很多高深莫测的机器学习等复杂算法 不过,当我看了源代码之后 这程序不到50行 尽管我有多年的Python经验,但我竟然一时也没有看懂 当然啦,原作者也说了,这个代码也是在无聊中诞生的,平时撸码是不写中文变量名的, 中文...
知乎高赞:中国有什么拿得出手的开源软件产品?(整理自本人原创回答)
知乎高赞:中国有什么拿得出手的开源软件产品? 在知乎上,有个问题问“中国有什么拿得出手的开源软件产品(在 GitHub 等社区受欢迎度较好的)?” 事实上,还不少呢~ 本人于2019.7.6进行了较为全面的回答,对这些受欢迎的 Github 开源项目分类整理如下: 分布式计算、云平台相关工具类 1.SkyWalking,作者吴晟、刘浩杨 等等 仓库地址: apache/skywalking 更...
相关热词 如何提升c#开发能力 矩阵乘法c# c#调用谷歌浏览器 c# 去空格去转义符 c#用户登录窗体代码 c# 流 c# linux 可视化 c# mvc 返回图片 c# 像素空间 c# 日期 最后一天
立即提问

相似问题

3
【caffe例子问题】 net_->num_inputs() 为0
1
ninja 和 VS2015编译caffe-windows失败
1
ubantu在IDE中运行caffe-ssd报错, invalid pointer 但是使用终端可以运行
1
caffe2多次载入模型问题,在django后端中每次有用户访问时载入一个模型,第一个可以,之后报错
1
关于window下安装caffe环境matcaffe接口的问题
0
win7 编译caffe报错,搞了一天了,请大牛赐教
1
caffe编译完成 想要打开的时候出错:提示libcaffe.lib该文件没有与之关联的应用来执行该操作
1
我在使用caffe进行训练的时候在未耗尽显存的情况下显示显存溢出
2
Ubuntu配置caffe执行make all命令报错(各位大哥 救救孩子吧~~折腾一整天了)
1
ubuntu16.04安装openpose编译出现错误/libopenpose.so.1.4.0:对‘caffe::Net未定义的引用
3
C++开发图像分类、分割、检测软件,用caffe,caffe2,pytouch哪个框架好
0
在caffe安装中 make 出错 怎么解决啊
0
caffe 配置 make、make test 通过,但是make runtest报错
1
win10系统,py_faster_rcnn用caffe训练时出现check failure stack trace请问这是什么问题?
1
1机多卡的2080TI显卡在Caffe 、Mxnet、Tensorflow等框架下无法实现多GPU加速
2
caffe编译报错求助!!!
1
caffe编译报错求助!!
2
python配置caffe,vs编译caffe遇到error
1
caffe-ssd在create_data.sh的时候报错No module named numpy,可是我已经有了numpy啊!
0
用VS对caffe生成解决方案的时候不能生成object