Ubuntu19.04 安装 libpng12-0 出错

在安装xfce桌面时,出现缺少依赖问题.

yh@yh-virtual-machine:~$ sudo apt install xfce4
正在读取软件包列表... 完成
正在分析软件包的依赖关系树       
正在读取状态信息... 完成       
xfce4 已经是最新版 (4.12.2)。
您也许需要运行“apt --fix-broken install”来修正上面的错误。
下列软件包有未满足的依赖关系:
 tumbler : 依赖: libpng12-0 (>= 1.2.13-4) 但是它将不会被安装
E: 有未能满足的依赖关系。请尝试不指明软件包的名字来运行“apt --fix-broken install”(也可以指定一个解决办法)。

然而当我尝试安装这个包时。。。

yh@yh-virtual-machine:~$ sudo apt-get install libpng12-0
正在读取软件包列表... 完成
正在分析软件包的依赖关系树       
正在读取状态信息... 完成       
下列【新】软件包将被安装:
  libpng12-0
升级了 0 个软件包,新安装了 1 个软件包,要卸载 0 个软件包,有 3 个软件包未被升级。
有 4 个软件包没有被完全安装或卸载。
需要下载 0 B/116 kB 的归档。
解压缩后会消耗 285 kB 的额外空间。
(正在读取数据库 ... 系统当前共安装有 156022 个文件和目录。)
准备解压 .../libpng12-0_1.2.54-1ubuntu1.1_amd64.deb  ...
正在解压 libpng12-0:amd64 (1.2.54-1ubuntu1.1) ...
dpkg: 处理归档 /var/cache/apt/archives/libpng12-0_1.2.54-1ubuntu1.1_amd64.deb (--unpack)时出错:
 无法安装 /lib/x86_64-linux-gnu/libpng12.so.0 的新版本: 没有那个文件或目录
错误信息显示本地系统有一些问题,因此没有写入 apport 报告
                                                        在处理时有错误发生:
 /var/cache/apt/archives/libpng12-0_1.2.54-1ubuntu1.1_amd64.deb
E: Sub-process /usr/bin/dpkg returned an error code (1)

有没有大佬提示一下,如何解决这个问题

Csdn user default icon
上传中...
上传图片
插入图片
抄袭、复制答案,以达到刷声望分或其他目的的行为,在CSDN问答是严格禁止的,一经发现立刻封号。是时候展现真正的技术了!
其他相关推荐
ubuntu 19.04 遇到了libpng12.so.0 导致无法apt 更新
我用的是ubuntu 19.04 遇到了libpng12.so.0 的问题 ``` sudo dpkg -i libpng12-0_1.2.54-1ubuntu1.1_amd64.deb (正在读取数据库 ... 系统当前共安装有 176372 个文件和目录。) 准备解压 libpng12-0_1.2.54-1ubuntu1.1_amd64.deb ... 正在解压 libpng12-0:amd64 (1.2.54-1ubuntu1.1) ... dpkg: 处理归档 libpng12-0_1.2.54-1ubuntu1.1_amd64.deb (--install)时出错: 无法安装 /lib/x86_64-linux-gnu/libpng12.so.0 的新版本: 没有那个文件或目录 正在处理用于 libc-bin (2.29-0ubuntu2) 的触发器 ... 在处理时有错误发生: libpng12-0_1.2.54-1ubuntu1.1_amd64.deb ``` 于是我便下载了一下个 ``` sudo cp out/lib/x86_64-linux-gnu/libpng12.so.0 /lib/x86_64-linux-gnu/ ``` 确定目录下面有 ``` ls -alh /lib/x86_64-linux-gnu/libpng1* -rw-r--r-- 1 root root 147K Oct 10 13:56 /lib/x86_64-linux-gnu/libpng12.so.0 lrwxrwxrwx 1 root root 19 Jul 30 01:29 /lib/x86_64-linux-gnu/libpng16.so.16 -> libpng16.so.16.36.0 -rw-r--r-- 1 root root 214K Apr 8 2019 /lib/x86_64-linux-gnu/libpng16.so.16.36.0 ``` 然后我再运行 ``` sudo apt --fix-broken install 正在读取软件包列表... 完成 正在分析软件包的依赖关系树 正在读取状态信息... 完成 正在修复依赖关系... 完成 将会同时安装下列软件: libpng12-0 下列【新】软件包将被安装: libpng12-0 升级了 0 个软件包,新安装了 1 个软件包,要卸载 0 个软件包,有 0 个软件包未被升级。 有 3 个软件包没有被完全安装或卸载。 需要下载 0 B/118 kB 的归档。 解压缩后会消耗 313 kB 的额外空间。 您希望继续执行吗? [Y/n] y (正在读取数据库 ... 系统当前共安装有 176372 个文件和目录。) 准备解压 .../libpng12-0_1.2.50-1ubuntu2.14.04.3_amd64.deb ... 正在解压 libpng12-0:amd64 (1.2.50-1ubuntu2.14.04.3) ... dpkg: 处理归档 /var/cache/apt/archives/libpng12-0_1.2.50-1ubuntu2.14.04.3_amd64.deb (--unpack)时出错: 无法安装 /lib/x86_64-linux-gnu/libpng12.so.0 的新版本: 没有那个文件或目录 错误信息显示本地系统有一些问题,因此没有写入 apport 报告 在处理时有错误发生: /var/cache/apt/archives/libpng12-0_1.2.50-1ubuntu2.14.04.3_amd64.deb E: Sub-process /usr/bin/dpkg returned an error code (1) ``` 然后还是报了没有 /lib/x86_64-linux-gnu/libpng12.so.0 这个文件 然后我就不知道为什么会被自动删除 > ``` ls -alh /lib/x86_64-linux-gnu/libpng1* lrwxrwxrwx 1 root root 19 Jul 30 01:29 /lib/x86_64-linux-gnu/libpng16.so.16 -> libpng16.so.16.36.0 -rw-r--r-- 1 root root 214K Apr 8 2019 /lib/x86_64-linux-gnu/libpng16.so.16.36.0 ``` 这是服务端的信息 ``` uname -a Linux itanzi-OptiPlex-7060 5.0.0-21-generic #22-Ubuntu SMP Tue Jul 2 13:27:33 UTC 2019 x86_64 x86_64 x86_64 GNU/Linux lsb_release -a No LSB modules are available. Distributor ID: Ubuntu Description: Ubuntu 19.04 Release: 19.04 Codename: disco ```
ubuntu16.04安装opencv时,make不通过该怎么办?
cmake已经完成,情况如下: ``` cmake .. -- Detected version of GNU GCC: 54 (504) -- Found ZLIB: /usr/lib/x86_64-linux-gnu/libz.so (found suitable version "1.2.8", minimum required is "1.2.3") -- Found ZLIB: /usr/lib/x86_64-linux-gnu/libz.so (found version "1.2.8") -- Checking for module 'gstreamer-base-1.0' -- No package 'gstreamer-base-1.0' found -- Checking for module 'gstreamer-video-1.0' -- No package 'gstreamer-video-1.0' found -- Checking for module 'gstreamer-app-1.0' -- No package 'gstreamer-app-1.0' found -- Checking for module 'gstreamer-riff-1.0' -- No package 'gstreamer-riff-1.0' found -- Checking for module 'gstreamer-pbutils-1.0' -- No package 'gstreamer-pbutils-1.0' found -- Checking for module 'gstreamer-base-0.10' -- No package 'gstreamer-base-0.10' found -- Checking for module 'gstreamer-video-0.10' -- No package 'gstreamer-video-0.10' found -- Checking for module 'gstreamer-app-0.10' -- No package 'gstreamer-app-0.10' found -- Checking for module 'gstreamer-riff-0.10' -- No package 'gstreamer-riff-0.10' found -- Checking for module 'gstreamer-pbutils-0.10' -- No package 'gstreamer-pbutils-0.10' found -- Looking for linux/videodev.h -- Looking for linux/videodev.h - not found -- Looking for linux/videodev2.h -- Looking for linux/videodev2.h - found -- Looking for sys/videoio.h -- Looking for sys/videoio.h - not found -- Checking for module 'libavresample' -- No package 'libavresample' found -- Looking for libavformat/avformat.h -- Looking for libavformat/avformat.h - found -- Looking for ffmpeg/avformat.h -- Looking for ffmpeg/avformat.h - not found -- Checking for module 'libgphoto2' -- No package 'libgphoto2' found -- found IPP (ICV version): 9.0.1 [9.0.1] -- at: /home/quxutao/opencv-3.1.0/3rdparty/ippicv/unpack/ippicv_lnx -- CUDA detected: 7.5 -- CUDA NVCC target flags: -gencode;arch=compute_20,code=sm_20;-gencode;arch=compute_20,code=sm_21;-gencode;arch=compute_30,code=sm_30;-gencode;arch=compute_35,code=sm_35;-gencode;arch=compute_30,code=compute_30 -- Could NOT find Doxygen (missing: DOXYGEN_EXECUTABLE) -- To enable PlantUML support, set PLANTUML_JAR environment variable or pass -DPLANTUML_JAR=<filepath> option to cmake -- Could NOT find PythonInterp: Found unsuitable version "1.4", but required is at least "2.7" (found /home/quxutao/.virtualenvs/cv/bin/python) -- Could NOT find PythonInterp: Found unsuitable version "1.4", but required is at least "2.6" (found /home/quxutao/.virtualenvs/cv/bin/python) -- Could NOT find PythonInterp: Found unsuitable version "1.4", but required is at least "3.4" (found /home/quxutao/.virtualenvs/cv/bin/python) -- Could NOT find PythonInterp: Found unsuitable version "1.4", but required is at least "3.2" (found /home/quxutao/.virtualenvs/cv/bin/python) -- Could NOT find JNI (missing: JAVA_INCLUDE_PATH JAVA_INCLUDE_PATH2 JAVA_AWT_INCLUDE_PATH) -- Could NOT find Matlab (missing: MATLAB_MEX_SCRIPT MATLAB_INCLUDE_DIRS MATLAB_ROOT_DIR MATLAB_LIBRARIES MATLAB_LIBRARY_DIRS MATLAB_MEXEXT MATLAB_ARCH MATLAB_BIN) -- VTK is not found. Please set -DVTK_DIR in CMake to VTK build directory, or to VTK install subdirectory with VTKConfig.cmake file -- Caffe: NO -- Protobuf: YES -- Glog: NO -- HDF5: YES -- Module opencv_sfm disabled because the following dependencies are not found: Eigen Glog/Gflags -- Tesseract: NO -- HDF5: YES -- Build libprotobuf from sources: -- The protocol buffer compiler not found -- Tesseract: NO -- -- General configuration for OpenCV 3.1.0 ===================================== -- Version control: unknown -- -- Platform: -- Host: Linux 4.15.0-47-generic x86_64 -- CMake: 3.5.1 -- CMake generator: Unix Makefiles -- CMake build tool: /usr/bin/make -- Configuration: RELEASE -- -- C/C++: -- Built as dynamic libs?: YES -- C++ Compiler: /usr/bin/c++ (ver 5.4.0) -- C++ flags (Release): -fsigned-char -W -Wall -Werror=return-type -Werror=non-virtual-dtor -Werror=address -Werror=sequence-point -Wformat -Werror=format-security -Wmissing-declarations -Wundef -Winit-self -Wpointer-arith -Wshadow -Wsign-promo -Wno-narrowing -Wno-delete-non-virtual-dtor -fdiagnostics-show-option -Wno-long-long -pthread -fomit-frame-pointer -msse -msse2 -mno-avx -msse3 -mno-ssse3 -mno-sse4.1 -mno-sse4.2 -ffunction-sections -fvisibility=hidden -fvisibility-inlines-hidden -O3 -DNDEBUG -DNDEBUG -- C++ flags (Debug): -fsigned-char -W -Wall -Werror=return-type -Werror=non-virtual-dtor -Werror=address -Werror=sequence-point -Wformat -Werror=format-security -Wmissing-declarations -Wundef -Winit-self -Wpointer-arith -Wshadow -Wsign-promo -Wno-narrowing -Wno-delete-non-virtual-dtor -fdiagnostics-show-option -Wno-long-long -pthread -fomit-frame-pointer -msse -msse2 -mno-avx -msse3 -mno-ssse3 -mno-sse4.1 -mno-sse4.2 -ffunction-sections -fvisibility=hidden -fvisibility-inlines-hidden -g -O0 -DDEBUG -D_DEBUG -- C Compiler: /usr/bin/cc -- C flags (Release): -fsigned-char -W -Wall -Werror=return-type -Werror=non-virtual-dtor -Werror=address -Werror=sequence-point -Wformat -Werror=format-security -Wmissing-declarations -Wmissing-prototypes -Wstrict-prototypes -Wundef -Winit-self -Wpointer-arith -Wshadow -Wno-narrowing -fdiagnostics-show-option -Wno-long-long -pthread -fomit-frame-pointer -msse -msse2 -mno-avx -msse3 -mno-ssse3 -mno-sse4.1 -mno-sse4.2 -ffunction-sections -fvisibility=hidden -O3 -DNDEBUG -DNDEBUG -- C flags (Debug): -fsigned-char -W -Wall -Werror=return-type -Werror=non-virtual-dtor -Werror=address -Werror=sequence-point -Wformat -Werror=format-security -Wmissing-declarations -Wmissing-prototypes -Wstrict-prototypes -Wundef -Winit-self -Wpointer-arith -Wshadow -Wno-narrowing -fdiagnostics-show-option -Wno-long-long -pthread -fomit-frame-pointer -msse -msse2 -mno-avx -msse3 -mno-ssse3 -mno-sse4.1 -mno-sse4.2 -ffunction-sections -fvisibility=hidden -g -O0 -DDEBUG -D_DEBUG -- Linker flags (Release): -- Linker flags (Debug): -- Precompiled headers: YES -- Extra dependencies: /usr/lib/x86_64-linux-gnu/libpng.so /usr/lib/x86_64-linux-gnu/libtiff.so /usr/lib/x86_64-linux-gnu/libjasper.so /usr/lib/x86_64-linux-gnu/libjpeg.so gtk-3 gdk-3 pangocairo-1.0 pango-1.0 atk-1.0 cairo-gobject cairo gdk_pixbuf-2.0 gio-2.0 gobject-2.0 gthread-2.0 glib-2.0 dc1394 v4l1 v4l2 avcodec-ffmpeg avformat-ffmpeg avutil-ffmpeg swscale-ffmpeg /usr/lib/x86_64-linux-gnu/libbz2.so /usr/lib/x86_64-linux-gnu/hdf5/openmpi/lib/libhdf5.so /usr/lib/x86_64-linux-gnu/libsz.so /usr/lib/x86_64-linux-gnu/libz.so /usr/lib/x86_64-linux-gnu/libdl.so /usr/lib/x86_64-linux-gnu/libm.so dl m pthread rt cudart nppc nppi npps cufft -L/usr/lib/x86_64-linux-gnu -- 3rdparty dependencies: libwebp IlmImf libprotobuf -- -- OpenCV modules: -- To be built: cudev core cudaarithm flann hdf imgproc ml reg surface_matching video cudabgsegm cudafilters cudaimgproc cudawarping dnn fuzzy imgcodecs photo shape videoio cudacodec highgui objdetect plot ts xobjdetect xphoto bgsegm bioinspired dpm face features2d line_descriptor saliency text calib3d ccalib cudafeatures2d cudalegacy cudaobjdetect cudaoptflow cudastereo datasets rgbd stereo structured_light superres tracking videostab xfeatures2d ximgproc aruco optflow stitching -- Disabled: world contrib_world -- Disabled by dependency: - -- Unavailable: java python2 python3 viz cvv matlab sfm -- -- GUI: -- QT: NO -- GTK+ 3.x: YES (ver 3.18.9) -- GThread : YES (ver 2.48.2) -- GtkGlExt: NO -- OpenGL support: NO -- VTK support: NO -- -- Media I/O: -- ZLib: /usr/lib/x86_64-linux-gnu/libz.so (ver 1.2.8) -- JPEG: /usr/lib/x86_64-linux-gnu/libjpeg.so (ver ) -- WEBP: build (ver 0.3.1) -- PNG: /usr/lib/x86_64-linux-gnu/libpng.so (ver 1.2.54) -- TIFF: /usr/lib/x86_64-linux-gnu/libtiff.so (ver 42 - 4.0.6) -- JPEG 2000: /usr/lib/x86_64-linux-gnu/libjasper.so (ver 1.900.1) -- OpenEXR: build (ver 1.7.1) -- GDAL: NO -- -- Video I/O: -- DC1394 1.x: NO -- DC1394 2.x: YES (ver 2.2.4) -- FFMPEG: YES -- codec: YES (ver 56.60.100) -- format: YES (ver 56.40.101) -- util: YES (ver 54.31.100) -- swscale: YES (ver 3.1.101) -- resample: NO -- gentoo-style: YES -- GStreamer: NO -- OpenNI: NO -- OpenNI PrimeSensor Modules: NO -- OpenNI2: NO -- PvAPI: NO -- GigEVisionSDK: NO -- UniCap: NO -- UniCap ucil: NO -- V4L/V4L2: Using libv4l1 (ver 1.10.0) / libv4l2 (ver 1.10.0) -- XIMEA: NO -- Xine: NO -- gPhoto2: NO -- -- Parallel framework: pthreads -- -- Other third-party libraries: -- Use IPP: 9.0.1 [9.0.1] -- at: /home/quxutao/opencv-3.1.0/3rdparty/ippicv/unpack/ippicv_lnx -- Use IPP Async: NO -- Use VA: NO -- Use Intel VA-API/OpenCL: NO -- Use Eigen: NO -- Use Cuda: YES (ver 7.5) -- Use OpenCL: YES -- Use custom HAL: NO -- -- NVIDIA CUDA -- Use CUFFT: YES -- Use CUBLAS: NO -- USE NVCUVID: NO -- NVIDIA GPU arch: 20 21 30 35 -- NVIDIA PTX archs: 30 -- Use fast math: NO -- -- OpenCL: -- Version: dynamic -- Include path: /home/quxutao/opencv-3.1.0/3rdparty/include/opencl/1.2 -- Use AMDFFT: NO -- Use AMDBLAS: NO -- -- Python 2: -- Interpreter: NO -- -- Python 3: -- Interpreter: NO -- -- Python (for build): NO -- -- Java: -- ant: NO -- JNI: NO -- Java wrappers: NO -- Java tests: NO -- -- Matlab: Matlab not found or implicitly disabled -- -- Documentation: -- Doxygen: NO -- PlantUML: NO -- -- Tests and samples: -- Tests: YES -- Performance tests: YES -- C/C++ Examples: YES -- -- Install path: /usr/local -- -- cvconfig.h is in: /home/quxutao/opencv-3.1.0/build -- ----------------------------------------------------------------- -- -- Configuring done -- Generating done -- Build files have been written to: /home/quxutao/opencv-3.1.0/build ``` 但是make的时候,就报错: ``` make [ 4%] Built target libwebp [ 4%] Built target IlmImf [ 4%] Built target opencv_cudev [ 4%] Built target opencv_core_pch_dephelp [ 4%] Built target pch_Generate_opencv_core [ 4%] Building NVCC (Device) object modules/core/CMakeFiles/cuda_compile.dir/src/cuda/cuda_compile_generated_gpu_mat.cu.o /usr/include/string.h: In function ‘void* __mempcpy_inline(void*, const void*, size_t)’: /usr/include/string.h:652:42: error: ‘memcpy’ was not declared in this scope return (char *) memcpy (__dest, __src, __n) + __n; ^ CMake Error at cuda_compile_generated_gpu_mat.cu.o.cmake:266 (message): Error generating file /home/quxutao/opencv-3.1.0/build/modules/core/CMakeFiles/cuda_compile.dir/src/cuda/./cuda_compile_generated_gpu_mat.cu.o modules/core/CMakeFiles/opencv_core.dir/build.make:399: recipe for target 'modules/core/CMakeFiles/cuda_compile.dir/src/cuda/cuda_compile_generated_gpu_mat.cu.o' failed make[2]: *** [modules/core/CMakeFiles/cuda_compile.dir/src/cuda/cuda_compile_generated_gpu_mat.cu.o] Error 1 CMakeFiles/Makefile2:2307: recipe for target 'modules/core/CMakeFiles/opencv_core.dir/all' failed make[1]: *** [modules/core/CMakeFiles/opencv_core.dir/all] Error 2 Makefile:160: recipe for target 'all' failed make: *** [all] Error 2 ``` 弄了一下午了,没有找到相关的解决办法。我的cuda是7.5,其实不用GPU也可以的,我只是想用KAZE滤波。。。跪求大神帮忙。。。
ubuntu下NS3使用“./test.py -c core”命令测试一直报错,求大神帮忙
Build failed -> task in 'test-runner' failed (exit status 1): {task 140009040312272: cxx test-runner.cc -> test-runner.cc.1.o} ['/usr/bin/g++', '-O3', '-g', '-Wall', '-Werror', '-march=native', '-fstrict-overflow', '-Wno-error=deprecated-declarations', '-fstrict-aliasing', '-Wstrict-aliasing', '-pthread', '-pthread', '-I.', '-I..', '-I/usr/include/gtk-2.0', '-I/usr/lib/x86_64-linux-gnu/gtk-2.0/include', '-I/usr/include/gio-unix-2.0', '-I/usr/include/cairo', '-I/usr/include/pango-1.0', '-I/usr/include/atk-1.0', '-I/usr/include/pixman-1', '-I/usr/include/libpng12', '-I/usr/include/gdk-pixbuf-2.0', '-I/usr/include/harfbuzz', '-I/usr/include/glib-2.0', '-I/usr/lib/x86_64-linux-gnu/glib-2.0/include', '-I/usr/include/freetype2', '-DNS3_BUILD_PROFILE_OPTIMIZED', '-DHAVE_SYS_IOCTL_H=1', '-DHAVE_IF_NETS_H=1', '-DHAVE_NET_ETHERNET_H=1', '-DHAVE_PACKET_H=1', '-DHAVE_IF_TUN_H=1', '-DHAVE_SQLITE3=1', '-DHAVE_GTK2=1', '../utils/test-runner.cc', '-c', '-o', '/home/chenhl/ns-allinone-3.25/ns-3.25/build/utils/test-runner.cc.1.o'] Waf died. Not running tests
console.readkey报libpng warning: iCCP: known incorrect sRGB profile错误
代码如下: PingReply pingReply = ping.Send(ListUrl[i], ITimeOut); Console.WriteLine("-------------------------------------------"); Console.WriteLine(string.Format("从{0}回复的IP地址:{1}", ListUrl[i], pingReply.Address)); Console.WriteLine(string.Format("ping耗时:{0}毫秒", pingReply.RoundtripTime)); Console.WriteLine(string.Format("ping结果:{0}", pingReply.Status)); Console.ReadKey(); 报错: libpng warning: iCCP: known incorrect sRGB profile libpng warning: iCCP: known incorrect sRGB profile libpng warning: iCCP: known incorrect sRGB profile libpng warning: iCCP: known incorrect sRGB profile libpng warning: iCCP: known incorrect sRGB profile libpng warning: iCCP: known incorrect sRGB profile libpng warning: iCCP: known incorrect sRGB profile libpng warning: iCCP: known incorrect sRGB profile libpng warning: iCCP: known incorrect sRGB profile libpng warning: iCCP: known incorrect sRGB profile libpng warning: iCCP: cHRM chunk does not match sRGB libpng warning: iCCP: known incorrect sRGB profile libpng warning: iCCP: known incorrect sRGB profile libpng warning: iCCP: known incorrect sRGB profile libpng warning: iCCP: known incorrect sRGB profile libpng warning: iCCP: known incorrect sRGB profile libpng warning: iCCP: known incorrect sRGB profile libpng warning: iCCP: known incorrect sRGB profile libpng warning: iCCP: known incorrect sRGB profile 是什么原因
在Ubuntu下装ns-3,编译时总是中途出错,具体如下:
Build failed -> task failed (exit status 1): {task 139621304904464: cxx print-introspected-doxygen.cc -> print-introspected-doxygen.cc.4.o} ['/usr/bin/g++', '-O0', '-ggdb', '-g3', '-Wall', '-Werror', '-Wno-error=deprecated-declarations', '-fstrict-aliasing', '-Wstrict-aliasing', '-pthread', '-pthread', '-fno-strict-aliasing', '-fwrapv', '-fdebug-prefix-map=/build/python2.7-3hk45v/python2.7-2.7.15~rc1=.', '-fstack-protector-strong', '-fno-strict-aliasing', '-Ibuild', '-I.', '-I.', '-I/home/zhangzq/tarballs/ns-allinone-3.13', '-I/usr/include/gtk-2.0', '-I/usr/lib/x86_64-linux-gnu/gtk-2.0/include', '-I/usr/include/gio-unix-2.0', '-I/usr/include/cairo', '-I/usr/include/pango-1.0', '-I/usr/include/atk-1.0', '-I/usr/include/pixman-1', '-I/usr/include/gdk-pixbuf-2.0', '-I/usr/include/libpng16', '-I/usr/include/harfbuzz', '-I/usr/include/glib-2.0', '-I/usr/lib/x86_64-linux-gnu/glib-2.0/include', '-I/usr/include/freetype2', '-I/usr/include/libxml2', '-I/usr/include/python2.7', '-I/usr/include/x86_64-linux-gnu/python2.7', '-DNS3_ASSERT_ENABLE', '-DNS3_LOG_ENABLE', '-DSQLITE3=1', '-DHAVE_IF_TUN_H=1', '-DPYTHONDIR="/usr/local/lib/python2.7/dist-packages"', '-DPYTHONARCHDIR="/usr/local/lib/python2.7/dist-packages"', '-DHAVE_PYTHON_H=1', '-DENABLE_GSL', '-DNDEBUG', '-D_FORTIFY_SOURCE=2', '../utils/print-introspected-doxygen.cc', '-c', '-o', 'utils/print-introspected-doxygen.cc.4.o'] Traceback (most recent call last): File "./build.py", line 147, in <module> sys.exit(main(sys.argv)) File "./build.py", line 138, in main build_ns3(config, build_examples, build_tests, args, build_options) File "./build.py", line 61, in build_ns3 run_command([sys.executable, "waf", "build"] + build_options) File "/home/zhangzq/tarballs/ns-allinone-3.13/util.py", line 24, in run_command raise CommandError("Command %r exited with code %i" % (argv, retval)) util.CommandError: Command ['/usr/bin/python', 'waf', 'build'] exited with code 1
arcgis Android 10.2.5 gradle 同步出错
错误提示: AAPT err(610279039): D:\AndroidStudioProjects\GisDemo\app\build\intermediates\exploded-aar\com.android.support\appcompat-v7\22.0.0\res\drawable-hdpi-v4\abc_spinner_mtrl_am_alpha.9.png: libpng warning: iCCP: Not recognizing known sRGB profile that has been edited 请问如何解决
conda安装librosa报错LinkError: post-link script failed for package conda-forge::qt?
(tensorflow-gpu) C:\Users\AnnJune>conda install -c conda-forge librosa Collecting package metadata: done Solving environment: \ The environment is inconsistent, please check the package plan carefully The following packages are causing the inconsistency: - conda-forge/noarch::librosa==0.6.3=py_0 - conda-forge/win-64::matplotlib==3.1.0=py36_1 - conda-forge/win-64::matplotlib-base==3.1.0=py36h2852a4a_1 - defaults/win-64::numba==0.39.0=py36h830ac7b_0 - conda-forge/win-64::pyqt==5.6.0=py36h764d66f_1008 - conda-forge/noarch::resampy==0.2.1=py_1 - conda-forge/win-64::scikit-learn==0.21.2=py36h0ff8352_0 - defaults/win-64::scipy==1.2.1=py36h29ff71c_0 done ## Package Plan ## environment location: C:\Users\AnnJune\Anaconda3\envs\tensorflow-gpu added / updated specs: - librosa The following packages will be downloaded: package | build ---------------------------|----------------- certifi-2019.3.9 | py36_0 149 KB conda-forge icu-58.1 | vc14_0 11.3 MB conda-forge llvmlite-0.28.0 | py36_0 12.5 MB conda-forge numba-0.43.1 | py36hf9181ef_0 2.8 MB defaults openssl-1.1.1b | hfa6e2cd_2 4.8 MB conda-forge pyqt-5.9.2 | py36h6538335_0 4.3 MB conda-forge qt-5.9.7 | hc6833c9_1 91.1 MB conda-forge sip-4.19.8 |py36h6538335_1000 281 KB conda-forge ------------------------------------------------------------ Total: 127.1 MB The following NEW packages will be INSTALLED: audioread conda-forge/win-64::audioread-2.1.6-py36_0 blas pkgs/main/win-64::blas-1.0-mkl ca-certificates conda-forge/win-64::ca-certificates-2019.3.9-hecc5488_0 cycler conda-forge/noarch::cycler-0.10.0-py_1 decorator conda-forge/noarch::decorator-4.4.0-py_0 freetype conda-forge/win-64::freetype-2.10.0-h5db478b_0 icc_rt pkgs/main/win-64::icc_rt-2019.0.0-h0cc432a_1 icu conda-forge/win-64::icu-58.1-vc14_0 intel-openmp pkgs/main/win-64::intel-openmp-2019.3-203 joblib conda-forge/noarch::joblib-0.13.2-py_0 jpeg conda-forge/win-64::jpeg-9c-hfa6e2cd_1001 kiwisolver conda-forge/win-64::kiwisolver-1.1.0-py36he980bc4_0 libblas conda-forge/win-64::libblas-3.8.0-10_mkl libcblas conda-forge/win-64::libcblas-3.8.0-10_mkl liblapack conda-forge/win-64::liblapack-3.8.0-10_mkl libpng conda-forge/win-64::libpng-1.6.37-h7602738_0 llvmlite conda-forge/win-64::llvmlite-0.28.0-py36_0 mkl pkgs/main/win-64::mkl-2019.3-203 numpy conda-forge/win-64::numpy-1.16.3-py36h873a0b8_0 openssl conda-forge/win-64::openssl-1.1.1b-hfa6e2cd_2 pyparsing conda-forge/noarch::pyparsing-2.4.0-py_0 python-dateutil conda-forge/noarch::python-dateutil-2.8.0-py_0 qt conda-forge/win-64::qt-5.9.7-hc6833c9_1 sip conda-forge/win-64::sip-4.19.8-py36h6538335_1000 six conda-forge/win-64::six-1.12.0-py36_1000 tornado conda-forge/win-64::tornado-6.0.2-py36hfa6e2cd_0 zlib conda-forge/win-64::zlib-1.2.11-h2fa13f4_1004 The following packages will be UPDATED: numba 0.39.0-py36h830ac7b_0 --> 0.43.1-py36hf9181ef_0 pyqt 5.6.0-py36h764d66f_1008 --> 5.9.2-py36h6538335_0 The following packages will be SUPERSEDED by a higher-priority channel: certifi pkgs/main --> conda-forge Proceed ([y]/n)? y Downloading and Extracting Packages openssl-1.1.1b | 4.8 MB | ############################################################################ | 100% numba-0.43.1 | 2.8 MB | ############################################################################ | 100% pyqt-5.9.2 | 4.3 MB | ############################################################################ | 100% llvmlite-0.28.0 | 12.5 MB | ############################################################################ | 100% qt-5.9.7 | 91.1 MB | ############################################################################ | 100% certifi-2019.3.9 | 149 KB | ############################################################################ | 100% icu-58.1 | 11.3 MB | ############################################################################ | 100% sip-4.19.8 | 281 KB | ############################################################################ | 100% Preparing transaction: done Verifying transaction: done Executing transaction: \ ERROR conda.core.link:_execute_post_link_actions(658): An error occurred while installing package 'conda-forge::qt-5.9.7-hc6833c9_1'. LinkError: post-link script failed for package conda-forge::qt-5.9.7-hc6833c9_1 running your command again with `-v` will provide additional information location of failed script: C:\Users\AnnJune\Anaconda3\envs\tensorflow-gpu\Scripts\.qt-post-link.bat ==> script messages <== <None> Attempting to roll back. failed ERROR conda.core.link:_execute(568): An error occurred while installing package 'conda-forge::qt-5.9.7-hc6833c9_1'. LinkError: post-link script failed for package conda-forge::qt-5.9.7-hc6833c9_1 running your command again with `-v` will provide additional information location of failed script: C:\Users\AnnJune\Anaconda3\envs\tensorflow-gpu\Scripts\.qt-post-link.bat ==> script messages <== <None> Attempting to roll back. Rolling back transaction: done LinkError: post-link script failed for package conda-forge::qt-5.9.7-hc6833c9_1 running your command again with `-v` will provide additional information location of failed script: C:\Users\AnnJune\Anaconda3\envs\tensorflow-gpu\Scripts\.qt-post-link.bat ==> script messages <== <None>
RTEMS移植GUI (MicroWindows) 的过程中出错
执行./do_it后: 错误是: configure: error: in `/home/Joshua/rtems-graphics-toolkit/libpng-1.5.12': configure: error: C compiler cannot create executables See `config.log' for more details ERROR: Could not configure libpng-1.5.12 下面是libpng下得config.log内容: This file contains any messages produced by compilers while running configure, to aid debugging if configure makes a mistake. It was created by libpng configure 1.5.12, which was generated by GNU Autoconf 2.68. Invocation command line was $ ./configure --host=i386-rtems4.11 --prefix=/opt/rtems-4.11/i386-rtems4.11/pc686 --includedir=/opt/rtems-4.11/i386-rtems4.11/pc686/lib/include --libdir=/opt/rtems-4.11/i386-rtems4.11/pc686/lib --disable-shared ## --------- ## ## Platform. ## ## --------- ## hostname = localhost.localdomain uname -m = i686 uname -r = 3.9.5-301.fc19.i686 uname -s = Linux uname -v = #1 SMP Tue Jun 11 20:01:50 UTC 2013 /usr/bin/uname -p = i686 /bin/uname -X = unknown /bin/arch = i686 /usr/bin/arch -k = unknown /usr/convex/getsysinfo = unknown /usr/bin/hostinfo = unknown /bin/machine = unknown /usr/bin/oslevel = unknown /bin/universe = unknown PATH: /usr/local/sbin PATH: /usr/local/bin PATH: /sbin PATH: /bin PATH: /usr/sbin PATH: /usr/bin PATH: /root/bin ## ----------- ## ## Core tests. ## ## ----------- ## configure:2321: checking for a BSD-compatible install configure:2389: result: /bin/install -c configure:2400: checking whether build environment is sane configure:2450: result: yes configure:2499: checking for i386-rtems4.11-strip configure:2529: result: no configure:2539: checking for strip configure:2555: found /bin/strip configure:2566: result: strip configure:2591: checking for a thread-safe mkdir -p configure:2630: result: /bin/mkdir -p configure:2643: checking for gawk configure:2659: found /bin/gawk configure:2670: result: gawk configure:2681: checking whether make sets $(MAKE) configure:2703: result: yes configure:2784: checking whether to enable maintainer-specific portions of Makefiles configure:2793: result: no configure:2832: checking for i386-rtems4.11-gcc configure:2862: result: no configure:2872: checking for gcc configure:2888: found /bin/gcc configure:2899: result: gcc configure:3128: checking for C compiler version configure:3137: gcc --version >&5 gcc (GCC) 4.8.2 20131017 (Red Hat 4.8.2-1) Copyright (C) 2013 Free Software Foundation, Inc. This is free software; see the source for copying conditions. There is NO warranty; not even for MERCHANTABILITY or FITNESS FOR A PARTICULAR PURPOSE. configure:3148: $? = 0 configure:3137: gcc -v >&5 Using built-in specs. COLLECT_GCC=gcc COLLECT_LTO_WRAPPER=/usr/libexec/gcc/i686-redhat-linux/4.8.2/lto-wrapper Target: i686-redhat-linux Configured with: ../configure --prefix=/usr --mandir=/usr/share/man --infodir=/usr/share/info --with-bugurl=http://bugzilla.redhat.com/bugzilla --enable-bootstrap --enable-shared --enable-threads=posix --enable-checking=release --with-system-zlib --enable-__cxa_atexit --disable-libunwind-exceptions --enable-gnu-unique-object --enable-linker-build-id --with-linker-hash-style=gnu --enable-languages=c,c++,objc,obj-c++,java,fortran,ada,go,lto --enable-plugin --enable-initfini-array --enable-java-awt=gtk --disable-dssi --with-java-home=/usr/lib/jvm/java-1.5.0-gcj-1.5.0.0/jre --enable-libgcj-multifile --enable-java-maintainer-mode --with-ecj-jar=/usr/share/java/eclipse-ecj.jar --disable-libjava-multilib --with-isl=/builddir/build/BUILD/gcc-4.8.2-20131017/obj-i686-redhat-linux/isl-install --with-cloog=/builddir/build/BUILD/gcc-4.8.2-20131017/obj-i686-redhat-linux/cloog-install --with-tune=generic --with-arch=i686 --build=i686-redhat-linux Thread model: posix gcc version 4.8.2 20131017 (Red Hat 4.8.2-1) (GCC) configure:3148: $? = 0 configure:3137: gcc -V >&5 gcc: error: unrecognized command line option '-V' gcc: fatal error: no input files compilation terminated. configure:3148: $? = 4 configure:3137: gcc -qversion >&5 gcc: error: unrecognized command line option '-qversion' gcc: fatal error: no input files compilation terminated. configure:3148: $? = 4 configure:3168: checking whether the C compiler works configure:3190: gcc --pipe -B/opt/rtems-4.11/i386-rtems4.11/pc686/lib/ -specs bsp_specs -qrtems -mtune=pentiumpro conftest.c >&5 /bin/ld: cannot find -lgcc_s /bin/ld: cannot find -lc /bin/ld: cannot find -lgcc_s collect2: error: ld returned 1 exit status configure:3194: $? = 1 configure:3232: result: no configure: failed program was: | /* confdefs.h */ | #define PACKAGE_NAME "libpng" | #define PACKAGE_TARNAME "libpng" | #define PACKAGE_VERSION "1.5.12" | #define PACKAGE_STRING "libpng 1.5.12" | #define PACKAGE_BUGREPORT "png-mng-implement@lists.sourceforge.net" | #define PACKAGE_URL "" | #define PACKAGE "libpng" | #define VERSION "1.5.12" | /* end confdefs.h. */ | | int | main () | { | | ; | return 0; | } configure:3237: error: in `/home/Joshua/rtems-graphics-toolkit/libpng-1.5.12': configure:3239: error: C compiler cannot create executables See `config.log' for more details ## ---------------- ## ## Cache variables. ## ## ---------------- ## ac_cv_env_CCASFLAGS_set= ac_cv_env_CCASFLAGS_value= ac_cv_env_CCAS_set= ac_cv_env_CCAS_value= ac_cv_env_CC_set= ac_cv_env_CC_value= ac_cv_env_CFLAGS_set=set ac_cv_env_CFLAGS_value=' --pipe -B/opt/rtems-4.11/i386-rtems4.11/pc686/lib/ -specs bsp_specs -qrtems -mtune=pentiumpro' ac_cv_env_CPPFLAGS_set= ac_cv_env_CPPFLAGS_value= ac_cv_env_CPP_set= ac_cv_env_CPP_value= ac_cv_env_LDFLAGS_set= ac_cv_env_LDFLAGS_value= ac_cv_env_LIBS_set= ac_cv_env_LIBS_value= ac_cv_env_build_alias_set= ac_cv_env_build_alias_value= ac_cv_env_host_alias_set=set ac_cv_env_host_alias_value=i386-rtems4.11 ac_cv_env_target_alias_set= ac_cv_env_target_alias_value= ac_cv_path_install='/bin/install -c' ac_cv_path_mkdir=/bin/mkdir ac_cv_prog_AWK=gawk ac_cv_prog_ac_ct_CC=gcc ac_cv_prog_ac_ct_STRIP=strip ac_cv_prog_make_make_set=yes ## ----------------- ## ## Output variables. ## ## ----------------- ## ACLOCAL='${SHELL} /home/Joshua/rtems-graphics-toolkit/libpng-1.5.12/missing --run aclocal-1.11' AMDEPBACKSLASH='' AMDEP_FALSE='' AMDEP_TRUE='' AMTAR='${SHELL} /home/Joshua/rtems-graphics-toolkit/libpng-1.5.12/missing --run tar' AM_CCASFLAGS='' AR='' AS='' AUTOCONF='${SHELL} /home/Joshua/rtems-graphics-toolkit/libpng-1.5.12/missing --run autoconf' AUTOHEADER='${SHELL} /home/Joshua/rtems-graphics-toolkit/libpng-1.5.12/missing --run autoheader' AUTOMAKE='${SHELL} /home/Joshua/rtems-graphics-toolkit/libpng-1.5.12/missing --run automake-1.11' AWK='gawk' CC='gcc' CCAS='' CCASDEPMODE='' CCASFLAGS='' CCDEPMODE='' CFLAGS=' --pipe -B/opt/rtems-4.11/i386-rtems4.11/pc686/lib/ -specs bsp_specs -qrtems -mtune=pentiumpro' CPP='' CPPFLAGS='' CYGPATH_W='echo' DEFS='' DEPDIR='' DFNCPP='' DLLTOOL='' DSYMUTIL='' DUMPBIN='' ECHO_C='' ECHO_N='-n' ECHO_T='' EGREP='' EXEEXT='' FGREP='' GREP='' HAVE_LD_VERSION_SCRIPT_FALSE='' HAVE_LD_VERSION_SCRIPT_TRUE='' HAVE_SOLARIS_LD_FALSE='' HAVE_SOLARIS_LD_TRUE='' INSTALL_DATA='${INSTALL} -m 644' INSTALL_PROGRAM='${INSTALL}' INSTALL_SCRIPT='${INSTALL}' INSTALL_STRIP_PROGRAM='$(install_sh) -c -s' LD='' LDFLAGS='' LIBOBJS='' LIBPNG_DEFINES='' LIBS='' LIBTOOL='' LIPO='' LN_S='' LTLIBOBJS='' MAINT='#' MAINTAINER_MODE_FALSE='' MAINTAINER_MODE_TRUE='#' MAKEINFO='${SHELL} /home/Joshua/rtems-graphics-toolkit/libpng-1.5.12/missing --run makeinfo' MANIFEST_TOOL='' MKDIR_P='/bin/mkdir -p' NM='' NMEDIT='' OBJDUMP='' OBJEXT='' OTOOL64='' OTOOL='' PACKAGE='libpng' PACKAGE_BUGREPORT='png-mng-implement@lists.sourceforge.net' PACKAGE_NAME='libpng' PACKAGE_STRING='libpng 1.5.12' PACKAGE_TARNAME='libpng' PACKAGE_URL='' PACKAGE_VERSION='1.5.12' PATH_SEPARATOR=':' PNGLIB_MAJOR='1' PNGLIB_MINOR='5' PNGLIB_RELEASE='12' PNGLIB_VERSION='1.5.12' PNG_ARM_NEON_FALSE='' PNG_ARM_NEON_TRUE='' POW_LIB='' RANLIB='' SED='' SET_MAKE='' SHELL='/bin/sh' STRIP='strip' SYMBOL_PREFIX='' VERSION='1.5.12' ac_ct_AR='' ac_ct_CC='gcc' ac_ct_DUMPBIN='' am__EXEEXT_FALSE='' am__EXEEXT_TRUE='' am__fastdepCCAS_FALSE='' am__fastdepCCAS_TRUE='' am__fastdepCC_FALSE='' am__fastdepCC_TRUE='' am__include='' am__isrc='' am__leading_dot='.' am__nodep='' am__quote='' am__tar='${AMTAR} chof - "$$tardir"' am__untar='${AMTAR} xf -' binconfigs='' bindir='${exec_prefix}/bin' build='' build_alias='' build_cpu='' build_os='' build_vendor='' datadir='${datarootdir}' datarootdir='${prefix}/share' docdir='${datarootdir}/doc/${PACKAGE_TARNAME}' dvidir='${docdir}' exec_prefix='NONE' host='i386-rtems4.11' host_alias='i386-rtems4.11' host_cpu='' host_os='' host_vendor='' htmldir='${docdir}' includedir='/opt/rtems-4.11/i386-rtems4.11/pc686/lib/include' infodir='${datarootdir}/info' install_sh='${SHELL} /home/Joshua/rtems-graphics-toolkit/libpng-1.5.12/install-sh' libdir='/opt/rtems-4.11/i386-rtems4.11/pc686/lib' libexecdir='${exec_prefix}/libexec' localedir='${datarootdir}/locale' localstatedir='${prefix}/var' mandir='${datarootdir}/man' mkdir_p='/bin/mkdir -p' oldincludedir='/usr/include' pdfdir='${docdir}' pkgconfigdir='' prefix='/opt/rtems-4.11/i386-rtems4.11/pc686' program_transform_name='s,x,x,' psdir='${docdir}' sbindir='${exec_prefix}/sbin' sharedstatedir='${prefix}/com' sysconfdir='${prefix}/etc' target_alias='' ## ----------- ## ## confdefs.h. ## ## ----------- ## /* confdefs.h */ #define PACKAGE_NAME "libpng" #define PACKAGE_TARNAME "libpng" #define PACKAGE_VERSION "1.5.12" #define PACKAGE_STRING "libpng 1.5.12" #define PACKAGE_BUGREPORT "png-mng-implement@lists.sourceforge.net" #define PACKAGE_URL "" #define PACKAGE "libpng" #define VERSION "1.5.12" configure: exit 77
如何安装编译pdf2htmlex实现pdf到html的格式转换功能
最近要实现一个pdf转HTML的功能,找来找去好像pdf2htmlEX最符合要求,但是Windows上不知道怎么安装,网上资料也很少,就试着在ubantu上搞搞,虽然这个我更不熟悉,完全陌生的操作系统,但是它教程比较多啊orz... 下载pdf2htmlEX后直接运行安装 错误信息: -- Checking for module 'poppler>=0.25.0' -- CMake Error at /usr/share/cmake-3.5/Modules/FindPkgConfig.cmake:367 (message): A required package was not found Call Stack (most recent call first): /usr/share/cmake-3.5/Modules/FindPkgConfig.cmake:532 (_pkg_check_modules_internal) CMakeLists.txt:22 (pkg_check_modules) -- Configuring incomplete, errors occurred! See also "/home/f03012/pdf2htmlEX/CMakeFiles/CMakeOutput.log". 经过查找资料发现下错了poppler包, 然后我就去重新下载poppler,并配置 ./configure --prefix=/usr \ --sysconfdir=/etc \ --disable-static \ --enable-build-type=release \ --enable-cmyk \ --enable-xpdf-headers \ --with-testdatadir=$PWD/testfiles && make 报错提示需要先安装libopenjpeg checking for LIBOPENJPEG... no checking for LIBOPENJPEG... no checking for opj_cio_open in -lopenjpeg... no checking openjpeg.h usability... no checking openjpeg.h presence... no checking for openjpeg.h... no configure: error: Install libopenjpeg2 or libopenjpeg1 before trying to build poppler. You can also decide to use the internal unmaintained JPX decoder or none at all. See --help. 继续下载安装 CMake Warning (dev) at cmake/TestLargeFiles.cmake:20 (if): Policy CMP0054 is not set: Only interpret if() arguments as variables or keywords when unquoted. Run "cmake --help-policy CMP0054" for policy details. Use the cmake_policy command to set the policy and suppress this warning. Quoted variables like "OPJ_HAVE_LARGEFILES" will no longer be dereferenced when the policy is set to NEW. Since the policy is not set the OLD behavior will be used. Call Stack (most recent call first): CMakeLists.txt:218 (OPJ_TEST_LARGE_FILES) This warning is for project developers. Use -Wno-dev to suppress it. -- Could NOT find ZLIB (missing: ZLIB_LIBRARY ZLIB_INCLUDE_DIR) -- Z lib not found, activate BUILD_THIRDPARTY if you want build it (necessary to build libPNG) -- Could NOT find TIFF (missing: TIFF_LIBRARY TIFF_INCLUDE_DIR) -- TIFF lib not found, activate BUILD_THIRDPARTY if you want build it -- Could NOT find LCMS2 (missing: LCMS2_LIBRARY LCMS2_INCLUDE_DIR) -- Could NOT find LCMS (missing: LCMS_LIBRARY LCMS_INCLUDE_DIR) -- LCMS2 or LCMS lib not found, activate BUILD_THIRDPARTY if you want build it -- Configuring done -- Generating done -- Build files have been written to: /home/f03012/下载/openjpeg-2.1.0 [ 5%] Built target t1_generate_luts [ 55%] Built target openjp2 [ 70%] Built target opj_compress [ 85%] Built target opj_dump [100%] Built target opj_decompress [ 5%] Built target t1_generate_luts [ 55%] Built target openjp2 [ 70%] Built target opj_compress [ 85%] Built target opj_dump [100%] Built target opj_decompress Install the project... -- Install configuration: "" -- Up-to-date: /usr/local/lib/openjpeg-2.1/OpenJPEGTargets.cmake -- Installing: /usr/local/lib/openjpeg-2.1/OpenJPEGTargets-noconfig.cmake -- Up-to-date: /usr/local/lib/openjpeg-2.1/OpenJPEGConfig.cmake -- Up-to-date: /usr/local/lib/pkgconfig/libopenjp2.pc -- Up-to-date: /usr/local/include/openjpeg-2.1/opj_config.h -- Up-to-date: /usr/local/lib/libopenjp2.so.2.1.0 -- Up-to-date: /usr/local/lib/libopenjp2.so.7 -- Up-to-date: /usr/local/lib/libopenjp2.so -- Up-to-date: /usr/local/include/openjpeg-2.1/openjpeg.h -- Up-to-date: /usr/local/include/openjpeg-2.1/opj_stdint.h -- Up-to-date: /usr/local/bin/opj_decompress -- Up-to-date: /usr/local/bin/opj_compress -- Up-to-date: /usr/local/bin/opj_dump 看不出来是否安装成功...试着继续配置了一下poppler,错误信息改变了 configure: WARNING: libjpeg not found. disable JPEG support. checking libjpeg.h works correctly... no checking libjpeg.h problem can be fixed by XMD_H macro... no, disable libjpeg configure: error: Install libjpeg before trying to build poppler. You can also decide to use the internal unmaintained DCT decoder or none at all. See --help. 这我就不知道该怎么办了,求帮助!!! ps:软件源我换了阿里云的源,但是还是好多下不了,导致我都得去网上下载包下来解压安装,也不知道安装方式对不对,真的不懂这个系统,我的安装方式:解压压缩包,在文件目录执行cmake . && make && make install 或者有没有大神知道Windows下的安装方法的教教我!Windows下我下了源码,但是那个exe文件执行不了
mod_tile编译出错 -std=c++11 or -std=gnu++11
make[1]: 正在进入目录 `/home/wml/src/mod_tile-master' depbase=`echo src/gen_tile.o | sed 's|[^/]*$|.deps/&|;s|\.o$||'`;\ g++ -DHAVE_CONFIG_H -I. -I./includes -I/usr/include/freetype2 -pthread -I/usr/local/include -I/usr/local/include/mapnik/agg -I/usr/include -I/usr/include/freetype2 -I/usr/include/libxml2 -I/usr/include/gdal -I/usr/include/postgresql -I/usr/include/cairo -I/usr/include/glib-2.0 -I/usr/lib/i386-linux-gnu/glib-2.0/include -I/usr/include/pixman-1 -I/usr/include/libpng12 -I/usr/include -I/usr/include/cairo -I/usr/include/glib-2.0 -I/usr/lib/i386-linux-gnu/glib-2.0/include -I/usr/include/pixman-1 -I/usr/include/freetype2 -I/usr/include/libpng12 -I/usr/include/cairomm-1.0 -I/usr/lib/i386-linux-gnu/cairomm-1.0/include -I/usr/include/cairo -I/usr/include/sigc++-2.0 -I/usr/lib/i386-linux-gnu/sigc++-2.0/include -I/usr/include/glib-2.0 -I/usr/lib/i386-linux-gnu/glib-2.0/include -I/usr/include/pixman-1 -I/usr/include/freetype2 -I/usr/include/libpng12 -DSYSTEM_LIBINIPARSER=0 -g -O2 -MT src/gen_tile.o -MD -MP -MF $depbase.Tpo -c -o src/gen_tile.o src/gen_tile.cpp &&\ mv -f $depbase.Tpo $depbase.Po In file included from /usr/include/c++/4.8/mutex:35:0, from /usr/local/include/mapnik/config.hpp:56, from /usr/local/include/mapnik/color.hpp:27, from /usr/local/include/mapnik/map.hpp:27, from src/gen_tile.cpp:2: /usr/include/c++/4.8/bits/c++0x_warning.h:32:2: error: #error This file requires compiler and library support for the ISO C++ 2011 standard. This support is currently experimental, and must be enabled with the -std=c++11 or -std=gnu++11 compiler options. 楼主:这个问题怎么解决?
AndroidStudio中\com.android.support错误如何解决
今天在AndroidStudio中创建项目老是出现 ** E:\AndroidStudioProjects\HelloStudio\myproject\build\intermediates\exploded-aar\com.android.support\appcompat-v7\21.0.3\res\drawable-mdpi\abc_ab_share_pack_holo_dark.9.png: libpng warning: iCCP: Not recognizing known sRGB profile that has been edited** 这个错误 要怎么解决啊
原码安装libgd-2.2.3编译报错
在./configure是出现 checking for XpmReadFileToXpmImage in -lXpm... no configure: Disabling support for xpm checking whether to support tiff... auto checking for LIBTIFF... no checking for TIFFClientOpen in -ltiff... no configure: Disabling support for tiff checking whether to support webp... auto checking for WebPGetInfo in -lwebp... no configure: Disabling support for webp checking for simple visibility declarations... yes checking whether we are building for a Win32 host... no checking CFLAGS for maximum warnings... -Wall ** Configuration summary for libgd 2.2.3: Support for Zlib: yes Support for PNG library: yes Support for JPEG library: yes Support for WebP library: no Support for TIFF library: no Support for Freetype 2.x library: yes Support for Fontconfig library: no Support for Xpm library: no Support for liq library: no Support for pthreads: yes checking that generated files are newer than configure... done configure: creating ./config.status config.status: creating Makefile config.status: creating src/Makefile config.status: creating tests/Makefile config.status: creating tests/test_config.h config.status: creating config/Makefile config.status: creating config/gdlib-config config.status: creating config/gdlib.pc config.status: creating src/config.h config.status: executing depfiles commands config.status: executing libtool commands make时报错 libtool: compile: gcc -std=gnu99 -DHAVE_CONFIG_H -I. -I/usr/local/zlib/include -I/usr/local/libpng/include -I/usr/local/libpng/include/libpng16 -I/usr/local/freetype/include -I/usr/local/freetype/include/freetype2 -I/usr/local/jpeg8/include -Werror -g -O2 -fvisibility=hidden -Wall -MT gdft.lo -MD -MP -MF .deps/gdft.Tpo -c gdft.c -fPIC -DPIC -o .libs/gdft.o gdft.c:143:15: error: 'font_pattern' defined but not used [-Werror=unused-function] static char * font_pattern(char **fontpath, char *fontpattern) ^ gdft.c:449:12: error: 'useFontConfig' defined but not used [-Werror=unused-function] static int useFontConfig(int flag) ^ cc1: all warnings being treated as errors make[2]: *** [gdft.lo] Error 1 make[2]: Leaving directory `/root/libgd-2.2.3/src' make[1]: *** [all] Error 2 make[1]: Leaving directory `/root/libgd-2.2.3/src' make: *** [all-recursive] Error 1 请问这是什么问题?如何解决呢?
Tensorflow测试训练styleGAN时报错 No OpKernel was registered to support Op 'NcclAllReduce' with these attrs.
在测试官方StyleGAN。 运行官方与训练模型pretrained_example.py generate_figures.py 没有问题。GPU工作正常。 运行train.py时报错 尝试只用单个GPU训练时没有报错。 NcclAllReduce应该跟多GPU通信有关,不太了解。 InvalidArgumentError (see above for traceback): No OpKernel was registered to support Op 'NcclAllReduce' with these attrs. Registered devices: [CPU,GPU], Registered kernels: <no registered kernels> [[Node: TrainD/SumAcrossGPUs/NcclAllReduce = NcclAllReduce[T=DT_FLOAT, num_devices=2, reduction="sum", shared_name="c112", _device="/device:GPU:0"](GPU0/TrainD_grad/gradients/AddN_160)]] 经过多番google 尝试过 重启 conda install keras-gpu 重新安装tensorflow-gpu==1.10.0(跟官方版本保持一致) ``` …… Building TensorFlow graph... Setting up snapshot image grid... Setting up run dir... Training... Traceback (most recent call last): File "d:\Users\admin\Anaconda3\envs\tfenv\lib\site-packages\tensorflow\python\client\session.py", line 1278, in _do_call return fn(*args) File "d:\Users\admin\Anaconda3\envs\tfenv\lib\site-packages\tensorflow\python\client\session.py", line 1263, in _run_fn options, feed_dict, fetch_list, target_list, run_metadata) File "d:\Users\admin\Anaconda3\envs\tfenv\lib\site-packages\tensorflow\python\client\session.py", line 1350, in _call_tf_sessionrun run_metadata) tensorflow.python.framework.errors_impl.InvalidArgumentError: No OpKernel was registered to support Op 'NcclAllReduce' with these attrs. Registered devices: [CPU,GPU], Registered kernels: <no registered kernels> [[Node: TrainD/SumAcrossGPUs/NcclAllReduce = NcclAllReduce[T=DT_FLOAT, num_devices=2, reduction="sum", shared_name="c112", _device="/device:GPU:0"](GPU0/TrainD_grad/gradients/AddN_160)]] During handling of the above exception, another exception occurred: Traceback (most recent call last): File "train.py", line 191, in <module> main() File "train.py", line 186, in main dnnlib.submit_run(**kwargs) File "E:\MachineLearning\stylegan-master\dnnlib\submission\submit.py", line 290, in submit_run run_wrapper(submit_config) File "E:\MachineLearning\stylegan-master\dnnlib\submission\submit.py", line 242, in run_wrapper util.call_func_by_name(func_name=submit_config.run_func_name, submit_config=submit_config, **submit_config.run_func_kwargs) File "E:\MachineLearning\stylegan-master\dnnlib\util.py", line 257, in call_func_by_name return func_obj(*args, **kwargs) File "E:\MachineLearning\stylegan-master\training\training_loop.py", line 230, in training_loop tflib.run([D_train_op, Gs_update_op], {lod_in: sched.lod, lrate_in: sched.D_lrate, minibatch_in: sched.minibatch}) File "E:\MachineLearning\stylegan-master\dnnlib\tflib\tfutil.py", line 26, in run return tf.get_default_session().run(*args, **kwargs) File "d:\Users\admin\Anaconda3\envs\tfenv\lib\site-packages\tensorflow\python\client\session.py", line 877, in run run_metadata_ptr) File "d:\Users\admin\Anaconda3\envs\tfenv\lib\site-packages\tensorflow\python\client\session.py", line 1100, in _run feed_dict_tensor, options, run_metadata) File "d:\Users\admin\Anaconda3\envs\tfenv\lib\site-packages\tensorflow\python\client\session.py", line 1272, in _do_run run_metadata) File "d:\Users\admin\Anaconda3\envs\tfenv\lib\site-packages\tensorflow\python\client\session.py", line 1291, in _do_call raise type(e)(node_def, op, message) tensorflow.python.framework.errors_impl.InvalidArgumentError: No OpKernel was registered to support Op 'NcclAllReduce' with these attrs. Registered devices: [CPU,GPU], Registered kernels: <no registered kernels> [[Node: TrainD/SumAcrossGPUs/NcclAllReduce = NcclAllReduce[T=DT_FLOAT, num_devices=2, reduction="sum", shared_name="c112", _device="/device:GPU:0"](GPU0/TrainD_grad/gradients/AddN_160)]] Caused by op 'TrainD/SumAcrossGPUs/NcclAllReduce', defined at: File "train.py", line 191, in <module> main() File "train.py", line 186, in main dnnlib.submit_run(**kwargs) File "E:\MachineLearning\stylegan-master\dnnlib\submission\submit.py", line 290, in submit_run run_wrapper(submit_config) File "E:\MachineLearning\stylegan-master\dnnlib\submission\submit.py", line 242, in run_wrapper util.call_func_by_name(func_name=submit_config.run_func_name, submit_config=submit_config, **submit_config.run_func_kwargs) File "E:\MachineLearning\stylegan-master\dnnlib\util.py", line 257, in call_func_by_name return func_obj(*args, **kwargs) File "E:\MachineLearning\stylegan-master\training\training_loop.py", line 185, in training_loop D_train_op = D_opt.apply_updates() File "E:\MachineLearning\stylegan-master\dnnlib\tflib\optimizer.py", line 135, in apply_updates g = nccl_ops.all_sum(g) File "d:\Users\admin\Anaconda3\envs\tfenv\lib\site-packages\tensorflow\contrib\nccl\python\ops\nccl_ops.py", line 49, in all_sum return _apply_all_reduce('sum', tensors) File "d:\Users\admin\Anaconda3\envs\tfenv\lib\site-packages\tensorflow\contrib\nccl\python\ops\nccl_ops.py", line 230, in _apply_all_reduce shared_name=shared_name)) File "d:\Users\admin\Anaconda3\envs\tfenv\lib\site-packages\tensorflow\contrib\nccl\ops\gen_nccl_ops.py", line 59, in nccl_all_reduce num_devices=num_devices, shared_name=shared_name, name=name) File "d:\Users\admin\Anaconda3\envs\tfenv\lib\site-packages\tensorflow\python\framework\op_def_library.py", line 787, in _apply_op_helper op_def=op_def) File "d:\Users\admin\Anaconda3\envs\tfenv\lib\site-packages\tensorflow\python\util\deprecation.py", line 454, in new_func return func(*args, **kwargs) File "d:\Users\admin\Anaconda3\envs\tfenv\lib\site-packages\tensorflow\python\framework\ops.py", line 3156, in create_op op_def=op_def) File "d:\Users\admin\Anaconda3\envs\tfenv\lib\site-packages\tensorflow\python\framework\ops.py", line 1718, in __init__ self._traceback = tf_stack.extract_stack() InvalidArgumentError (see above for traceback): No OpKernel was registered to support Op 'NcclAllReduce' with these attrs. Registered devices: [CPU,GPU], Registered kernels: <no registered kernels> [[Node: TrainD/SumAcrossGPUs/NcclAllReduce = NcclAllReduce[T=DT_FLOAT, num_devices=2, reduction="sum", shared_name="c112", _device="/device:GPU:0"](GPU0/TrainD_grad/gradients/AddN_160)]] ``` ``` #conda list: # Name Version Build Channel _tflow_select 2.1.0 gpu absl-py 0.8.1 pypi_0 pypi alabaster 0.7.12 py36_0 asn1crypto 1.2.0 py36_0 astor 0.8.0 pypi_0 pypi astroid 2.3.2 py36_0 attrs 19.3.0 py_0 babel 2.7.0 py_0 backcall 0.1.0 py36_0 blas 1.0 mkl bleach 3.1.0 py36_0 ca-certificates 2019.10.16 0 certifi 2019.9.11 py36_0 cffi 1.13.1 py36h7a1dbc1_0 chardet 3.0.4 py36_1003 cloudpickle 1.2.2 py_0 colorama 0.4.1 py36_0 cryptography 2.8 py36h7a1dbc1_0 cudatoolkit 9.0 1 cudnn 7.6.4 cuda9.0_0 decorator 4.4.1 py_0 defusedxml 0.6.0 py_0 django 2.2.7 pypi_0 pypi docutils 0.15.2 py36_0 entrypoints 0.3 py36_0 gast 0.3.2 py_0 grpcio 1.25.0 pypi_0 pypi h5py 2.9.0 py36h5e291fa_0 hdf5 1.10.4 h7ebc959_0 icc_rt 2019.0.0 h0cc432a_1 icu 58.2 ha66f8fd_1 idna 2.8 pypi_0 pypi image 1.5.27 pypi_0 pypi imagesize 1.1.0 py36_0 importlib_metadata 0.23 py36_0 intel-openmp 2019.4 245 ipykernel 5.1.3 py36h39e3cac_0 ipython 7.9.0 py36h39e3cac_0 ipython_genutils 0.2.0 py36h3c5d0ee_0 isort 4.3.21 py36_0 jedi 0.15.1 py36_0 jinja2 2.10.3 py_0 jpeg 9b hb83a4c4_2 jsonschema 3.1.1 py36_0 jupyter_client 5.3.4 py36_0 jupyter_core 4.6.1 py36_0 keras-applications 1.0.8 py_0 keras-base 2.2.4 py36_0 keras-gpu 2.2.4 0 keras-preprocessing 1.1.0 py_1 keyring 18.0.0 py36_0 lazy-object-proxy 1.4.3 py36he774522_0 libpng 1.6.37 h2a8f88b_0 libprotobuf 3.9.2 h7bd577a_0 libsodium 1.0.16 h9d3ae62_0 markdown 3.1.1 py36_0 markupsafe 1.1.1 py36he774522_0 mccabe 0.6.1 py36_1 mistune 0.8.4 py36he774522_0 mkl 2019.4 245 mkl-service 2.3.0 py36hb782905_0 mkl_fft 1.0.15 py36h14836fe_0 mkl_random 1.1.0 py36h675688f_0 more-itertools 7.2.0 py36_0 nbconvert 5.6.1 py36_0 nbformat 4.4.0 py36h3a5bc1b_0 numpy 1.17.3 py36h4ceb530_0 numpy-base 1.17.3 py36hc3f5095_0 numpydoc 0.9.1 py_0 openssl 1.1.1d he774522_3 packaging 19.2 py_0 pandoc 2.2.3.2 0 pandocfilters 1.4.2 py36_1 parso 0.5.1 py_0 pickleshare 0.7.5 py36_0 pillow 6.2.1 pypi_0 pypi pip 19.3.1 py36_0 prompt_toolkit 2.0.10 py_0 protobuf 3.10.0 pypi_0 pypi psutil 5.6.3 py36he774522_0 pycodestyle 2.5.0 py36_0 pycparser 2.19 py36_0 pyflakes 2.1.1 py36_0 pygments 2.4.2 py_0 pylint 2.4.3 py36_0 pyopenssl 19.0.0 py36_0 pyparsing 2.4.2 py_0 pyqt 5.9.2 py36h6538335_2 pyreadline 2.1 py36_1 pyrsistent 0.15.4 py36he774522_0 pysocks 1.7.1 py36_0 python 3.6.9 h5500b2f_0 python-dateutil 2.8.1 py_0 pytz 2019.3 py_0 pywin32 223 py36hfa6e2cd_1 pyyaml 5.1.2 py36he774522_0 pyzmq 18.1.0 py36ha925a31_0 qt 5.9.7 vc14h73c81de_0 qtawesome 0.6.0 py_0 qtconsole 4.5.5 py_0 qtpy 1.9.0 py_0 requests 2.22.0 py36_0 rope 0.14.0 py_0 scipy 1.3.1 py36h29ff71c_0 setuptools 39.1.0 pypi_0 pypi sip 4.19.8 py36h6538335_0 six 1.13.0 pypi_0 pypi snowballstemmer 2.0.0 py_0 sphinx 2.2.1 py_0 sphinxcontrib-applehelp 1.0.1 py_0 sphinxcontrib-devhelp 1.0.1 py_0 sphinxcontrib-htmlhelp 1.0.2 py_0 sphinxcontrib-jsmath 1.0.1 py_0 sphinxcontrib-qthelp 1.0.2 py_0 sphinxcontrib-serializinghtml 1.1.3 py_0 spyder 3.3.6 py36_0 spyder-kernels 0.5.2 py36_0 sqlite 3.30.1 he774522_0 sqlparse 0.3.0 pypi_0 pypi tensorboard 1.10.0 py36he025d50_0 tensorflow 1.10.0 gpu_py36h3514669_0 tensorflow-base 1.10.0 gpu_py36h6e53903_0 tensorflow-gpu 1.10.0 pypi_0 pypi termcolor 1.1.0 pypi_0 pypi testpath 0.4.2 py36_0 tornado 6.0.3 py36he774522_0 traitlets 4.3.3 py36_0 typed-ast 1.4.0 py36he774522_0 urllib3 1.25.6 pypi_0 pypi vc 14.1 h0510ff6_4 vs2015_runtime 14.16.27012 hf0eaf9b_0 wcwidth 0.1.7 py36h3d5aa90_0 webencodings 0.5.1 py36_1 werkzeug 0.16.0 py_0 wheel 0.33.6 py36_0 win_inet_pton 1.1.0 py36_0 wincertstore 0.2 py36h7fe50ca_0 wrapt 1.11.2 py36he774522_0 yaml 0.1.7 hc54c509_2 zeromq 4.3.1 h33f27b4_3 zipp 0.6.0 py_0 zlib 1.2.11 h62dcd97_3 ``` 2*RTX2080Ti driver 4.19.67
编译安装apache遇到问题
Making all in support make[1]: Entering directory `/root/httpd-2.4.29/support' make[2]: Entering directory `/root/httpd-2.4.29/support' /usr/local/apr/build-1/libtool --silent --mode=compile gcc -std=gnu99 -g -O2 -pthread -DLINUX -D_REENTRANT -D_GNU_SOURCE -I. -I/root/httpd-2.4.29/os/unix -I/root/httpd-2.4.29/include -I/usr/local/apr/include/apr-1 -I/usr/local/apr-util/include/apr-1 -I/root/httpd-2.4.29/modules/aaa -I/root/httpd-2.4.29/modules/cache -I/root/httpd-2.4.29/modules/core -I/root/httpd-2.4.29/modules/database -I/root/httpd-2.4.29/modules/filters -I/root/httpd-2.4.29/modules/ldap -I/root/httpd-2.4.29/modules/loggers -I/root/httpd-2.4.29/modules/lua -I/root/httpd-2.4.29/modules/proxy -I/root/httpd-2.4.29/modules/session -I/root/httpd-2.4.29/modules/ssl -I/root/httpd-2.4.29/modules/test -I/root/httpd-2.4.29/server -I/root/httpd-2.4.29/modules/arch/unix -I/root/httpd-2.4.29/modules/dav/main -I/root/httpd-2.4.29/modules/generators -I/root/httpd-2.4.29/modules/mappers -prefer-non-pic -static -c htpasswd.c && touch htpasswd.lo /usr/local/apr/build-1/libtool --silent --mode=compile gcc -std=gnu99 -g -O2 -pthread -DLINUX -D_REENTRANT -D_GNU_SOURCE -I. -I/root/httpd-2.4.29/os/unix -I/root/httpd-2.4.29/include -I/usr/local/apr/include/apr-1 -I/usr/local/apr-util/include/apr-1 -I/root/httpd-2.4.29/modules/aaa -I/root/httpd-2.4.29/modules/cache -I/root/httpd-2.4.29/modules/core -I/root/httpd-2.4.29/modules/database -I/root/httpd-2.4.29/modules/filters -I/root/httpd-2.4.29/modules/ldap -I/root/httpd-2.4.29/modules/loggers -I/root/httpd-2.4.29/modules/lua -I/root/httpd-2.4.29/modules/proxy -I/root/httpd-2.4.29/modules/session -I/root/httpd-2.4.29/modules/ssl -I/root/httpd-2.4.29/modules/test -I/root/httpd-2.4.29/server -I/root/httpd-2.4.29/modules/arch/unix -I/root/httpd-2.4.29/modules/dav/main -I/root/httpd-2.4.29/modules/generators -I/root/httpd-2.4.29/modules/mappers -prefer-non-pic -static -c passwd_common.c && touch passwd_common.lo /usr/local/apr/build-1/libtool --silent --mode=link gcc -std=gnu99 -g -O2 -pthread -o htpasswd htpasswd.lo passwd_common.lo /usr/local/apr-util/lib/libaprutil-1.la /usr/local/apr/lib/libapr-1.la -lrt -lcrypt -lpthread -ldl -lcrypt /usr/local/apr-util/lib/libaprutil-1.so: undefined reference to `XML_GetErrorCode' /usr/local/apr-util/lib/libaprutil-1.so: undefined reference to `XML_SetEntityDeclHandler' /usr/local/apr-util/lib/libaprutil-1.so: undefined reference to `XML_ParserCreate' /usr/local/apr-util/lib/libaprutil-1.so: undefined reference to `XML_SetCharacterDataHandler' /usr/local/apr-util/lib/libaprutil-1.so: undefined reference to `XML_ParserFree' /usr/local/apr-util/lib/libaprutil-1.so: undefined reference to `XML_SetUserData' /usr/local/apr-util/lib/libaprutil-1.so: undefined reference to `XML_StopParser' /usr/local/apr-util/lib/libaprutil-1.so: undefined reference to `XML_Parse' /usr/local/apr-util/lib/libaprutil-1.so: undefined reference to `XML_ErrorString' /usr/local/apr-util/lib/libaprutil-1.so: undefined reference to `XML_SetElementHandler' collect2: error: ld returned 1 exit status make[2]: *** [htpasswd] Error 1 make[2]: Leaving directory `/root/httpd-2.4.29/support' make[1]: *** [all-recursive] Error 1 make[1]: Leaving directory `/root/httpd-2.4.29/support' make: *** [all-recursive] Error 1 [root@bogon httpd-2.4.29]# ./configure --prefix=/usr/local/apache2 --with-apr=/usr/local/apr --with-apr-util=/usr/local/apr-util --with-pcre=/usr/local/pcre --enable-so --enable-rewrite --libdir=/usr/lib64^C [root@bogon httpd-2.4.29]# ll /usr/lib/libm libm-2.17.so libmemusage.so libm.so.6 [root@bogon httpd-2.4.29]# ll /usr/lib/libelf libelf-0.168.so libelf.so.1 [root@bogon httpd-2.4.29]# ll /usr/lib/libelf libelf-0.168.so libelf.so.1 ----------------以上为make后的信息------------- 安装根据http://blog.csdn.net/bizu005/article/details/78339380?locationNum=4&fps=1教程进行操作 环境如下:Centos7.4 编译安装的apache版本为2.4.29 已执行过的操作: 1.安装依赖包yum install gcc gcc-c++ gcc-g77 flex bison autoconf automake bzip2-devel zlib-devel ncurses-devel libjpeg-devel libpng-devel libtiff-devel freetype-devel pam-devel openssl-devel libxml2-devel 2.添加配置 --libdir=/usr/lib64 3.根据http://www.ti6.net/wangzhanjishu/1587.html所示,但是并未在mv /usr/lib/路径下 找到 libm.a,libm.so,libexpat.so只有一下文件libm-2.17.so libmemusage.so libm.so.6 ![图片说明](https://img-ask.csdn.net/upload/201801/23/1516697165_357009.png)
rails 2.3.5 64位ubuntu 服务器半夜常挂,没法了....
<div class="iteye-blog-content-contain" style="font-size: 14px;"> <p>网站 www.0710bb.com , 经常半夜挂掉,真的是找不到问题出在什么地方,请大家看看了!!!感激....</p> <p> </p> <p>这是出错的代码..............</p> <p>/usr/local/rvm/gems/ruby-1.8.7-p371/gems/mongrel-1.1.5/bin/../lib/mongrel.rb:221:in `process'</p> <p>/usr/local/rvm/gems/ruby-1.8.7-p371/gems/mongrel-1.1.5/bin/../lib/mongrel.rb:159:in `process_client'</p> <p>/usr/local/rvm/gems/ruby-1.8.7-p371/gems/mongrel-1.1.5/bin/../lib/mongrel.rb:158:in `each'</p> <p>/usr/local/rvm/gems/ruby-1.8.7-p371/gems/mongrel-1.1.5/bin/../lib/mongrel.rb:158:in `process_client'</p> <p>/usr/local/rvm/gems/ruby-1.8.7-p371/gems/mongrel-1.1.5/bin/../lib/mongrel.rb:285:in `run'</p> <p>/usr/local/rvm/gems/ruby-1.8.7-p371/gems/mongrel-1.1.5/bin/../lib/mongrel.rb:285:in `initialize'</p> <p>/usr/local/rvm/gems/ruby-1.8.7-p371/gems/mongrel-1.1.5/bin/../lib/mongrel.rb:285:in `new'</p> <p>/usr/local/rvm/gems/ruby-1.8.7-p371/gems/mongrel-1.1.5/bin/../lib/mongrel.rb:285:in `run'</p> <p>/usr/local/rvm/gems/ruby-1.8.7-p371/gems/mongrel-1.1.5/bin/../lib/mongrel.rb:268:in `initialize'</p> <p>/usr/local/rvm/gems/ruby-1.8.7-p371/gems/mongrel-1.1.5/bin/../lib/mongrel.rb:268:in `new'</p> <p>/usr/local/rvm/gems/ruby-1.8.7-p371/gems/mongrel-1.1.5/bin/../lib/mongrel.rb:268:in `run'</p> <p>/usr/local/rvm/gems/ruby-1.8.7-p371/gems/mongrel-1.1.5/bin/../lib/mongrel/configurator.rb:282:in `run'</p> <p>/usr/local/rvm/gems/ruby-1.8.7-p371/gems/mongrel-1.1.5/bin/../lib/mongrel/configurator.rb:281:in `each'</p> <p>/usr/local/rvm/gems/ruby-1.8.7-p371/gems/mongrel-1.1.5/bin/../lib/mongrel/configurator.rb:281:in `run'</p> <p>/usr/local/rvm/gems/ruby-1.8.7-p371/gems/mongrel-1.1.5/bin/mongrel_rails:128:in `run'</p> <p>/usr/local/rvm/gems/ruby-1.8.7-p371/gems/mongrel-1.1.5/bin/../lib/mongrel/command.rb:212:in `run'</p> <p>/usr/local/rvm/gems/ruby-1.8.7-p371/gems/mongrel-1.1.5/bin/mongrel_rails:281</p> <p>/usr/local/rvm/gems/ruby-1.8.7-p371/bin/mongrel_rails:19:in `load'</p> <p>/usr/local/rvm/gems/ruby-1.8.7-p371/bin/mongrel_rails:19Wed Feb 27 03:48:23 +0800 2013: Error calling Dispatcher.dispatch #&lt;Mongrel::TimeoutError: Mongrel timed out this thread: too many open files&gt;Thread #&lt;Thread:0x7f8d09b0dd10 sleep&gt; is too old, killing.</p> <p> </p> <p> </p> <p>/usr/local/rvm/gems/ruby-1.8.7-p371/gems/mongrel-1.1.5/bin/../lib/mongrel.rb:221:in `process'</p> <p>/usr/local/rvm/gems/ruby-1.8.7-p371/gems/mongrel-1.1.5/bin/../lib/mongrel.rb:159:in `process_client'</p> <p>/usr/local/rvm/gems/ruby-1.8.7-p371/gems/mongrel-1.1.5/bin/../lib/mongrel.rb:158:in `each'</p> <p>/usr/local/rvm/gems/ruby-1.8.7-p371/gems/mongrel-1.1.5/bin/../lib/mongrel.rb:158:in `process_client'</p> <p>/usr/local/rvm/gems/ruby-1.8.7-p371/gems/mongrel-1.1.5/bin/../lib/mongrel.rb:285:in `run'</p> <p>/usr/local/rvm/gems/ruby-1.8.7-p371/gems/mongrel-1.1.5/bin/../lib/mongrel.rb:285:in `initialize'</p> <p>/usr/local/rvm/gems/ruby-1.8.7-p371/gems/mongrel-1.1.5/bin/../lib/mongrel.rb:285:in `new'</p> <p>/usr/local/rvm/gems/ruby-1.8.7-p371/gems/mongrel-1.1.5/bin/../lib/mongrel.rb:285:in `run'</p> <p>/usr/local/rvm/gems/ruby-1.8.7-p371/gems/mongrel-1.1.5/bin/../lib/mongrel.rb:268:in `initialize'</p> <p>/usr/local/rvm/gems/ruby-1.8.7-p371/gems/mongrel-1.1.5/bin/../lib/mongrel.rb:268:in `new'</p> <p>/usr/local/rvm/gems/ruby-1.8.7-p371/gems/mongrel-1.1.5/bin/../lib/mongrel.rb:268:in `run'</p> <p>/usr/local/rvm/gems/ruby-1.8.7-p371/gems/mongrel-1.1.5/bin/../lib/mongrel/configurator.rb:282:in `run'</p> <p>/usr/local/rvm/gems/ruby-1.8.7-p371/gems/mongrel-1.1.5/bin/../lib/mongrel/configurator.rb:281:in `each'</p> <p>/usr/local/rvm/gems/ruby-1.8.7-p371/gems/mongrel-1.1.5/bin/../lib/mongrel/configurator.rb:281:in `run'</p> <p>/usr/local/rvm/gems/ruby-1.8.7-p371/gems/mongrel-1.1.5/bin/mongrel_rails:128:in `run'</p> <p>/usr/local/rvm/gems/ruby-1.8.7-p371/gems/mongrel-1.1.5/bin/../lib/mongrel/command.rb:212:in `run'</p> <p>/usr/local/rvm/gems/ruby-1.8.7-p371/gems/mongrel-1.1.5/bin/mongrel_rails:281</p> <p>/usr/local/rvm/gems/ruby-1.8.7-p371/bin/mongrel_rails:19:in `load'</p> <p>/usr/local/rvm/gems/ruby-1.8.7-p371/bin/mongrel_rails:19Wed Feb 27 03:48:23 +0800 2013: Error calling Dispatcher.dispatch #&lt;Mongrel::TimeoutError: Mongrel timed out this thread: too many open files&gt;Thread #&lt;Thread:0x7f8d09b0f2c8 sleep&gt; is too old, killing.</p> <p> </p> <p> </p> <p>/usr/local/rvm/gems/ruby-1.8.7-p371/gems/mongrel-1.1.5/bin/../lib/mongrel.rb:221:in `process'</p> <p>/usr/local/rvm/gems/ruby-1.8.7-p371/gems/mongrel-1.1.5/bin/../lib/mongrel.rb:159:in `process_client'</p> <p>/usr/local/rvm/gems/ruby-1.8.7-p371/gems/mongrel-1.1.5/bin/../lib/mongrel.rb:158:in `each'</p> <p>/usr/local/rvm/gems/ruby-1.8.7-p371/gems/mongrel-1.1.5/bin/../lib/mongrel.rb:158:in `process_client'</p> <p>/usr/local/rvm/gems/ruby-1.8.7-p371/gems/mongrel-1.1.5/bin/../lib/mongrel.rb:285:in `run'</p> <p>/usr/local/rvm/gems/ruby-1.8.7-p371/gems/mongrel-1.1.5/bin/../lib/mongrel.rb:285:in `initialize'</p> <p>/usr/local/rvm/gems/ruby-1.8.7-p371/gems/mongrel-1.1.5/bin/../lib/mongrel.rb:285:in `new'</p> <p>/usr/local/rvm/gems/ruby-1.8.7-p371/gems/mongrel-1.1.5/bin/../lib/mongrel.rb:285:in `run'</p> <p>/usr/local/rvm/gems/ruby-1.8.7-p371/gems/mongrel-1.1.5/bin/../lib/mongrel.rb:268:in `initialize'</p> <p>/usr/local/rvm/gems/ruby-1.8.7-p371/gems/mongrel-1.1.5/bin/../lib/mongrel.rb:268:in `new'</p> <p>/usr/local/rvm/gems/ruby-1.8.7-p371/gems/mongrel-1.1.5/bin/../lib/mongrel.rb:268:in `run'</p> <p>/usr/local/rvm/gems/ruby-1.8.7-p371/gems/mongrel-1.1.5/bin/../lib/mongrel/configurator.rb:282:in `run'</p> <p>/usr/local/rvm/gems/ruby-1.8.7-p371/gems/mongrel-1.1.5/bin/../lib/mongrel/configurator.rb:281:in `each'</p> <p>/usr/local/rvm/gems/ruby-1.8.7-p371/gems/mongrel-1.1.5/bin/../lib/mongrel/configurator.rb:281:in `run'</p> <p>/usr/local/rvm/gems/ruby-1.8.7-p371/gems/mongrel-1.1.5/bin/mongrel_rails:128:in `run'</p> <p>/usr/local/rvm/gems/ruby-1.8.7-p371/gems/mongrel-1.1.5/bin/../lib/mongrel/command.rb:212:in `run'</p> <p>/usr/local/rvm/gems/ruby-1.8.7-p371/gems/mongrel-1.1.5/bin/mongrel_rails:281</p> <p>/usr/local/rvm/gems/ruby-1.8.7-p371/bin/mongrel_rails:19:in `load'</p> <p>/usr/local/rvm/gems/ruby-1.8.7-p371/bin/mongrel_rails:19Wed Feb 27 03:48:23 +0800 2013: Error calling Dispatcher.dispatch #&lt;Mongrel::TimeoutError: Mongrel timed out this thread: too many open files&gt;Thread #&lt;Thread:0x7f8d095c4458 sleep&gt; is too old, killing.</p> <p> </p> <p> </p> <p>/usr/local/rvm/gems/ruby-1.8.7-p371/gems/mongrel-1.1.5/bin/../lib/mongrel.rb:221:in `process'</p> <p>/usr/local/rvm/gems/ruby-1.8.7-p371/gems/mongrel-1.1.5/bin/../lib/mongrel.rb:159:in `process_client'</p> <p>/usr/local/rvm/gems/ruby-1.8.7-p371/gems/mongrel-1.1.5/bin/../lib/mongrel.rb:158:in `each'</p> <p>/usr/local/rvm/gems/ruby-1.8.7-p371/gems/mongrel-1.1.5/bin/../lib/mongrel.rb:158:in `process_client'</p> <p>/usr/local/rvm/gems/ruby-1.8.7-p371/gems/mongrel-1.1.5/bin/../lib/mongrel.rb:285:in `run'</p> <p>/usr/local/rvm/gems/ruby-1.8.7-p371/gems/mongrel-1.1.5/bin/../lib/mongrel.rb:285:in `initialize'</p> <p>/usr/local/rvm/gems/ruby-1.8.7-p371/gems/mongrel-1.1.5/bin/../lib/mongrel.rb:285:in `new'</p> <p>/usr/local/rvm/gems/ruby-1.8.7-p371/gems/mongrel-1.1.5/bin/../lib/mongrel.rb:285:in `run'</p> <p>/usr/local/rvm/gems/ruby-1.8.7-p371/gems/mongrel-1.1.5/bin/../lib/mongrel.rb:268:in `initialize'</p> <p>/usr/local/rvm/gems/ruby-1.8.7-p371/gems/mongrel-1.1.5/bin/../lib/mongrel.rb:268:in `new'</p> <p>/usr/local/rvm/gems/ruby-1.8.7-p371/gems/mongrel-1.1.5/bin/../lib/mongrel.rb:268:in `run'</p> <p>/usr/local/rvm/gems/ruby-1.8.7-p371/gems/mongrel-1.1.5/bin/../lib/mongrel/configurator.rb:282:in `run'</p> <p>/usr/local/rvm/gems/ruby-1.8.7-p371/gems/mongrel-1.1.5/bin/../lib/mongrel/configurator.rb:281:in `each'</p> <p>/usr/local/rvm/gems/ruby-1.8.7-p371/gems/mongrel-1.1.5/bin/../lib/mongrel/configurator.rb:281:in `run'</p> <p>/usr/local/rvm/gems/ruby-1.8.7-p371/gems/mongrel-1.1.5/bin/mongrel_rails:128:in `run'</p> <p>/usr/local/rvm/gems/ruby-1.8.7-p371/gems/mongrel-1.1.5/bin/../lib/mongrel/command.rb:212:in `run'</p> <p>/usr/local/rvm/gems/ruby-1.8.7-p371/gems/mongrel-1.1.5/bin/mongrel_rails:281</p> <p>/usr/local/rvm/gems/ruby-1.8.7-p371/bin/mongrel_rails:19:in `load'</p> <p>/usr/local/rvm/gems/ruby-1.8.7-p371/bin/mongrel_rails:19Wed Feb 27 03:48:23 +0800 2013: Error calling Dispatcher.dispatch #&lt;Mongrel::TimeoutError: Mongrel timed out this thread: too many open files&gt;Thread #&lt;Thread:0x7f8d095d3de0 sleep&gt; is too old, killing.</p> <p> </p> <p> </p> <p>/usr/local/rvm/gems/ruby-1.8.7-p371/gems/mongrel-1.1.5/bin/../lib/mongrel.rb:221:in `process'</p> <p>/usr/local/rvm/gems/ruby-1.8.7-p371/gems/mongrel-1.1.5/bin/../lib/mongrel.rb:159:in `process_client'</p> <p>/usr/local/rvm/gems/ruby-1.8.7-p371/gems/mongrel-1.1.5/bin/../lib/mongrel.rb:158:in `each'</p> <p>/usr/local/rvm/gems/ruby-1.8.7-p371/gems/mongrel-1.1.5/bin/../lib/mongrel.rb:158:in `process_client'</p> <p>/usr/local/rvm/gems/ruby-1.8.7-p371/gems/mongrel-1.1.5/bin/../lib/mongrel.rb:285:in `run'</p> <p>/usr/local/rvm/gems/ruby-1.8.7-p371/gems/mongrel-1.1.5/bin/../lib/mongrel.rb:285:in `initialize'</p> <p>/usr/local/rvm/gems/ruby-1.8.7-p371/gems/mongrel-1.1.5/bin/../lib/mongrel.rb:285:in `new'</p> <p>/usr/local/rvm/gems/ruby-1.8.7-p371/gems/mongrel-1.1.5/bin/../lib/mongrel.rb:285:in `run'</p> <p>/usr/local/rvm/gems/ruby-1.8.7-p371/gems/mongrel-1.1.5/bin/../lib/mongrel.rb:268:in `initialize'</p> <p>/usr/local/rvm/gems/ruby-1.8.7-p371/gems/mongrel-1.1.5/bin/../lib/mongrel.rb:268:in `new'</p> <p>/usr/local/rvm/gems/ruby-1.8.7-p371/gems/mongrel-1.1.5/bin/../lib/mongrel.rb:268:in `run'</p> <p>/usr/local/rvm/gems/ruby-1.8.7-p371/gems/mongrel-1.1.5/bin/../lib/mongrel/configurator.rb:282:in `run'</p> <p>/usr/local/rvm/gems/ruby-1.8.7-p371/gems/mongrel-1.1.5/bin/../lib/mongrel/configurator.rb:281:in `each'</p> <p>/usr/local/rvm/gems/ruby-1.8.7-p371/gems/mongrel-1.1.5/bin/../lib/mongrel/configurator.rb:281:in `run'</p> <p>/usr/local/rvm/gems/ruby-1.8.7-p371/gems/mongrel-1.1.5/bin/mongrel_rails:128:in `run'</p> <p>/usr/local/rvm/gems/ruby-1.8.7-p371/gems/mongrel-1.1.5/bin/../lib/mongrel/command.rb:212:in `run'</p> <p>/usr/local/rvm/gems/ruby-1.8.7-p371/gems/mongrel-1.1.5/bin/mongrel_rails:281</p> <p>/usr/local/rvm/gems/ruby-1.8.7-p371/bin/mongrel_rails:19:in `load'</p> <p>/usr/local/rvm/gems/ruby-1.8.7-p371/bin/mongrel_rails:19Wed Feb 27 03:48:23 +0800 2013: Error calling Dispatcher.dispatch #&lt;Mongrel::TimeoutError: Mongrel timed out this thread: too many open files&gt;Thread #&lt;Thread:0x7f8d095e2958 sleep&gt; is too old, killing.</p> <p>*** buffer overflow detected ***: /usr/local/rvm/rubies/ruby-1.8.7-p371/bin/ruby terminated</p> <p>======= Backtrace: =========</p> <p>/lib/x86_64-linux-gnu/libc.so.6(__fortify_fail+0x37)[0x7f8d10d06807]</p> <p>/lib/x86_64-linux-gnu/libc.so.6(+0x109700)[0x7f8d10d05700]</p> <p>/lib/x86_64-linux-gnu/libc.so.6(+0x10a7be)[0x7f8d10d067be]</p> <p>/usr/local/rvm/rubies/ruby-1.8.7-p371/lib/libruby.so.1.8(+0x2fee3)[0x7f8d10feaee3]</p> <p>/usr/local/rvm/rubies/ruby-1.8.7-p371/lib/libruby.so.1.8(rb_thread_schedule+0x446)[0x7f8d10ff1466]</p> <p>/usr/local/rvm/rubies/ruby-1.8.7-p371/lib/libruby.so.1.8(rb_thread_fd_writable+0xf6)[0x7f8d11002b46]</p> <p>/usr/local/rvm/rubies/ruby-1.8.7-p371/lib/libruby.so.1.8(+0x59990)[0x7f8d11014990]</p> <p>/usr/local/rvm/rubies/ruby-1.8.7-p371/lib/libruby.so.1.8(+0x5a4eb)[0x7f8d110154eb]</p> <p>/usr/local/rvm/rubies/ruby-1.8.7-p371/lib/libruby.so.1.8(+0x5a819)[0x7f8d11015819]</p> <p>/usr/local/rvm/rubies/ruby-1.8.7-p371/lib/libruby.so.1.8(+0x3a042)[0x7f8d10ff5042]</p> <p>/usr/local/rvm/rubies/ruby-1.8.7-p371/lib/libruby.so.1.8(+0x3a2ef)[0x7f8d10ff52ef]</p> <p>/usr/local/rvm/rubies/ruby-1.8.7-p371/lib/libruby.so.1.8(+0x3f5db)[0x7f8d10ffa5db]</p> <p>/usr/local/rvm/rubies/ruby-1.8.7-p371/lib/libruby.so.1.8(+0x4285c)[0x7f8d10ffd85c]</p> <p>/usr/local/rvm/rubies/ruby-1.8.7-p371/lib/libruby.so.1.8(+0x39693)[0x7f8d10ff4693]</p> <p>/usr/local/rvm/rubies/ruby-1.8.7-p371/lib/libruby.so.1.8(+0x3a2ef)[0x7f8d10ff52ef]</p> <p>/usr/local/rvm/rubies/ruby-1.8.7-p371/lib/libruby.so.1.8(+0x41e24)[0x7f8d10ffce24]</p> <p>/usr/local/rvm/rubies/ruby-1.8.7-p371/lib/libruby.so.1.8(+0x39693)[0x7f8d10ff4693]</p> <p>/usr/local/rvm/rubies/ruby-1.8.7-p371/lib/libruby.so.1.8(+0x3a2ef)[0x7f8d10ff52ef]</p> <p>/usr/local/rvm/rubies/ruby-1.8.7-p371/lib/libruby.so.1.8(+0x3f745)[0x7f8d10ffa745]</p> <p>/usr/local/rvm/rubies/ruby-1.8.7-p371/lib/libruby.so.1.8(+0x39693)[0x7f8d10ff4693]</p> <p>/usr/local/rvm/rubies/ruby-1.8.7-p371/lib/libruby.so.1.8(+0x3a2ef)[0x7f8d10ff52ef]</p> <p>/usr/local/rvm/rubies/ruby-1.8.7-p371/lib/libruby.so.1.8(+0x3f5db)[0x7f8d10ffa5db]</p> <p>/usr/local/rvm/rubies/ruby-1.8.7-p371/lib/libruby.so.1.8(+0x40a50)[0x7f8d10ffba50]</p> <p>/usr/local/rvm/rubies/ruby-1.8.7-p371/lib/libruby.so.1.8(+0x417dd)[0x7f8d10ffc7dd]</p> <p>/usr/local/rvm/rubies/ruby-1.8.7-p371/lib/libruby.so.1.8(+0x4285c)[0x7f8d10ffd85c]</p> <p>/usr/local/rvm/rubies/ruby-1.8.7-p371/lib/libruby.so.1.8(+0x42a57)[0x7f8d10ffda57]</p> <p>/usr/local/rvm/rubies/ruby-1.8.7-p371/lib/libruby.so.1.8(+0x39693)[0x7f8d10ff4693]</p> <p>/usr/local/rvm/rubies/ruby-1.8.7-p371/lib/libruby.so.1.8(+0x3a2ef)[0x7f8d10ff52ef]</p> <p>/usr/local/rvm/rubies/ruby-1.8.7-p371/lib/libruby.so.1.8(+0x41e24)[0x7f8d10ffce24]</p> <p>/usr/local/rvm/rubies/ruby-1.8.7-p371/lib/libruby.so.1.8(+0x38032)[0x7f8d10ff3032]</p> <p>/usr/local/rvm/rubies/ruby-1.8.7-p371/lib/libruby.so.1.8(+0x49bf4)[0x7f8d11004bf4]</p> <p>/usr/local/rvm/rubies/ruby-1.8.7-p371/lib/libruby.so.1.8(+0x3a095)[0x7f8d10ff5095]</p> <p>/usr/local/rvm/rubies/ruby-1.8.7-p371/lib/libruby.so.1.8(+0x3a2ef)[0x7f8d10ff52ef]</p> <p>/usr/local/rvm/rubies/ruby-1.8.7-p371/lib/libruby.so.1.8(rb_funcall2+0x55)[0x7f8d10ff5665]</p> <p>/usr/local/rvm/rubies/ruby-1.8.7-p371/lib/libruby.so.1.8(rb_obj_call_init+0x56)[0x7f8d10ff5706]</p> <p>/usr/local/rvm/rubies/ruby-1.8.7-p371/lib/libruby.so.1.8(+0x3a76e)[0x7f8d10ff576e]</p> <p>/usr/local/rvm/rubies/ruby-1.8.7-p371/lib/libruby.so.1.8(+0x3a06f)[0x7f8d10ff506f]</p> <p>/usr/local/rvm/rubies/ruby-1.8.7-p371/lib/libruby.so.1.8(+0x3a2ef)[0x7f8d10ff52ef]</p> <p>/usr/local/rvm/rubies/ruby-1.8.7-p371/lib/libruby.so.1.8(+0x3f5db)[0x7f8d10ffa5db]</p> <p>/usr/local/rvm/rubies/ruby-1.8.7-p371/lib/libruby.so.1.8(+0x42f9f)[0x7f8d10ffdf9f]</p> <p>/usr/local/rvm/rubies/ruby-1.8.7-p371/lib/libruby.so.1.8(+0x40d83)[0x7f8d10ffbd83]</p> <p>/usr/local/rvm/rubies/ruby-1.8.7-p371/lib/libruby.so.1.8(+0x4285c)[0x7f8d10ffd85c]</p> <p>/usr/local/rvm/rubies/ruby-1.8.7-p371/lib/libruby.so.1.8(+0x417dd)[0x7f8d10ffc7dd]</p> <p>/usr/local/rvm/rubies/ruby-1.8.7-p371/lib/libruby.so.1.8(+0x42a57)[0x7f8d10ffda57]</p> <p>/usr/local/rvm/rubies/ruby-1.8.7-p371/lib/libruby.so.1.8(+0x38032)[0x7f8d10ff3032]</p> <p>/usr/local/rvm/rubies/ruby-1.8.7-p371/lib/libruby.so.1.8(+0x49bf4)[0x7f8d11004bf4]</p> <p>/usr/local/rvm/rubies/ruby-1.8.7-p371/lib/libruby.so.1.8(+0x3a095)[0x7f8d10ff5095]</p> <p>/usr/local/rvm/rubies/ruby-1.8.7-p371/lib/libruby.so.1.8(+0x3a2ef)[0x7f8d10ff52ef]</p> <p>/usr/local/rvm/rubies/ruby-1.8.7-p371/lib/libruby.so.1.8(rb_funcall2+0x55)[0x7f8d10ff5665]</p> <p>/usr/local/rvm/rubies/ruby-1.8.7-p371/lib/libruby.so.1.8(rb_obj_call_init+0x56)[0x7f8d10ff5706]</p> <p>/usr/local/rvm/rubies/ruby-1.8.7-p371/lib/libruby.so.1.8(+0x3a76e)[0x7f8d10ff576e]</p> <p>/usr/local/rvm/rubies/ruby-1.8.7-p371/lib/libruby.so.1.8(+0x3a06f)[0x7f8d10ff506f]</p> <p>/usr/local/rvm/rubies/ruby-1.8.7-p371/lib/libruby.so.1.8(+0x3a2ef)[0x7f8d10ff52ef]</p> <p>/usr/local/rvm/rubies/ruby-1.8.7-p371/lib/libruby.so.1.8(+0x3f5db)[0x7f8d10ffa5db]</p> <p>/usr/local/rvm/rubies/ruby-1.8.7-p371/lib/libruby.so.1.8(+0x42f9f)[0x7f8d10ffdf9f]</p> <p>/usr/local/rvm/rubies/ruby-1.8.7-p371/lib/libruby.so.1.8(+0x40df2)[0x7f8d10ffbdf2]</p> <p>/usr/local/rvm/rubies/ruby-1.8.7-p371/lib/libruby.so.1.8(+0x39693)[0x7f8d10ff4693]</p> <p>/usr/local/rvm/rubies/ruby-1.8.7-p371/lib/libruby.so.1.8(+0x3a2ef)[0x7f8d10ff52ef]</p> <p>/usr/local/rvm/rubies/ruby-1.8.7-p371/lib/libruby.so.1.8(+0x3f5db)[0x7f8d10ffa5db]</p> <p>/usr/local/rvm/rubies/ruby-1.8.7-p371/lib/libruby.so.1.8(+0x38032)[0x7f8d10ff3032]</p> <p>/usr/local/rvm/rubies/ruby-1.8.7-p371/lib/libruby.so.1.8(+0x537e7)[0x7f8d1100e7e7]</p> <p>/usr/local/rvm/rubies/ruby-1.8.7-p371/lib/libruby.so.1.8(+0x52d32)[0x7f8d1100dd32]</p> <p>/usr/local/rvm/rubies/ruby-1.8.7-p371/lib/libruby.so.1.8(st_foreach+0x4b)[0x7f8d110539ab]</p> <p>======= Memory map: ========</p> <p>00400000-00401000 r-xp 00000000 ca:01 137631                             /usr/local/rvm/rubies/ruby-1.8.7-p371/bin/ruby</p> <p>00600000-00601000 r--p 00000000 ca:01 137631                             /usr/local/rvm/rubies/ruby-1.8.7-p371/bin/ruby</p> <p>00601000-00602000 rw-p 00001000 ca:01 137631                             /usr/local/rvm/rubies/ruby-1.8.7-p371/bin/ruby</p> <p>01bcd000-02028000 rw-p 00000000 00:00 0                                  [heap]</p> <p>02028000-07130000 rw-p 00000000 00:00 0                                  [heap]</p> <p>7f8d02b84000-7f8d02bb0000 rw-p 00000000 00:00 0 </p> <p>7f8d03136000-7f8d0315c000 r-xp 00000000 ca:01 1048637                    /lib/x86_64-linux-gnu/libpng12.so.0.46.0</p> <p>7f8d0315c000-7f8d0335c000 ---p 00026000 ca:01 1048637                    /lib/x86_64-linux-gnu/libpng12.so.0.46.0</p> <p>7f8d0335c000-7f8d0335d000 r--p 00026000 ca:01 1048637                    /lib/x86_64-linux-gnu/libpng12.so.0.46.0</p> <p>7f8d0335d000-7f8d0335e000 rw-p 00027000 ca:01 1048637                    /lib/x86_64-linux-gnu/libpng12.so.0.46.0</p> <p>7f8d0335e000-7f8d0337f000 r-xp 00000000 ca:01 272308                     /usr/lib/ImageMagick-6.6.9/modules-Q16/coders/png.so</p> <p>7f8d0337f000-7f8d0357e000 ---p 00021000 ca:01 272308                     /usr/lib/ImageMagick-6.6.9/modules-Q16/coders/png.so</p> <p>7f8d0357e000-7f8d0357f000 r--p 00020000 ca:01 272308                     /usr/lib/ImageMagick-6.6.9/modules-Q16/coders/png.so</p> <p>7f8d0357f000-7f8d03580000 rw-p 00021000 ca:01 272308                     /usr/lib/ImageMagick-6.6.9/modules-Q16/coders/png.so</p> <p>7f8d03580000-7f8d035be000 r-xp 00000000 ca:01 1201056                    /usr/lib/x86_64-linux-gnu/libjpeg.so.8.0.2</p> <p>7f8d035be000-7f8d037be000 ---p 0003e000 ca:01 1201056                    /usr/lib/x86_64-linux-gnu/libjpeg.so.8.0.2</p> <p>7f8d037be000-7f8d037bf000 r--p 0003e000 ca:01 1201056                    /usr/lib/x86_64-linux-gnu/libjpeg.so.8.0.2</p> <p>7f8d037bf000-7f8d037c0000 rw-p 0003f000 ca:01 1201056                    /usr/lib/x86_64-linux-gnu/libjpeg.so.8.0.2</p> <p>7f8d037c0000-7f8d037d0000 rw-p 00000000 00:00 0 </p> <p>7f8d037d0000-7f8d037d9000 r-xp 00000000 ca:01 272360                     /usr/lib/ImageMagick-6.6.9/modules-Q16/coders/jpeg.so</p> <p>7f8d037d9000-7f8d039d8000 ---p 00009000 ca:01 272360                     /usr/lib/ImageMagick-6.6.9/modules-Q16/coders/jpeg.so</p> <p>7f8d039d8000-7f8d039d9000 r--p 00008000 ca:01 272360                     /usr/lib/ImageMagick-6.6.9/modules-Q16/coders/jpeg.so</p> <p>7f8d039d9000-7f8d039da000 rw-p 00009000 ca:01 272360                     /usr/lib/ImageMagick-6.6.9/modules-Q16/coders/jpeg.so</p> <p>7f8d039da000-7f8d039dc000 r-xp 00000000 ca:01 527047                     /usr/local/rvm/rubies/ruby-1.8.7-p371/lib/ruby/1.8/x86_64-linux/digest/md5.so</p> <p>7f8d039dc000-7f8d03bdb000 ---p 00002000 ca:01 527047                     /usr/local/rvm/rubies/ruby-1.8.7-p371/lib/ruby/1.8/x86_64-linux/digest/md5.so</p> <p>7f8d03bdb000-7f8d03bdc000 r--p 00001000 ca:01 527047                     /usr/local/rvm/rubies/ruby-1.8.7-p371/lib/ruby/1.8/x86_64-linux/digest/md5.so</p> <p>7f8d03bdc000-7f8d03bdd000 rw-p 00002000 ca:01 527047                     /usr/local/rvm/rubies/ruby-1.8.7-p371/lib/ruby/1.8/x86_64-linux/digest/md5.so</p> <p>7f8d03bdd000-7f8d03be9000 r-xp 00000000 ca:01 1048860                    /lib/x86_64-linux-gnu/libnss_files-2.15.so</p> <p>7f8d03be9000-7f8d03de8000 ---p 0000c000 ca:01 1048860                    /lib/x86_64-linux-gnu/libnss_files-2.15.so</p> <p>7f8d03de8000-7f8d03de9000 r--p 0000b000 ca:01 1048860                    /lib/x86_64-linux-gnu/libnss_files-2.15.so</p> <p>7f8d03de9000-7f8d03dea000 rw-p 0000c000 ca:01 1048860                    /lib/x86_64-linux-gnu/libnss_files-2.15.so</p> <p>7f8d03dea000-7f8d03dff000 r-xp 00000000 ca:01 1048621                    /lib/x86_64-linux-gnu/libgcc_s.so.1</p> <p>7f8d03dff000-7f8d03ffe000 ---p 00015000 ca:01 1048621                    /lib/x86_64-linux-gnu/libgcc_s.so.1</p> <p>7f8d03ffe000-7f8d03fff000 r--p 00014000 ca:01 1048621                    /lib/x86_64-linux-gnu/libgcc_s.so.1</p> <p>7f8d03fff000-7f8d04000000 rw-p 00015000 ca:01 1048621                    /lib/x86_64-linux-gnu/libgcc_s.so.1</p> <p>7f8d04000000-7f8d04021000 rw-p 00000000 00:00 0 </p> <p>7f8d04021000-7f8d08000000 ---p 00000000 00:00 0 </p> <p>7f8d08168000-7f8d08169000 ---p 00000000 00:00 0 </p> <p>7f8d08169000-7f8d08969000 rw-p 00000000 00:00 0 </p> <p>7f8d08969000-7f8d08c26000 r-xp 00000000 ca:01 1200292                    /usr/lib/x86_64-linux-gnu/libmysqlclient.so.18.0.0</p> <p>7f8d08c26000-7f8d08e25000 ---p 002bd000 ca:01 1200292                    /usr/lib/x86_64-linux-gnu/libmysqlclient.so.18.0.0</p> <p>7f8d08e25000-7f8d08e2b000 r--p 002bc000 ca:01 1200292                    /usr/lib/x86_64-linux-gnu/libmysqlclient.so.18.0.0</p> <p>7f8d08e2b000-7f8d08ea9000 rw-p 002c2000 ca:01 1200292                    /usr/lib/x86_64-linux-gnu/libmysqlclient.so.18.0.0</p> <p>7f8d08ea9000-7f8d08eae000 rw-p 00000000 00:00 0 </p> <p>7f8d08eae000-7f8d08ec5000 r-xp 00000000 ca:01 665436                     /usr/local/rvm/gems/ruby-1.8.7-p371/gems/mysql-2.9.0/lib/mysql/mysql_api.so</p> <p>7f8d08ec5000-7f8d090c4000 ---p 00017000 ca:01 665436                     /usr/local/rvm/gems/ruby-1.8.7-p371/gems/mysql-2.9.0/lib/mysql/mysql_api.so</p> <p>7f8d090c4000-7f8d090c5000 r--p 00016000 ca:01 665436                     /usr/local/rvm/gems/ruby-1.8.7-p371/gems/mysql-2.9.0/lib/mysql/mysql_api.so</p> <p>7f8d090c5000-7f8d090c6000 rw-p 00017000 ca:01 665436                     /usr/local/rvm/gems/ruby-1.8.7-p371/gems/mysql-2.9.0/lib/mysql/mysql_api.so</p> <p>7f8d090c6000-7f8d09dc0000 rw-p 00000000 00:00 0 </p> <p>7f8d09dc0000-7f8d09dc5000 r-xp 00000000 ca:01 1192729                    /usr/lib/x86_64-linux-gnu/libXdmcp.so.6.0.0</p> <p>7f8d09dc5000-7f8d09fc4000 ---p 00005000 ca:01 1192729                    /usr/lib/x86_64-linux-gnu/libXdmcp.so.6.0.0</p> <p>7f8d09fc4000-7f8d09fc5000 r--p 00004000 ca:01 1192729                    /usr/lib/x86_64-linux-gnu/libXdmcp.so.6.0.0</p> <p>7f8d09fc5000-7f8d09fc6000 rw-p 00005000 ca:01 1192729                    /usr/lib/x86_64-linux-gnu/libXdmcp.so.6.0.0</p> <p>7f8d09fc6000-7f8d09fc8000 r-xp 00000000 ca:01 1192727                    /usr/lib/x86_64-linux-gnu/libXau.so.6.0.0</p> <p>7f8d09fc8000-7f8d0a1c7000 ---p 00002000 ca:01 1192727                    /usr/lib/x86_64-linux-gnu/libXau.so.6.0.0</p> <p>7f8d0a1c7000-7f8d0a1c8000 r--p 00001000 ca:01 1192727                    /usr/lib/x86_64-linux-gnu/libXau.so.6.0.0</p> <p>7f8d0a1c8000-7f8d0a1c9000 rw-p 00002000 ca:01 1192727                    /usr/lib/x86_64-linux-gnu/libXau.so.6.0.0</p> <p>7f8d0a1c9000-7f8d0a205000 r-xp 00000000 ca:01 1048664                    /lib/x86_64-linux-gnu/libpcre.so.3.12.1</p> <p>7f8d0a205000-7f8d0a404000 ---p 0003c000 ca:01 1048664                    /lib/x86_64-linux-gnu/libpcre.so.3.12.1</p> <p>7f8d0a404000-7f8d0a405000 r--p 0003b000 ca:01 1048664                    /lib/x86_64-linux-gnu/libpcre.so.3.12.1</p> <p>7f8d0a405000-7f8d0a406000 rw-p 0003c000 ca:01 1048664                    /lib/x86_64-linux-gnu/libpcre.so.3.12.1</p> <p>7f8d0a406000-7f8d0a423000 r-xp 00000000 ca:01 1203329                    /usr/lib/x86_64-linux-gnu/libxcb.so.1.1.0</p> <p>7f8d0a423000-7f8d0a622000 ---p 0001d000 ca:01 1203329                    /usr/lib/x86_64-linux-gnu/libxcb.so.1.1.0</p> <p>7f8d0a622000-7f8d0a623000 r--p 0001c000 ca:01 1203329                    /usr/lib/x86_64-linux-gnu/libxcb.so.1.1.0</p> <p>7f8d0a623000-7f8d0a624000 rw-p 0001d000 ca:01 1203329                    /usr/lib/x86_64-linux-gnu/libxcb.so.1.1.0</p> <p>7f8d0a624000-7f8d0a64b000 r-xp 00000000 ca:01 1048888                    /lib/x86_64-linux-gnu/libexpat.so.1.5.2</p> <p>7f8d0a64b000-7f8d0a84b000 ---p 00027000 ca:01 1048888                    /lib/x86_64-linux-gnu/libexpat.so.1.5.2</p> <p>7f8d0a84b000-7f8d0a84d000 r--p 00027000 ca:01 1048888                    /lib/x86_64-linux-gnu/libexpat.so.1.5.2</p> <p>7f8d0a84d000-7f8d0a84e000 rw-p 00029000 ca:01 1048888                    /lib/x86_64-linux-gnu/libexpat.so.1.5.2</p> <p>7f8d0a84e000-7f8d0a940000 r-xp 00000000 ca:01 1048802                    /lib/x86_64-linux-gnu/libglib-2.0.so.0.3200.3</p> <p>7f8d0a940000-7f8d0ab40000 ---p 000f2000 ca:01 1048802                    /lib/x86_64-linux-gnu/libglib-2.0.so.0.3200.3</p> <p>7f8d0ab40000-7f8d0ab41000 r--p 000f2000 ca:01 1048802                    /lib/x86_64-linux-gnu/libglib-2.0.so.0.3200.3</p> <p>7f8d0ab41000-7f8d0ab42000 rw-p 000f3000 ca:01 1048802                    /lib/x86_64-linux-gnu/libglib-2.0.so.0.3200.3</p> <p>7f8d0ab42000-7f8d0ab43000 rw-p 00000000 00:00 0 </p> <p>7f8d0ab43000-7f8d0ab4b000 r-xp 00000000 ca:01 1200932                    /usr/lib/x86_64-linux-gnu/libltdl.so.7.3.0</p> <p>7f8d0ab4b000-7f8d0ad4b000 ---p 00008000 ca:01 1200932                    /usr/lib/x86_64-linux-gnu/libltdl.so.7.3.0</p> <p>7f8d0ad4b000-7f8d0ad4c000 r--p 00008000 ca:01 1200932                    /usr/lib/x86_64-linux-gnu/libltdl.so.7.3.0</p> <p>7f8d0ad4c000-7f8d0ad4d000 rw-p 00009000 ca:01 1200932                    /usr/lib/x86_64-linux-gnu/libltdl.so.7.3.0</p> <p>7f8d0ad4d000-7f8d0ad5a000 r-xp 00000000 ca:01 1180591                    /usr/lib/x86_64-linux-gnu/libgomp.so.1.0.0</p> <p>7f8d0ad5a000-7f8d0af59000 ---p 0000d000 ca:01 1180591                    /usr/lib/x86_64-linux-gnu/libgomp.so.1.0.0</p> <p>7f8d0af59000-7f8d0af5a000 r--p 0000c000 ca:01 1180591                    /usr/lib/x86_64-linux-gnu/libgomp.so.1.0.0</p> <p>7f8d0af5a000-7f8d0af5b000 rw-p 0000d000 ca:01 1180591                    /usr/lib/x86_64-linux-gnu/libgomp.so.1.0.0</p> <p>7f8d0af5b000-7f8d0af6a000 r-xp 00000000 ca:01 1048581                    /lib/x86_64-linux-gnu/libbz2.so.1.0.4</p> <p>7f8d0af6a000-7f8d0b169000 ---p 0000f000 ca:01 1048581                    /lib/x86_64-linux-gnu/libbz2.so.1.0.4</p> <p>7f8d0b169000-7f8d0b16a000 r--p 0000e000 ca:01 1048581                    /lib/x86_64-linux-gnu/libbz2.so.1.0.4</p> <p>7f8d0b16a000-7f8d0b16b000 rw-p 0000f000 ca:01 1048581                    /lib/x86_64-linux-gnu/libbz2.so.1.0.4</p> <p>7f8d0b16b000-7f8d0b29a000 r-xp 00000000 ca:01 1192736                    /usr/lib/x86_64-linux-gnu/libX11.so.6.3.0</p> <p>7f8d0b29a000-7f8d0b49a000 ---p 0012f000 ca:01 1192736                    /usr/lib/x86_64-linux-gnu/libX11.so.6.3.0</p> <p>7f8d0b49a000-7f8d0b49b000 r--p 0012f000 ca:01 1192736                    /usr/lib/x86_64-linux-gnu/libX11.so.6.3.0</p> <p>7f8d0b49b000-7f8d0b49f000 rw-p 00130000 ca:01 1192736                    /usr/lib/x86_64-linux-gnu/libX11.so.6.3.0</p> <p>7f8d0b49f000-7f8d0b4af000 r-xp 00000000 ca:01 1192738                    /usr/lib/x86_64-linux-gnu/libXext.so.6.4.0</p> <p>7f8d0b4af000-7f8d0b6ae000 ---p 00010000 ca:01 1192738                    /usr/lib/x86_64-linux-gnu/libXext.so.6.4.0</p> <p>7f8d0b6ae000-7f8d0b6af000 r--p 0000f000 ca:01 1192738                    /usr/lib/x86_64-linux-gnu/libXext.so.6.4.0</p> <p>7f8d0b6af000-7f8d0b6b0000 rw-p 00010000 ca:01 1192738                    /usr/lib/x86_64-linux-gnu/libXext.so.6.4.0</p> <p>7f8d0b6b0000-7f8d0b6e4000 r-xp 00000000 ca:01 1200884                    /usr/lib/x86_64-linux-gnu/libfontconfig.so.1.4.4</p> <p>7f8d0b6e4000-7f8d0b8e4000 ---p 00034000 ca:01 1200884                    /usr/lib/x86_64-linux-gnu/libfontconfig.so.1.4.4</p> <p>7f8d0b8e4000-7f8d0b8e5000 r--p 00034000 ca:01 1200884                    /usr/lib/x86_64-linux-gnu/libfontconfig.so.1.4.4</p> <p>7f8d0b8e5000-7f8d0b8e6000 rw-p 00035000 ca:01 1200884                    /usr/lib/x86_64-linux-gnu/libfontconfig.so.1.4.4</p> <p>7f8d0b8e6000-7f8d0b8f8000 r-xp 00000000 ca:01 1205504                    /usr/lib/liblqr-1.so.0.3.1</p> <p>7f8d0b8f8000-7f8d0baf8000 ---p 00012000 ca:01 1205504                    /usr/lib/liblqr-1.so.0.3.1</p> <p>7f8d0baf8000-7f8d0baf9000 r--p 00012000 ca:01 1205504                    /usr/lib/liblqr-1.so.0.3.1</p> <p>7f8d0baf9000-7f8d0bafa000 rw-p 00013000 ca:01 1205504                    /usr/lib/liblqr-1.so.0.3.1</p> <p>7f8d0bafa000-7f8d0bb90000 r-xp 00000000 ca:01 1191393                    /usr/lib/x86_64-linux-gnu/libfreetype.so.6.8.0</p> <p>7f8d0bb90000-7f8d0bd8f000 ---p 00096000 ca:01 1191393                    /usr/lib/x86_64-linux-gnu/libfreetype.so.6.8.0</p> <p>7f8d0bd8f000-7f8d0bd95000 r--p 00095000 ca:01 1191393                    /usr/lib/x86_64-linux-gnu/libfreetype.so.6.8.0</p> <p>7f8d0bd95000-7f8d0bd96000 rw-p 0009b000 ca:01 1191393                    /usr/lib/x86_64-linux-gnu/libfreetype.so.6.8.0</p> <p>7f8d0bd96000-7f8d0bdc9000 r-xp 00000000 ca:01 1203352                    /usr/lib/x86_64-linux-gnu/liblcms.so.1.0.19</p> <p>7f8d0bdc9000-7f8d0bfc9000 ---p 00033000 ca:01 1203352                    /usr/lib/x86_64-linux-gnu/liblcms.so.1.0.19</p> <p>7f8d0bfc9000-7f8d0bfca000 r--p 00033000 ca:01 1203352                    /usr/lib/x86_64-linux-gnu/liblcms.so.1.0.19</p> <p>7f8d0bfca000-7f8d0bfcb000 rw-p 00034000 ca:01 1203352                    /usr/lib/x86_64-linux-gnu/liblcms.so.1.0.19</p> <p>7f8d0bfcb000-7f8d0bfcd000 rw-p 00000000 00:00 0 </p> <p>7f8d0bfcd000-7f8d0c1de000 r-xp 00000000 ca:01 1205616                    /usr/lib/libMagickCore.so.4.0.1</p> <p>7f8d0c1de000-7f8d0c3de000 ---p 00211000 ca:01 1205616                    /usr/lib/libMagickCore.so.4.0.1</p> <p>7f8d0c3de000-7f8d0c3f0000 r--p 00211000 ca:01 1205616                    /usr/lib/libMagickCore.so.4.0.1</p> <p>7f8d0c3f0000-7f8d0c42f000 rw-p 00223000 ca:01 1205616                    /usr/lib/libMagickCore.so.4.0.1</p> <p>7f8d0c42f000-7f8d0c450000 rw-p 00000000 00:00 0 </p> <p>7f8d0c450000-7f8d0c4b3000 r-xp 00000000 ca:01 790199                     /usr/local/rvm/gems/ruby-1.8.7-p371/gems/rmagick-2.13.1/lib/RMagick2.so</p> <p>7f8d0c4b3000-7f8d0c6b3000 ---p 00063000 ca:01 790199                     /usr/local/rvm/gems/ruby-1.8.7-p371/gems/rmagick-2.13.1/lib/RMagick2.so</p> <p>7f8d0c6b3000-7f8d0c6b5000 r--p 00063000 ca:01 790199                     /usr/local/rvm/gems/ruby-1.8.7-p371/gems/rmagick-2.13.1/lib/RMagick2.so</p> <p>7f8d0c6b5000-7f8d0c6b6000 rw-p 00065000 ca:01 790199                     /usr/local/rvm/gems/ruby-1.8.7-p371/gems/rmagick-2.13.1/lib/RMagick2.so</p> <p>7f8d0c6b6000-7f8d0c6b7000 rw-p 00000000 00:00 0 </p> <p>7f8d0c6b7000-7f8d0c6ba000 r-xp 00000000 ca:01 527048                     /usr/local/rvm/rubies/ruby-1.8.7-p371/lib/ruby/1.8/x86_64-linux/digest/sha1.so</p> <p>7f8d0c6ba000-7f8d0c8b9000 ---p 00003000 ca:01 527048                     /usr/local/rvm/rubies/ruby-1.8.7-p371/lib/ruby/1.8/x86_64-linux/digest/sha1.so</p> <p>7f8d0c8b9000-7f8d0c8ba000 r--p 00002000 ca:01 527048                     /usr/local/rvm/rubies/ruby-1.8.7-p371/lib/ruby/1.8/x86_64-linux/digest/sha1.so</p> <p>7f8d0c8ba000-7f8d0c8bb000 rw-p 00003000 ca:01 527048                     /usr/local/rvm/rubies/ruby-1.8.7-p371/lib/ruby/1.8/x86_64-linux/digest/sha1.so</p> <p>7f8d0c8bb000-7f8d0cff1000 rw-p 00000000 00:00 0 </p> <p>7f8d0cff1000-7f8d0cff2000 r-xp 00000000 ca:01 269988                     /usr/local/rvm/rubies/ruby-1.8.7-p371/lib/ruby/1.8/x86_64-linux/fcntl.so</p> <p>7f8d0cff2000-7f8d0d1f1000 ---p 00001000 ca:01 269988                     /usr/local/rvm/rubies/ruby-1.8.7-p371/lib/ruby/1.8/x86_64-linux/fcntl.so</p> <p>7f8d0d1f1000-7f8d0d1f2000 r--p 00000000 ca:01 269988                     /usr/local/rvm/rubies/ruby-1.8.7-p371/lib/ruby/1.8/x86_64-linux/fcntl.so</p> <p>7f8d0d1f2000-7f8d0d1f3000 rw-p 00001000 ca:01 269988                     /usr/local/rvm/rubies/ruby-1.8.7-p371/lib/ruby/1.8/x86_64-linux/fcntl.so</p> <p>7f8d0d1f3000-7f8d0d1f6000 r-xp 00000000 ca:01 269980                     /usr/local/rvm/rubies/ruby-1.8.7-p371/lib/ruby/1.8/x86_64-linux/digest.so</p> <p>7f8d0d1f6000-7f8d0d3f5000 ---p 00003000 ca:01 269980                     /usr/local/rvm/rubies/ruby-1.8.7-p371/lib/ruby/1.8/x86_64-linux/digest.so</p> <p>7f8d0d3f5000-7f8d0d3f6000 r--p 00002000 ca:01 269980                     /usr/local/rvm/rubies/ruby-1.8.7-p371/lib/ruby/1.8/x86_64-linux/digest.so</p> <p>7f8d0d3f6000-7f8d0d3f7000 rw-p 00003000 ca:01 269980                     /usr/local/rvm/rubies/ruby-1.8.7-p371/lib/ruby/1.8/x86_64-linux/digest.so</p> <p>7f8d0d3f7000-7f8d0d596000 r-xp 00000000 ca:01 1048616                    /lib/x86_64-linux-gnu/libcrypto.so.1.0.0</p> <p>7f8d0d596000-7f8d0d795000 ---p 0019f000 ca:01 1048616                    /lib/x86_64-linux-gnu/libcrypto.so.1.0.0</p> <p>7f8d0d795000-7f8d0d7b0000 r--p 0019e000 ca:01 1048616                    /lib/x86_64-linux-gnu/libcrypto.so.1.0.0</p> <p>7f8d0d7b0000-7f8d0d7bb000 rw-p 001b9000 ca:01 1048616                    /lib/x86_64-linux-gnu/libcrypto.so.1.0.0</p> <p>7f8d0d7bb000-7f8d0d7bf000 rw-p 00000000 00:00 0 </p> <p>7f8d0d7bf000-7f8d0d811000 r-xp 00000000 ca:01 1048613                    /lib/x86_64-linux-gnu/libssl.so.1.0.0</p> <p>7f8d0d811000-7f8d0da11000 ---p 00052000 ca:01 1048613                    /lib/x86_64-linux-gnu/libssl.so.1.0.0</p> <p>7f8d0da11000-7f8d0da14000 r--p 00052000 ca:01 1048613                    /lib/x86_64-linux-gnu/libssl.so.1.0.0</p> <p>7f8d0da14000-7f8d0da1a000 rw-p 00055000 ca:01 1048613                    /lib/x86_64-linux-gnu/libssl.so.1.0.0</p> <p>7f8d0da1a000-7f8d0da1b000 rw-p 00000000 00:00 0 </p> <p>7f8d0da1b000-7f8d0da60000 r-xp 00000000 ca:01 533788                     /usr/local/rvm/rubies/ruby-1.8.7-p371/lib/ruby/site_ruby/1.8/x86_64-linux/openssl.so</p> <p>7f8d0da60000-7f8d0dc5f000 ---p 00045000 ca:01 533788                     /usr/local/rvm/rubies/ruby-1.8.7-p371/lib/ruby/site_ruby/1.8/x86_64-linux/openssl.so</p> <p>7f8d0dc5f000-7f8d0dc60000 r--p 00044000 ca:01 533788                     /usr/local/rvm/rubies/ruby-1.8.7-p371/lib/ruby/site_ruby/1.8/x86_64-linux/openssl.so</p> <p>7f8d0dc60000-7f8d0dc62000 rw-p 00045000 ca:01 533788                     /usr/local/rvm/rubies/ruby-1.8.7-p371/lib/ruby/site_ruby/1.8/x86_64-linux/openssl.so</p> <p>7f8d0dc62000-7f8d0dc66000 r-xp 00000000 ca:01 527044                     /usr/local/rvm/rubies/ruby-1.8.7-p371/lib/ruby/1.8/x86_64-linux/racc/cparse.so</p> <p>7f8d0dc66000-7f8d0de65000 ---p 00004000 ca:01 527044                     /usr/local/rvm/rubies/ruby-1.8.7-p371/lib/ruby/1.8/x86_64-linux/racc/cparse.so</p> <p>7f8d0de65000-7f8d0de66000 r--p 00003000 ca:01 527044                     /usr/local/rvm/rubies/ruby-1.8.7-p371/lib/ruby/1.8/x86_64-linux/racc/cparse.so</p> <p>7f8d0de66000-7f8d0de67000 rw-p 00004000 ca:01 527044                     /usr/local/rvm/rubies/ruby-1.8.7-p371/lib/ruby/1.8/x86_64-linux/racc/cparse.so</p> <p>7f8d0de67000-7f8d0de6b000 r-xp 00000000 ca:01 269983                     /usr/local/rvm/rubies/ruby-1.8.7-p371/lib/ruby/1.8/x86_64-linux/strscan.so</p> <p>7f8d0de6b000-7f8d0e06b000 ---p 00004000 ca:01 269983                     /usr/local/rvm/rubies/ruby-1.8.7-p371/lib/ruby/1.8/x86_64-linux/strscan.so</p> <p>7f8d0e06b000-7f8d0e06c000 r--p 00004000 ca:01 269983                     /usr/local/rvm/rubies/ruby-1.8.7-p371/lib/ruby/1.8/x86_64-linux/strscan.so</p> <p>7f8d0e06c000-7f8d0e06d000 rw-p 00005000 ca:01 269983                     /usr/local/rvm/rubies/ruby-1.8.7-p371/lib/ruby/1.8/x86_64-linux/strscan.so</p> <p>7f8d0e06d000-7f8d0e071000 r-xp 00000000 ca:01 269986                     /usr/local/rvm/rubies/ruby-1.8.7-p371/lib/ruby/1.8/x86_64-linux/iconv.so</p> <p>7f8d0e071000-7f8d0e270000 ---p 00004000 ca:01 269986                     /usr/local/rvm/rubies/ruby-1.8.7-p371/lib/ruby/1.8/x86_64-linux/iconv.so</p> <p>7f8d0e270000-7f8d0e271000 r--p 00003000 ca:01 269986                     /usr/local/rvm/rubies/ruby-1.8.7-p371/lib/ruby/1.8/x86_64-linux/iconv.so</p> <p>7f8d0e271000-7f8d0e272000 rw-p 00004000 ca:01 269986                     /usr/local/rvm/rubies/ruby-1.8.7-p371/lib/ruby/1.8/x86_64-linux/iconv.so</p> <p>7f8d0e272000-7f8d0e27d000 r-xp 00000000 ca:01 269974                     /usr/local/rvm/rubies/ruby-1.8.7-p371/lib/ruby/1.8/x86_64-linux/bigdecimal.so</p> <p>7f8d0e27d000-7f8d0e47c000 ---p 0000b000 ca:01 269974                     /usr/local/rvm/rubies/ruby-1.8.7-p371/lib/ruby/1.8/x86_64-linux/bigdecimal.so</p> <p>7f8d0e47c000-7f8d0e47d000 r--p 0000a000 ca:01 269974                     /usr/local/rvm/rubies/ruby-1.8.7-p371/lib/ruby/1.8/x86_64-linux/bigdecimal.so</p> <p>7f8d0e47d000-7f8d0e47e000 rw-p 0000b000 ca:01 269974                     /usr/local/rvm/rubies/ruby-1.8.7-p371/lib/ruby/1.8/x86_64-linux/bigdecimal.so</p> <p>7f8d0e47e000-7f8d0e4bb000 r-xp 00000000 ca:01 269981                     /usr/local/rvm/rubies/ruby-1.8.7-p371/lib/ruby/1.8/x86_64-linux/nkf.so</p> <p>7f8d0e4bb000-7f8d0e6ba000 ---p 0003d000 ca:01 269981                     /usr/local/rvm/rubies/ruby-1.8.7-p371/lib/ruby/1.8/x86_64-linux/nkf.so</p> <p>7f8d0e6ba000-7f8d0e6be000 r--p 0003c000 ca:01 269981                     /usr/local/rvm/rubies/ruby-1.8.7-p371/lib/ruby/1.8/x86_64-linux/nkf.so</p> <p>7f8d0e6be000-7f8d0e6bf000 rw-p 00040000 ca:01 269981                     /usr/local/rvm/rubies/ruby-1.8.7-p371/lib/ruby/1.8/x86_64-linux/nkf.so</p> <p>7f8d0e6bf000-7f8d0e6c0000 rw-p 00000000 00:00 0 </p> <p>7f8d0e6c0000-7f8d0eac2000 rw-p 00000000 00:00 0 </p> <p>7f8d0eac2000-7f8d0ead8000 r-xp 00000000 ca:01 1048805                    /lib/x86_64-linux-gnu/libz.so.1.2.3.4</p> <p>7f8d0ead8000-7f8d0ecd7000 ---p 00016000 ca:01 1048805                    /lib/x86_64-linux-gnu/libz.so.1.2.3.4</p> <p>7f8d0ecd7000-7f8d0ecd8000 r--p 00015000 ca:01 1048805                    /lib/x86_64-linux-gnu/libz.so.1.2.3.4</p> <p>7f8d0ecd8000-7f8d0ecd9000 rw-p 00016000 ca:01 1048805                    /lib/x86_64-linux-gnu/libz.so.1.2.3.4</p> <p>7f8d0ecd9000-7f8d0ece2000 r-xp 00000000 ca:01 527604                     /usr/local/rvm/rubies/ruby-1.8.7-p371/lib/ruby/site_ruby/1.8/x86_64-linux/zlib.so</p> <p>7f8d0ece2000-7f8d0eee1000 ---p 00009000 ca:01 527604                     /usr/local/rvm/rubies/ruby-1.8.7-p371/lib/ruby/site_ruby/1.8/x86_64-linux/zlib.so</p> <p>7f8d0eee1000-7f8d0eee2000 r--p 00008000 ca:01 527604                     /usr/local/rvm/rubies/ruby-1.8.7-p371/lib/ruby/site_ruby/1.8/x86_64-linux/zlib.so</p> <p>7f8d0eee2000-7f8d0eee3000 rw-p 00009000 ca:01 527604                     /usr/local/rvm/rubies/ruby-1.8.7-p371/lib/ruby/site_ruby/1.8/x86_64-linux/zlib.so</p> <p>7f8d0eee3000-7f8d0eee7000 r-xp 00000000 ca:01 661384                     /usr/local/rvm/gems/ruby-1.8.7-p371/gems/fastthread-1.0.7/lib/fastthread.so</p> <p>7f8d0eee7000-7f8d0f0e6000 ---p 00004000 ca:01 661384                     /usr/local/rvm/gems/ruby-1.8.7-p371/gems/fastthread-1.0.7/lib/fastthread.so</p> <p>7f8d0f0e6000-7f8d0f0e7000 r--p 00003000 ca:01 661384                     /usr/local/rvm/gems/ruby-1.8.7-p371/gems/fastthread-1.0.7/lib/fastthread.so</p> <p>7f8d0f0e7000-7f8d0f0e8000 rw-p 00004000 ca:01 661384                     /usr/local/rvm/gems/ruby-1.8.7-p371/gems/fastthread-1.0.7/lib/fastthread.so</p> <p>7f8d0f0e8000-7f8d0f0ed000 r-xp 00000000 ca:01 661484                     /usr/local/rvm/gems/ruby-1.8.7-p371/gems/mongrel-1.1.5/lib/http11.so</p> <p>7f8d0f0ed000-7f8d0f2ed000 ---p 00005000 ca:01 661484                     /usr/local/rvm/gems/ruby-1.8.7-p371/gems/mongrel-1.1.5/lib/http11.so</p> <p>7f8d0f2ed000-7f8d0f2ee000 r--p 00005000 ca:01 661484                     /usr/local/rvm/gems/ruby-1.8.7-p371/gems/mongrel-1.1.5/lib/http11.so</p> <p>7f8d0f2ee000-7f8d0f2ef000 rw-p 00006000 ca:01 661484                     /usr/local/rvm/gems/ruby-1.8.7-p371/gems/mongrel-1.1.5/lib/http11.so</p> <p>7f8d0f2ef000-7f8d0f2fa000 r-xp 00000000 ca:01 269984                     /usr/local/rvm/rubies/ruby-1.8.7-p371/lib/ruby/1.8/x86_64-linux/socket.so</p> <p>7f8d0f2fa000-7f8d0f4f9000 ---p 0000b000 ca:01 269984                     /usr/local/rvm/rubies/ruby-1.8.7-p371/lib/ruby/1.8/x86_64-linux/socket.so</p> <p>7f8d0f4f9000-7f8d0f4fa000 r--p 0000a000 ca:01 269984                     /usr/local/rvm/rubies/ruby-1.8.7-p371/lib/ruby/1.8/x86_64-linux/socket.so</p> <p>7f8d0f4fa000-7f8d0f4fb000 rw-p 0000b000 ca:01 269984                     /usr/local/rvm/rubies/ruby-1.8.7-p371/lib/ruby/1.8/x86_64-linux/socket.so</p> <p>7f8d0f4fb000-7f8d0f4fd000 r-xp 00000000 ca:01 269978                     /usr/local/rvm/rubies/ruby-1.8.7-p371/lib/ruby/1.8/x86_64-linux/etc.so</p> <p>7f8d0f4fd000-7f8d0f6fc000 ---p 00002000 ca:01 269978                     /usr/local/rvm/rubies/ruby-1.8.7-p371/lib/ruby/1.8/x86_64-linux/etc.so</p> <p>7f8d0f6fc000-7f8d0f6fd000 r--p 00001000 ca:01 269978                     /usr/local/rvm/rubies/ruby-1.8.7-p371/lib/ruby/1.8/x86_64-linux/etc.so</p> <p>7f8d0f6fd000-7f8d0f6fe000 rw-p 00002000 ca:01 269978                     /usr/local/rvm/rubies/ruby-1.8.7-p371/lib/ruby/1.8/x86_64-linux/etc.so</p> <p>7f8d0f6fe000-7f8d0f938000 rw-p 00000000 00:00 0 </p> <p>7f8d0f938000-7f8d0f955000 r-xp 00000000 ca:01 269975                     /usr/local/rvm/rubies/ruby-1.8.7-p371/lib/ruby/1.8/x86_64-linux/syck.so</p> <p>7f8d0f955000-7f8d0fb54000 ---p 0001d000 ca:01 269975                     /usr/local/rvm/rubies/ruby-1.8.7-p371/lib/ruby/1.8/x86_64-linux/syck.so</p> <p>7f8d0fb54000-7f8d0fb55000 r--p 0001c000 ca:01 269975                     /usr/local/rvm/rubies/ruby-1.8.7-p371/lib/ruby/1.8/x86_64-linux/syck.so</p> <p>7f8d0fb55000-7f8d0fb56000 rw-p 0001d000 ca:01 269975                     /usr/local/rvm/rubies/ruby-1.8.7-p371/lib/ruby/1.8/x86_64-linux/syck.so</p> <p>7f8d0fb56000-7f8d0fb5b000 r-xp 00000000 ca:01 269982                     /usr/local/rvm/rubies/ruby-1.8.7-p371/lib/ruby/1.8/x86_64-linux/stringio.so</p> <p>7f8d0fb5b000-7f8d0fd5a000 ---p 00005000 ca:01 269982                     /usr/local/rvm/rubies/ruby-1.8.7-p371/lib/ruby/1.8/x86_64-linux/stringio.so</p> <p>7f8d0fd5a000-7f8d0fd5b000 r--p 00004000 ca:01 269982                     /usr/local/rvm/rubies/ruby-1.8.7-p371/lib/ruby/1.8/x86_64-linux/stringio.so</p> <p>7f8d0fd5b000-7f8d0fd5c000 rw-p 00005000 ca:01 269982                     /usr/local/rvm/rubies/ruby-1.8.7-p371/lib/ruby/1.8/x86_64-linux/stringio.so</p> <p>7f8d0fd5c000-7f8d0fe99000 rw-p 00000000 00:00 0 </p> <p>7f8d0fe99000-7f8d0fe9d000 r-xp 00000000 ca:01 269979                     /usr/local/rvm/rubies/ruby-1.8.7-p371/lib/ruby/1.8/x86_64-linux/thread.so</p> <p>7f8d0fe9d000-7f8d1009c000 ---p 00004000 ca:01 269979                     /usr/local/rvm/rubies/ruby-1.8.7-p371/lib/ruby/1.8/x86_64-linux/thread.so</p> <p>7f8d1009c000-7f8d1009d000 r--p 00003000 ca:01 269979                     /usr/local/rvm/rubies/ruby-1.8.7-p371/lib/ruby/1.8/x86_64-linux/thread.so</p> <p>7f8d1009d000-7f8d1009e000 rw-p 00004000 ca:01 269979                     /usr/local/rvm/rubies/ruby-1.8.7-p371/lib/ruby/1.8/x86_64-linux/thread.so</p> <p>7f8d1009e000-7f8d100b6000 r-xp 00000000 ca:01 1048851                    /lib/x86_64-linux-gnu/libpthread-2.15.so</p> <p>7f8d100b6000-7f8d102b5000 ---p 00018000 ca:01 1048851                    /lib/x86_64-linux-gnu/libpthread-2.15.so</p> <p>7f8d102b5000-7f8d102b6000 r--p 00017000 ca:01 1048851                    /lib/x86_64-linux-gnu/libpthread-2.15.so</p> <p>7f8d102b6000-7f8d102b7000 rw-p 00018000 ca:01 1048851                    /lib/x86_64-linux-gnu/libpthread-2.15.so</p> <p>7f8d102b7000-7f8d102bb000 rw-p 00000000 00:00 0 </p> <p>7f8d102bb000-7f8d103b6000 r-xp 00000000 ca:01 1048858                    /lib/x86_64-linux-gnu/libm-2.15.so</p> <p>7f8d103b6000-7f8d105b5000 ---p 000fb000 ca:01 1048858                    /lib/x86_64-linux-gnu/libm-2.15.so</p> <p>7f8d105b5000-7f8d105b6000 r--p 000fa000 ca:01 1048858                    /lib/x86_64-linux-gnu/libm-2.15.so</p> <p>7f8d105b6000-7f8d105b7000 rw-p 000fb000 ca:01 1048858                    /lib/x86_64-linux-gnu/libm-2.15.so</p> <p>7f8d105b7000-7f8d105c0000 r-xp 00000000 ca:01 1048859                    /lib/x86_64-linux-gnu/libcrypt-2.15.so</p> <p>7f8d105c0000-7f8d107c0000 ---p 00009000 ca:01 1048859                    /lib/x86_64-linux-gnu/libcrypt-2.15.so</p> <p>7f8d107c0000-7f8d107c1000 r--p 00009000 ca:01 1048859                    /lib/x86_64-linux-gnu/libcrypt-2.15.so</p> <p>7f8d107c1000-7f8d107c2000 rw-p 0000a000 ca:01 1048859                    /lib/x86_64-linux-gnu/libcrypt-2.15.so</p> <p>7f8d107c2000-7f8d107f0000 rw-p 00000000 00:00 0 </p> <p>7f8d107f0000-7f8d107f2000 r-xp 00000000 ca:01 1048847                    /lib/x86_64-linux-gnu/libdl-2.15.so</p> <p>7f8d107f2000-7f8d109f2000 ---p 00002000 ca:01 1048847                    /lib/x86_64-linux-gnu/libdl-2.15.so</p> <p>7f8d109f2000-7f8d109f3000 r--p 00002000 ca:01 1048847                    /lib/x86_64-linux-gnu/libdl-2.15.so</p> <p>7f8d109f3000-7f8d109f4000 rw-p 00003000 ca:01 1048847                    /lib/x86_64-linux-gnu/libdl-2.15.so</p> <p>7f8d109f4000-7f8d109fb000 r-xp 00000000 ca:01 1048854                    /lib/x86_64-linux-gnu/librt-2.15.so</p> <p>7f8d109fb000-7f8d10bfa000 ---p 00007000 ca:01 1048854                    /lib/x86_64-linux-gnu/librt-2.15.so</p> <p>7f8d10bfa000-7f8d10bfb000 r--p 00006000 ca:01 1048854                    /lib/x86_64-linux-gnu/librt-2.15.so</p> <p>7f8d10bfb000-7f8d10bfc000 rw-p 00007000 ca:01 1048854                    /lib/x86_64-linux-gnu/librt-2.15.so</p> <p>7f8d10bfc000-7f8d10db1000 r-xp 00000000 ca:01 1048848                    /lib/x86_64-linux-gnu/libc-2.15.so</p> <p>7f8d10db1000-7f8d10fb0000 ---p 001b5000 ca:01 1048848                    /lib/x86_64-linux-gnu/libc-2.15.so</p> <p>7f8d10fb0000-7f8d10fb4000 r--p 001b4000 ca:01 1048848                    /lib/x86_64-linux-gnu/libc-2.15.so</p> <p>7f8d10fb4000-7f8d10fb6000 rw-p 001b8000 ca:01 1048848                    /lib/x86_64-linux-gnu/libc-2.15.so</p> <p>7f8d10fb6000-7f8d10fbb000 rw-p 00000000 00:00 0 </p> <p>7f8d10fbb000-7f8d1109e000 r-xp 00000000 ca:01 137632                     /usr/local/rvm/rubies/ruby-1.8.7-p371/lib/libruby.so.1.8.7</p> <p>7f8d1109e000-7f8d1129d000 ---p 000e3000 ca:01 137632                     /usr/local/rvm/rubies/ruby-1.8.7-p371/lib/libruby.so.1.8.7</p> <p>7f8d1129d000-7f8d1129f000 r--p 000e2000 ca:01 137632                     /usr/local/rvm/rubies/ruby-1.8.7-p371/lib/libruby.so.1.8.7</p> <p>7f8d1129f000-7f8d112a2000 rw-p 000e4000 ca:01 137632                     /usr/local/rvm/rubies/ruby-1.8.7-p371/lib/libruby.so.1.8.7</p> <p>7f8d112a2000-7f8d112c0000 rw-p 00000000 00:00 0 </p> <p>7f8d112c0000-7f8d112e2000 r-xp 00000000 ca:01 1048866                    /lib/x86_64-linux-gnu/ld-2.15.so</p> <p>7f8d113ac000-7f8d113ad000 rw-p 00000000 00:00 0 </p> <p>7f8d113b6000-7f8d113b8000 rw-p 00000000 00:00 0 </p> <p>7f8d113b8000-7f8d113bf000 r--s 00000000 ca:01 1181850                    /usr/lib/x86_64-linux-gnu/gconv/gconv-modules.cache</p> <p>7f8d113bf000-7f8d114d6000 rw-p 00000000 00:00 0 </p> <p>7f8d114d6000-7f8d114e0000 rw-p 00000000 00:00 0 </p> <p>7f8d114e0000-7f8d114e2000 rw-p 00000000 00:00 0 </p> <p>7f8d114e2000-7f8d114e3000 r--p 00022000 ca:01 1048866                    /lib/x86_64-linux-gnu/ld-2.15.so</p> <p>7f8d114e3000-7f8d114e5000 rw-p 00023000 ca:01 1048866                    /lib/x86_64-linux-gnu/ld-2.15.so</p> <p>7fff6b532000-7fff6b57d000 rw-p 00000000 00:00 0                          [stack]</p> <p>7fff6b5de000-7fff6b5df000 r-xp 00000000 00:00 0                          [vdso]</p> <p>ffffffffff600000-ffffffffff601000 r-xp 00000000 00:00 0                  [vsyscall]</p> </div>
libpng在安装的时候出现的make[1]: *** [libpng12.la] 错误 1
make[1]: *** [libpng12.la] 错误 1 make[1]: Leaving directory `/usr/local/src/libpng-1.2.31' make: *** [all] 错误
安装gd库报错,求指导。。。。。。
./configure --prefix=/usr/local/gd2/ --with-zlib=/usr/local/zlib/ --with-jpeg=/usr/local/jpeg6/ --with-png=/usr/local/libpng/ --with-freetype=/usr/local/freetype configure: WARNING: unrecognized options: --with-zlib 有个警告,怎么才能解决啊,有安装zlib
ubantu在IDE中运行caffe-ssd报错, invalid pointer 但是使用终端可以运行
环境:ubantu 16.04 caffe-ssd cuda 8 cudnn 5.1 python 2.7 无论是在终端还是在IDE中都可以make 编译通过,运行时报错。笔者认为是程序的版本问题,所依赖的库不一样。google了多次终于在终端不报错了。原因是没有环境变量, 在在环境变量中添加上一句: export LD_PRELOAD="/usr/lib/libtcmalloc_minimal.so.4" 终端便可以运行 但是使用IDE是还是报一模一样的错误。。。求助!!!!!! 问题错误报告如下: *** Error in `/home/zsy/DeepLearning/caffe-ssd/cmake-build-debug/tools/caffe-d': free(): invalid pointer: 0x00000000012c32c0 *** ======= Backtrace: ========= /lib/x86_64-linux-gnu/libc.so.6(+0x777e5)[0x7fb47c36a7e5] /lib/x86_64-linux-gnu/libc.so.6(+0x8037a)[0x7fb47c37337a] /lib/x86_64-linux-gnu/libc.so.6(cfree+0x4c)[0x7fb47c37753c] /usr/lib/x86_64-linux-gnu/libprotobuf.so.9(_ZN6google8protobuf8internal28DestroyDefaultRepeatedFieldsEv+0x1f)[0x7fb47d6e38af] /usr/lib/x86_64-linux-gnu/libprotobuf.so.9(_ZN6google8protobuf23ShutdownProtobufLibraryEv+0x8b)[0x7fb47d6e2b3b] /usr/lib/x86_64-linux-gnu/libmirprotobuf.so.3(+0x233b9)[0x7fb457b6b3b9] /lib64/ld-linux-x86-64.so.2(+0x10de7)[0x7fb47eeb2de7] /lib/x86_64-linux-gnu/libc.so.6(+0x39ff8)[0x7fb47c32cff8] /lib/x86_64-linux-gnu/libc.so.6(+0x3a045)[0x7fb47c32d045] /lib/x86_64-linux-gnu/libc.so.6(__libc_start_main+0xf7)[0x7fb47c313837] /home/zsy/DeepLearning/caffe-ssd/cmake-build-debug/tools/caffe-d(_start+0x29)[0x435439] ======= Memory map: ======== 00400000-0045b000 r-xp 00000000 08:13 12717978 /home/zsy/DeepLearning/caffe-ssd/cmake-build-debug/tools/caffe-d 0065a000-0065b000 r--p 0005a000 08:13 12717978 /home/zsy/DeepLearning/caffe-ssd/cmake-build-debug/tools/caffe-d 0065b000-0065c000 rw-p 0005b000 08:13 12717978 /home/zsy/DeepLearning/caffe-ssd/cmake-build-debug/tools/caffe-d 012b1000-0149a000 rw-p 00000000 00:00 0 [heap] 7fb44c000000-7fb44c021000 rw-p 00000000 00:00 0 7fb44c021000-7fb450000000 ---p 00000000 00:00 0 7fb453368000-7fb453369000 ---p 00000000 00:00 0 7fb453369000-7fb453b69000 rwxp 00000000 00:00 0 7fb453b69000-7fb453b6c000 r-xp 00000000 08:12 267232 /lib/x86_64-linux-gnu/libkeyutils.so.1.5 7fb453b6c000-7fb453d6b000 ---p 00003000 08:12 267232 /lib/x86_64-linux-gnu/libkeyutils.so.1.5 7fb453d6b000-7fb453d6c000 r--p 00002000 08:12 267232 /lib/x86_64-linux-gnu/libkeyutils.so.1.5 7fb453d6c000-7fb453d6d000 rw-p 00003000 08:12 267232 /lib/x86_64-linux-gnu/libkeyutils.so.1.5 7fb453d6d000-7fb453d77000 r-xp 00000000 08:12 1058069 /usr/lib/x86_64-linux-gnu/libkrb5support.so.0.1 7fb453d77000-7fb453f76000 ---p 0000a000 08:12 1058069 /usr/lib/x86_64-linux-gnu/libkrb5support.so.0.1 7fb453f76000-7fb453f77000 r--p 00009000 08:12 1058069 /usr/lib/x86_64-linux-gnu/libkrb5support.so.0.1 7fb453f77000-7fb453f78000 rw-p 0000a000 08:12 1058069 /usr/lib/x86_64-linux-gnu/libkrb5support.so.0.1 7fb453f78000-7fb453f7b000 r-xp 00000000 08:12 267180 /lib/x86_64-linux-gnu/libcom_err.so.2.1 7fb453f7b000-7fb45417a000 ---p 00003000 08:12 267180 /lib/x86_64-linux-gnu/libcom_err.so.2.1 7fb45417a000-7fb45417b000 r--p 00002000 08:12 267180 /lib/x86_64-linux-gnu/libcom_err.so.2.1 7fb45417b000-7fb45417c000 rw-p 00003000 08:12 267180 /lib/x86_64-linux-gnu/libcom_err.so.2.1 7fb45417c000-7fb4541a8000 r-xp 00000000 08:12 1058059 /usr/lib/x86_64-linux-gnu/libk5crypto.so.3.1 7fb4541a8000-7fb4543a7000 ---p 0002c000 08:12 1058059 /usr/lib/x86_64-linux-gnu/libk5crypto.so.3.1 7fb4543a7000-7fb4543a9000 r--p 0002b000 08:12 1058059 /usr/lib/x86_64-linux86_64-linux-gnu/libgme.so.0.6.0 7fb459f8e000-7fb45a18e000 ---p 0004a000 08:12 1052793 /usr/lib/x86_64-linux-gnu/libgme.so.0.6.0 7fb45a18e000-7fb45a191000 r--p 0004a000 08:12 1052793 /usr/lib/x86_64-linux-gnu/libgme.so.0.6.0 7fb45a191000-7fb45a192000 rw-p 0004d000 08:12 1052793 /usr/lib/x86_64-linux-gnu/libgme.so.0.6.0 7fb45a192000-7fb45a1dc000 r-xp 00000000 08:12 1052795 /usr/lib/x86_64-linux-gnu/libmodplug.so.1.0.0 7fb45a1dc000-7fb45a3dc000 ---p 0004a000 08:12 1052795 /usr/lib/x86_64-linux-gnu/libmodplug.so.1.0.0 7fb45a3dc000-7fb45a3dd000 r--p 0004a000 08:12 1052795 /usr/lib/x86_64-linux-gnu/libmodplug.so.1.0.0 7fb45a3dd000-7fb45a3de000 rw-p 0004b000 08:12 1052795 /usr/lib/x86_64-linux-gnu/libmodplug.so.1.0.0 7fb45a3de000-7fb45a51d000 rw-p 00000000 00:00 0 7fb45a51d000-7fb45a538000 r-xp 00000000 08:12 1058384 /usr/lib/x86_64-linux-gnu/librtmp.so.1 7fb45a538000-7fb45a737000 ---p 0001b000 08:12 1058384 /usr/lib/x86_64-linux-gnu/librtmp.so.1 7fb45a737000-7fb45a738000 r--p 0001a000 08:12 1058384 /usr/lib/x86_64-linux-gnu/librtmp.so.1 7fb45a738000-7fb45a739000 rw-p 0001b000 08:12 1058384 /usr/lib/x86_64-linux-gnu/librtmp.so.1 7fb45a739000-7fb45a781000 r-xp 00000000 08:12 1052797 /usr/lib/x86_64-linux-gnu/libssh-gcrypt.so.4.4.1 7fb45a781000-7fb45a980000 ---p 00048000 08:12 1052797 /usr/lib/x86_64-linux-gnu/libssh-gcrypt.so.4.4.1 7fb45a980000-7fb45a981000 r--p 00047000 08:12 1052797 /usr/lib/x86_64-linux-gnu/libssh-gcrypt.so.4.4.1 7fb45a981000-7fb45a982000 rw-p 00048000 08:12 1052797 /usr/lib/x86_64-linux-gnu/libssh-gcrypt.so.4.4.1 7fb45a982000-7fb45a99c000 r-xp 00000000 08:12 1052753 /usr/lib/x86_64-linux-gnu/libcrystalhd.so.3.6 7fb45a99c000-7fb45ab9b000 ---p 0001a000 08:12 1052753 /usr/lib/x86_64-linux-gnu/libcrystalhd.so.3.6 7fb45ab9b000-7fb45ab9c000 r--p 00019000 08:12 1052753 /usr/lib/x86_64-linux-gnu/libcrystalhd.so.3.6 7fb45ab9c000-7fb45ab9d000 rw-p 0001a000 08:12 1052753 /usr/lib/x86_64-linux-gnu/libcrystalhd.so.3.6 7fb45ab9d000-7fb45abaa000 r-xp 00000000 08:12 1052755 /usr/lib/x86_64-linux-gnu/libgsm.so.1.0.12 7fb45abaa000-7fb45ada9000 ---p 0000d000 08:12 1052755 /usr/lib/x86_64-linux-gnu/libgsm.so.1.0.12 7fb45ada9000-7fb45adaa000 r--p 0000c000 08:12 1052755 /usr/lib/x86_64-linux-gnu/libgsm.so.1.0.12 7fb45adaa000-7fb45adab000 rw-p 0000d000 08:12 1052755 /usr/lib/x86_64-linux-gnu/libgsm.so.1.0.12 7fb45adab000-7fb45adf0000 r-xp 00000000 08:12 1052757 /usr/lib/x86_64-linux-gnu/libmp3lame.so.0.0.0 7fb45adf0000-7fb45aff0000 ---p 00045000 08:12 1052757 /usr/lib/x86_64-linux-gnu/libmp3lame.so.0.0.0 7fb45aff0000-7fb45aff1000 r--p 00045000 08:12 1052757 /usr/lib/x86_64-linux-gnu/libmp3lame.so.0.0.0 7fb45aff1000-7fb45aff2000 rw-p 00046000 08:12 1052757 /usr/lib/x86_64-linux-gnu/libmp3lame.so.0.0.0 7fb45aff2000-7fb45b020000 rw-p 00000000 00:00 0 7fb45b020000-7fb45b042000 r-xp 00000000 08:12 1052760 /usr/lib/x86_64-linux-gnu/libopenjpeg.so.1.5.2 7fb45b042000-7fb45b241000 ---p 00022000 08:12 1052760 /usr/lib/x86_64-linux-gnu/libopenjpeg.so.1.5.2 7fb45b241000-7fb45b242000 r--p 00021000 08:12 1052760 /usr/lib/x86_64-linux-gnu/libopenjpeg.so.1.5.2 7fb45b242000-7fb45b243000 rw-p 00022000 08:12 1052760 /usr/lib/x86_64-linux-gnu/libopenjpeg.so.1.5.2 7fb45b243000-7fb45b28c000 r-xp 00000000 08:12 1058240 /usr/lib/x86_64-linux-gnu/libopus.so.0.5.2 7fb45b28c000-7fb45b48b000 ---p 00049000 08:12 1058240 /usr/lib/x86_64-linux-gnu/libopus.so.0.5.2 7fb45b48b000-7fb45b48c000 r--p 00048000 08:12 1058240 /usr/lib/x86_64-linux-gnu/libopus.so.0.5.2 7fb45b48c000-7fb45b48d000 rw-p 00049000 08:12 1058240 /usr/lib/x86_64-linux-gnu/libopus.so.0.5.2 7fb45b48d000-7fb45b55e000 r-xp 00000000 08:12 1052763 /usr/lib/x86_64-linux-gnu/libschroedinger-1.0.so.0.11.0 7fb45b55e000-7fb45b75e000 ---p 000d1000 08:12 1052763 /usr/lib/x86_64-linux-gnu/libschroedinger-1.0.so.0.11.0 7fb45b75e000-7fb45b760000 r--p 000d1000 08:12 1052763 /usr/lib/x86_64-linux-gnu/libschroedinger-1.0.so.0.11.0 7fb45b760000-7fb45b761000 rw-p 000d3000 08:12 1052763 /usr/lib/x86_64-linux-gnu/libschroedinger-1.0.so.0.11.0 7fb45b761000-7fb45b762000 rw-p 00000000 00:00 0 7fb45b762000-7fb45b76e000 r-xp 00000000 08:12 1052767 /usr/lib/x86_64-linux-gnu/libshine.so.3.0.1 7fb45b76e000-7fb45b96d000 ---p 0000c000 08:12 1052767 /usr/lib/x86_64-linux-gnu/libshine.so.3.0.1 7fb45b96d000-7fb45b96e000 r--p 0000b000 08:12 1052767 /usr/lib/x86_64-linux-gnu/libshine.so.3.0.1 7fb45b96e000-7fb45b96f000 rw-p 0000c000 08:12 1052767 /usr/lib/x86_64-linux-gnu/libshine.so.3.0.1 7fb45b96f000-7fb45b986000 r-xp 00000000 08:12 1058458 /usr/lib/x86_64-linux-gnu/libspeex.so.1.5.0 7fb45b986000-7fb45bb86000 ---p 00017000 08:12 1058458 /usr/lib/x86_64-linux-gnu/libspeex.so.1.5.0 7fb45bb86000-7fb45bb87000 r--p 00017000 08:12 1058458 /usr/lib/x86_64-linux-gnu/libspeex.so.1.5.0 7fb45bb87000-7fb45bb88000 rw-p 00018000 08:12 1058458 /usr/lib/x86_64-linux-gnu/libspeex.so.1.5.0 7fb45bb88000-7fb45bba1000 r-xp 00000000 08:12 1058497 /usr/lib/x86_64-linux-gnu/libtheoradec.so.1.1.4 7fb45bba1000-7fb45bda0000 ---p 00019000 08:12 1058497 /usr/lib/x86_64-linux-gnu/libtheoradec.so.1.1.4 7fb45bda0000-7fb45bda1000 r--p 00018000 08:12 1058497 /usr/lib/x86_64-linux-gnu/libtheoradec.so.1.1.4 7fb45bda1000-7fb45bda2000 rw-p 00019000 08:12 1058497 /usr/lib/x86_64-linux-gnu/libtheoradec.so.1.1.4 7fb45bda2000-7fb45bde0000 r-xp 00000000 08:12 1058499 /usr/lib/x86_64-linux-gnu/libtheoraenc.so.1.1.2 7fb45bde0000-7fb45bfdf000 ---p 0003e000 08:12 1058499 /usr/lib/x86_64-linux-gnu/libtheoraenc.so.1.1.2 7fb45bfdf000-7fb45bfe0000 r--p 0003d000 08:12 1058499 /usr/lib/x86_64-linux-gnu/libtheoraenc.so.1.1.2 7fb45bfe0000-7fb45bfe1000 rw-p 0003e000 08:12 1058499 /usr/lib/x86_64-linux-gnu/libtheoraenc.so.1.1.2 7fb45bfe1000-7fb45bfff000 r-xp 00000000 08:12 1052775 /usr/lib/x86_64-linux-gnu/libtwolame.so.0.0.0 7fb45bfff000-7fb45c1fe000 ---p 0001e000 08:12 1052775 /usr/lib/x86_64-linux-gnu/libtwolame.so.0.0.0 7fb45c1fe000-7fb45c1ff000 r--p 0001d000 08:12 1052775 /usr/lib/x86_64-linux-gnu/libtwolame.so.0.0.0 7fb45c1ff000-7fb45c200000 rw-p 0001e000 08:12 1052775 /usr/lib/x86_64-linux-gnu/libtwolame.so.0.0.0 7fb45c200000-7fb45c204000 rw-p 00000000 00:00 0 7fb45c204000-7fb45c22e000 r-xp 00000000 08:12 1052328 /usr/lib/x86_64-linux-gnu/libvorbis.so.0.4.8 7fb45c22e000-7fb45c42d000 ---p 0002a000 08:12 1052328 /usr/lib/x86_64-linux-gnu/libvorbis.so.0.4.8 7fb45c42d000-7fb45c42e000 r--p 00029000 08:12 1052328 /usr/lib/x86_64-linux-gnu/libvorbis.so.0.4.8 7fb45c42e000-7fb45c42f000 rw-p 0002a000 08:12 1052328 /usr/lib/x86_64-linux-gnu/libvorbis.so.0.4.8 7fb45c42f000-7fb45c4bc000 r-xp 00000000 08:12 1052326 /usr/lib/x86_64-linux-gnu/libvorbisenc.so.2.0.11 7fb45c4bc000-7fb45c6bb000 ---p 0008d000 08:12 1052326 /usr/lib/x86_64-linux-gnu/libvorbisenc.so.2.0.11 7fb45c6bb000-7fb45c6d7000 r--p 0008c000 08:12 1052326 /usr/lib/x86_64-linux-gnu/libvorbisenc.so.2.0.11 7fb45c6d7000-7fb45c6d8000 rw-p 000a8000 08:12 1052326 /usr/lib/x86_64-linux-gnu/libvorbisenc.so.2.0.11 7fb45c6d8000-7fb45c8f7000 r-xp 00000000 08:12 1058603 /usr/lib/x86_64-linux-gnu/libvpx.so.3.0.0 7fb45c8f7000-7fb45caf6000 ---p 0021f000 08:12 1058603 /usr/lib/x86_64-linux-gnu/libvpx.so.3.0.0 7fb45caf6000-7fb45caf8000 r--p 0021e000 08:12 1058603 /usr/lib/x86_64-linux-gnu/libvpx.so.3.0.0 7fb45caf8000-7fb45caf9000 rw-p 00220000 08:12 1058603 /usr/lib/x86_64-linux-gnu/libvpx.so.3.0.0 7fb45caf9000-7fb45cafc000 rw-p 00000000 00:00 0 7fb45cafc000-7fb45cb24000 r-xp 00000000 08:12 1052330 /usr/lib/x86_64-linux-gnu/libwavpack.so.1.1.7 7fb45cb24000-7fb45cd23000 ---p 00028000 08:12 1052330 /usr/lib/x86_64-linux-gnu/libwavpack.so.1.1.7 7fb45cd23000-7fb45cd24000 r--p 00027000 08:12 1052330 /usr/lib/x86_64-linux-gnu/libwavpack.so.1.1.7 7fb45cd24000-7fb45cd25000 rw-p 00028000 08:12 1052330 /usr/lib/x86_64-linux-gnu/libwavpack.so.1.1.7 7fb45cd25000-7fb45cd7e000 r-xp 00000000 08:12 1058623 /usr/lib/x86_64-linux-gnu/libwebp.so.5.0.4 7fb45cd7e000-7fb45cf7e000 ---p 00059000 08:12 1058623 /usr/lib/x86_64-linux-gnu/libwebp.so.5.0.4 7fb45cf7e000-7fb45cf7f000 r--p 00059000 08:12 1058623 /usr/lib/x86_64-linux-gnu/libwebp.so.5.0.4 7fb45cf7f000-7fb45cf81000 rw-p 0005a000 08:12 1058623 /usr/lib/x86_64-linux-gnu/libwebp.so.5.0.4 7fb45cf81000-7fb45d0a9000 r-xp 00000000 08:12 1052781 /usr/lib/x86_64-linux-gnu/libx264.so.148 7fb45d0a9000-7fb45d2a8000 ---p 00128000 08:12 1052781 /usr/lib/x86_64-linux-gnu/libx264.so.148 7fb45d2a8000-7fb45d2a9000 r--p 00127000 08:12 1052781 /usr/lib/x86_64-linux-gnu/libx264.so.148 7fb45f9f5000-7fb45fa99000 r-xp 00000000 08:12 1057741 /usr/lib/x86_64-linux-gnu/libfreetype.so.6.12.1 7fb45fa99000-7fb45fc98000 ---p 000a4000 08:12 1057741 /usr/lib/x86_64-linux-gnu/libfreetype.so.6.12.1 7fb45fc98000-7fb45fc9e000 r--p 000a3000 08:12 1057741 /usr/lib/x86_64-linux-gnu/libfreetype.so.6.12.1 7fb45fc9e000-7fb45fc9f000 rw-p 000a9000 08:12 1057741 /usr/lib/x86_64-linux-gnu/libfreetype.so.6.12.1 7fb45fc9f000-7fb45fd3e000 r-xp 00000000 08:12 1058292 /usr/lib/x86_64-linux-gnu/libpixman-1.so.0.33.6 7fb45fd3e000-7fb45ff3e000 ---p 0009f000 08:12 1058292 /usr/lib/x86_64-linux-gnu/libpixman-1.so.0.33.6 7fb45ff3e000-7fb45ff46000 r--p 0009f000 08:12 1058292 /usr/lib/x86_64-linux-gnu/libpixman-1.so.0.33.6 7fb45ff46000-7fb45ff47000 rw-p 000a7000 08:12 1058292 /usr/lib/x86_64-linux-gnu/libpixman-1.so.0.33.6 7fb45ff47000-7fb45ff58000 r-xp 00000000 08:12 1057316 /usr/lib/x86_64-linux-gnu/libXext.so.6.4.0 7fb45ff58000-7fb460157000 ---p 00011000 08:12 1057316 /usr/lib/x86_64-linux-gnu/libXext.so.6.4.0 7fb460157000-7fb460158000 r--p 00010000 08:12 1057316 /usr/lib/x86_64-linux-gnu/libXext.so.6.4.0 7fb460158000-7fb460159000 rw-p 00011000 08:12 1057316 /usr/lib/x86_64-linux-gnu/libXext.so.6.4.0 7fb460159000-7fb4601f9000 r-xp 00000000 08:12 1057754 /usr/lib/x86_64-linux-gnu/libmirclient.so.9 7fb4601f9000-7fb4603f8000 ---p 000a0000 08:12 1057754 /usr/lib/x86_64-linux-gnu/libmirclient.so.9 7fb4603f8000-7fb4603fe000 r--p 0009f000 08:12 1057754 /usr/lib/x86_64-linux-gnu/libmirclient.so.9 7fb4603fe000-7fb460400000 rw-p 000a5000 08:12 1057754 /usr/lib/x86_64-linux-gnu/libmirclient.so.9 7fb460400000-7fb46040c000 r-xp 00000000 08:12 1072790 /usr/lib/x86_64-linux-gnu/libwayland-client.so.0.3.0 7fb46040c000-7fb46060c000 ---p 0000c000 08:12 1072790 /usr/lib/x86_64-linux-gnu/libwayland-client.so.0.3.0 7fb46060c000-7fb46060e000 r--p 0000c000 08:12 1072790 /usr/lib/x86_64-linux-gnu/libwayland-client.so.0.3.0 7fb46060e000-7fb46060f000 rw-p 0000e000 08:12 1072790 /usr/lib/x86_64-linux-gnu/libwayland-client.so.0.3.0 7fb46060f000-7fb460610000 r-xp 00000000 08:12 1072787 /usr/lib/x86_64-linux-gnu/libwayland-egl.so.1.0.0 7fb460610000-7fb46080f000 ---p 00001000 08:12 1072787 /usr/lib/x86_64-linux-gnu/libwayland-egl.so.1.0.0 7fb46080f000-7fb460810000 r--p 00000000 08:12 1072787 /usr/lib/x86_64-linux-gnu/libwayland-egl.so.1.0.0 7fb460810000-7fb460811000 rw-p 00001000 08:12 1072787 /usr/lib/x86_64-linux-gnu/libwayland-egl.so.1.0.0 7fb460811000-7fb460815000 r-xp 00000000 08:12 1072815 /usr/lib/x86_64-linux-gnu/libwayland-cursor.so.0.0.0 7fb460815000-7fb460a14000 ---p 00004000 08:12 1072815 /usr/lib/x86_64-linux-gnu/libwayland-cursor.so.0.0.0 7fb460a14000-7fb460a15000 r--p 00003000 08:12 1072815 /usr/lib/x86_64-linux-gnu/libwayland-cursor.so.0.0.0 7fb460a15000-7fb460a19000 rw-p 00004000 08:12 1072815 /usr/lib/x86_64-linux-gnu/libwayland-cursor.so.0.0.0 7fb460a19000-7fb460a56000 r-xp 00000000 08:12 1058725 /usr/lib/x86_64-linux-gnu/libxkbcommon.so.0.0.0 7fb460a56000-7fb460c55000 ---p 0003d000 08:12 1058725 /usr/lib/x86_64-linux-gnu/libxkbcommon.so.0.0.0 7fb460c55000-7fb460c57000 r--p 0003c000 08:12 1058725 /usr/lib/x86_64-linux-gnu/libxkbcommon.so.0.0.0 7fb460c57000-7fb460c58000 rw-p 0003e000 08:12 1058725 /usr/lib/x86_64-linux-gnu/libxkbcommon.so.0.0.0 7fb460c58000-7fb460c5a000 r-xp 00000000 08:12 1057312 /usr/lib/x86_64-linux-gnu/libXdamage.so.1.1.0 7fb460c5a000-7fb460e59000 ---p 00002000 08:12 1057312 /usr/lib/x86_64-linux-gnu/libXdamage.so.1.1.0 7fb460e59000-7fb460e5a000 r--p 00001000 08:12 1057312 /usr/lib/x86_64-linux-gnu/libXdamage.so.1.1.0 7fb460e5a000-7fb460e5b000 rw-p 00002000 08:12 1057312 /usr/lib/x86_64-linux-gnu/libXdamage.so.1.1.0 7fb460e5b000-7fb460e5d000 r-xp 00000000 08:12 1057308 /usr/lib/x86_64-linux-gnu/libXcomposite.so.1.0.0 7fb460e5d000-7fb46105c000 ---p 00002000 08:12 1057308 /usr/lib/x86_64-linux-gnu/libXcomposite.so.1.0.0 7fb46105c000-7fb46105d000 r--p 00001000 08:12 1057308 /usr/lib/x86_64-linux-gnu/libXcomposite.so.1.0.0 7fb46105d000-7fb46105e000 rw-p 00002000 08:12 1057308 /usr/lib/x86_64-linux-gnu/libXcomposite.so.1.0.0 7fb46105e000-7fb461067000 r-xp 00000000 08:12 1049155 /usr/lib/x86_64-linux-gnu/libXcursor.so.1.0.2 7fb461067000-7fb461266000 ---p 00009000 08:12 1049155 /usr/lib/x86_64-linux-gnu/libXcursor.so.1.0.2 7fb461266000-7fb461267000 r--p 00008000 08:12 1049155 /usr/lib/x86_64-linux-gnu/libXcursor.so.1.0.2 7fb461267000-7fb461268000 rw-p 00009000 08:12 1049155 /usr/lib/x86_64-linux-gnu/libXcursor.so.1.0.2 7fb461268000-7fb461272000 r-xp 00000000 08:12 1057336 /usr/lib/x86_64-linux-gnu/libXrandr.so.2.2.0 7fb461272000-7fb461471000 ---p 0000a000 08:12 1057336 /usr/lib/x86_64-linux-gnu/libXrandr.so.2.2.0 7fb461471000-7fb461472000 r--p 00009000 08:12 1057336 /usr/lib/x86_64-linux-gnu/libXrandr.so.2.2.0 7fb461472000-7fb461473000 rw-p 0000a000 08:12 1057336 /usr/lib/x86_64-linux-gnu/libXrandr.so.2.2.0 7fb461473000-7fb461475000 r-xp 00000000 08:12 1057328 /usr/lib/x86_64-linux-gnu/libXinerama.so.1.0.0 7fb461475000-7fb461674000 ---p 00002000 08:12 1057328 /usr/lib/x86_64-linux-gnu/libXinerama.so.1.0.0 7fb461674000-7fb461675000 r--p 00001000 08:12 1057328 /usr/lib/x86_64-linux-gnu/libXinerama.so.1.0.0 7fb461675000-7fb461676000 rw-p 00002000 08:12 1057328 /usr/lib/x86_64-linux-gnu/libXinerama.so.1.0.0 7fb461676000-7fb4617f6000 r-xp 00000000 08:12 1048814 /usr/lib/x86_64-linux-gnu/libgio-2.0.so.0.4800.2 7fb4617f6000-7fb4619f6000 ---p 00180000 08:12 1048814 /usr/lib/x86_64-linux-gnu/libgio-2.0.so.0.4800.2 7fb4619f6000-7fb4619fa000 r--p 00180000 08:12 1048814 /usr/lib/x86_64-linux-gnu/libgio-2.0.so.0.4800.2 7fb4619fa000-7fb4619fc000 rw-p 00184000 08:12 1048814 /usr/lib/x86_64-linux-gnu/libgio-2.0.so.0.4800.2 7fb4619fc000-7fb4619fe000 rw-p 00000000 00:00 0 7fb4619fe000-7fb461a3b000 r-xp 00000000 08:12 1057707 /usr/lib/x86_64-linux-gnu/libfontconfig.so.1.9.0 7fb461a3b000-7fb461c3a000 ---p 0003d000 08:12 1057707 /usr/lib/x86_64-linux-gnu/libfontconfig.so.1.9.0 7fb461c3a000-7fb461c3c000 r--p 0003c000 08:12 1057707 /usr/lib/x86_64-linux-gnu/libfontconfig.so.1.9.0 7fb461c3c000-7fb461c41000 rw-p 0003e000 08:12 1057707 /usr/lib/x86_64-linux-gnu/libfontconfig.so.1.9.0 7fb461c41000-7fb461c8a000 r-xp 00000000 08:12 1058262 /usr/lib/x86_64-linux-gnu/libpango-1.0.so.0.3800.1 7fb461c8a000-7fb461e8a000 ---p 00049000 08:12 1058262 /usr/lib/x86_64-linux-gnu/libpango-1.0.so.0.3800.1 7fb461e8a000-7fb461e8c000 r--p 00049000 08:12 1058262 /usr/lib/x86_64-linux-gnu/libpango-1.0.so.0.3800.1 7fb461e8c000-7fb461e8d000 rw-p 0004b000 08:12 1058262 /usr/lib/x86_64-linux-gnu/libpango-1.0.so.0.3800.1 7fb461e8d000-7fb461ea1000 r-xp 00000000 08:12 1058266 /usr/lib/x86_64-linux-gnu/libpangoft2-1.0.so.0.3800.1 7fb461ea1000-7fb4620a1000 ---p 00014000 08:12 1058266 /usr/lib/x86_64-linux-gnu/libpangoft2-1.0.so.0.3800.1 7fb4620a1000-7fb4620a2000 r--p 00014000 08:12 1058266 /usr/lib/x86_64-linux-gnu/libpangoft2-1.0.so.0.3800.1 7fb4620a2000-7fb4620a3000 rw-p 00015000 08:12 1058266 /usr/lib/x86_64-linux-gnu/libpangoft2-1.0.so.0.3800.1 7fb4620a3000-7fb46218a000 r-xp 00000000 08:12 1057657 /usr/lib/x86_64-linux-gnu/libepoxy.so.0.0.0 7fb46218a000-7fb46238a000 ---p 000e7000 08:12 1057657 /usr/lib/x86_64-linux-gnu/libepoxy.so.0.0.0 7fb46238a000-7fb462391000 r--p 000e7000 08:12 1057657 /usr/lib/x86_64-linux-gnu/libepoxy.so.0.0.0 7fb462391000-7fb462398000 rw-p 000ee000 08:12 1057657 /usr/lib/x86_64-linux-gnu/libepoxy.so.0.0.0 7fb462398000-7fb4623c5000 r-xp 00000000 08:12 1057411 /usr/lib/x86_64-linux-gnu/libatk-bridge-2.0.so.0.0.0 7fb4623c5000-7fb4625c4000 ---p 0002d000 08:12 1057411 /usr/lib/x86_64-linux-gnu/libatk-bridge-2.0.so.0.0.0 7fb4625c4000-7fb4625c5000 r--p 0002c000 08:12 1057411 /usr/lib/x86_64-linux-gnu/libatk-bridge-2.0.so.0.0.0 7fb4625c5000-7fb4625c7000 rw-p 0002d000 08:12 1057411 /usr/lib/x86_64-linux-gnu/libatk-bridge-2.0.so.0.0.0 7fb4625c7000-7fb4625e9000 r-xp 00000000 08:12 1057409 /usr/lib/x86_64-linux-gnu/libatk-1.0.so.0.21809.1 7fb4625e9000-7fb4627e8000 ---p 00022000 08:12 1057409 /usr/lib/x86_64-linux-gnu/libatk-1.0.so.0.21809.1 7fb4627e8000-7fb4627eb000 r--p 00021000 08:12 1057409 /usr/lib/x86_64-linux-gnu/libatk-1.0.so.0.21809.1 7fb4627eb000-7fb4627ec000 rw-p 00024000 08:12 1057409 /usr/lib/x86_64-linux-gnu/libatk-1.0.so.0.21809.1 7fb4627ec000-7fb4627f2000 r-xp 00000000 08:12 1057464 /usr/lib/x86_64-linux-gnu/libcairo-gobject.so.2.11400.6 7fb4627f2000-7fb4629f2000 ---p 00006000 08:12 1057464 /usr/lib/x86_64-linux-gnu/libcairo-gobject.so.2.11400.6 7fb4629f2000-7fb4629f4000 r--p 00006000 08:12 1057464 /usr/lib/x86_64-linux-gnu/libcairo-gobject.so.2.11400.6 7fb4629f4000-7fb4629f5000 rw-p 00008000 08:12 1057464 /usr/lib/x86_64-linux-gnu/libcairo-gobject.so.2.11400.6 7fb4629f5000-7fb4629fa000 r-xp 00000000 08:12 1057318 /usr/lib/x86_64-linux-gnu/libXfixes.so.3.1.0 7fb4629fa000-7fb462bf9000 ---p 00005000 08:12 1057318 /usr/lib/x86_64-linux-gnu/libXfixes.so.3.1.0 7fb462bf9000-7fb462bfa000 r--p 00004000 08:12 1057318 /usr/lib/x86_64-linux-gnu/libXfixes.so.3.1.0 7fb462bfa000-7fb462bfb000 rw-p 00005000 08:12 1057318 /usr/lib/x86_64-linux-gnu/libXfixes.so.3.1.0 7fb462bfb000-7fb462c0a000 r-xp 00000000 08:12 1057326 /usr/lib/x86_64-linux-gnu/libXi.so.6.1.0 7fb462c0a000-7fb462e09000 ---p 0000f000 08:12 1057326 /usr/lib/x86_64-linux-gnu/libXi.so.6.1.0 7fb462e09000-7fb462e0a000 r--p 0000e000 08:12 1057326 /usr/lib/x86_64-linux-gnu/libXi.so.6.1.0 7fb462e0a000-7fb462e0b000 rw-p 0000f000 08:12 1057326 /usr/lib/x86_64-linux-gnu/libXi.so.6.1.0 7fb462e0b000-7fb462f40000 r-xp 00000000 08:12 1049053 /usr/lib/x86_64-linux-gnu/libX11.so.6.3.0 7fb462f40000-7fb463140000 ---p 00135000 08:12 1049053 /usr/lib/x86_64-linux-gnu/libX11.so.6.3.0 7fb463140000-7fb463141000 r--p 00135000 08:12 1049053 /usr/lib/x86_64-linux-gnu/libX11.so.6.3.0 7fb463141000-7fb463145000 rw-p 00136000 08:12 1049053 /usr/lib/x86_64-linux-gnu/libX11.so.6.3.0 7fb463145000-7fb463151000 r-xp 00000000 08:12 1058264 /usr/lib/x86_64-linux-gnu/libpangocairo-1.0.so.0.3800.1 7fb463151000-7fb463350000 ---p 0000c000 08:12 1058264 /usr/lib/x86_64-linux-gnu/libpangocairo-1.0.so.0.3800.1 7fb463350000-7fb463351000 r--p 0000b000 08:12 1058264 /usr/lib/x86_64-linux-gnu/libpangocairo-1.0.so.0.3800.1 7fb463351000-7fb463352000 rw-p 0000c000 08:12 1058264 /usr/lib/x86_64-linux-gnu/libpangocairo-1.0.so.0.3800.1 7fb463352000-7fb463355000 r-xp 00000000 08:12 1048810 /usr/lib/x86_64-linux-gnu/libgmodule-2.0.so.0.4800.2 7fb463355000-7fb463554000 ---p 00003000 08:12 1048810 /usr/lib/x86_64-linux-gnu/libgmodule-2.0.so.0.4800.2 7fb463554000-7fb463555000 r--p 00002000 08:12 1048810 /usr/lib/x86_64-linux-gnu/libgmodule-2.0.so.0.4800.2 7fb463555000-7fb463556000 rw-p 00003000 08:12 1048810 /usr/lib/x86_64-linux-gnu/libgmodule-2.0.so.0.4800.2 7fb463556000-7fb46355d000 r-xp 00000000 08:12 1048903 /usr/lib/x86_64-linux-gnu/libaec.so.0.0.3 7fb46355d000-7fb46375c000 ---p 00007000 08:12 1048903 /usr/lib/x86_64-linux-gnu/libaec.so.0.0.3 7fb46375c000-7fb46375d000 r--p 00006000 08:12 1048903 /usr/lib/x86_64-linux-gnu/libaec.so.0.0.3 7fb46375d000-7fb46375e000 rw-p 00007000 08:12 1048903 /usr/lib/x86_64-linux-gnu/libaec.so.0.0.3 7fb46375e000-7fb465014000 r-xp 00000000 08:12 1046853 /usr/lib/x86_64-linux-gnu/libicudata.so.55.1 7fb465014000-7fb465213000 ---p 018b6000 08:12 1046853 /usr/lib/x86_64-linux-gnu/libicudata.so.55.1 7fb465213000-7fb465214000 r--p 018b5000 08:12 1046853 /usr/lib/x86_64-linux-gnu/libicudata.so.55.1 7fb465214000-7fb465215000 rw-p 018b6000 08:12 1046853 /usr/lib/x86_64-linux-gnu/libicudata.so.55.1 7fb465215000-7fb465236000 r-xp 00000000 08:12 267238 /lib/x86_64-linux-gnu/liblzma.so.5.0.0 7fb465236000-7fb465435000 ---p 00021000 08:12 267238 /lib/x86_64-linux-gnu/liblzma.so.5.0.0 7fb465435000-7fb465436000 r--p 00020000 08:12 267238 /lib/x86_64-linux-gnu/liblzma.so.5.0.0 7fb465436000-7fb465437000 rw-p 00021000 08:12 267238 /lib/x86_64-linux-gnu/liblzma.so.5.0.0 7fb465437000-7fb465479000 r-xp 00000000 08:12 1057163 /usr/lib/x86_64-linux-gnu/libHalf.so.12.0.0 7fb465479000-7fb465678000 ---p 00042000 08:12 1057163 /usr/lib/x86_64-linux-gnu/libHalf.so.12.0.0 7fb465678000-7fb465679000 r--p 00041000 08:12 1057163 /usr/lib/x86_64-linux-gnu/libHalf.so.12.0.0 7fb465679000-7fb46567a000 rw-p 00042000 08:12 1057163 /usr/lib/x86_64-linux-gnu/libHalf.so.12.0.0 7fb46567a000-7fb465844000 r-xp 00000000 08:12 1057173 /usr/lib/x86_64-linux-gnu/libIlmImf-2_2.so.22.0.0 7fb465844000-7fb465a43000 ---p 001ca000 08:12 1057173 /usr/lib/x86_64-linux-gnu/libIlmImf-2_2.so.22.0.0 7fb465a43000-7fb465a46000 r--p 001c9000 08:12 1057173 /usr/lib/x86_64-linux-gnu/libIlmImf-2_2.so.22.0.0 7fb465a46000-7fb465b47000 rw-p 001cc000 08:12 1057173 /usr/lib/x86_64-linux-gnu/libIlmImf-2_2.so.22.0.0 7fb465b47000-7fb465b48000 rw-p 00000000 00:00 0 7fb465b48000-7fb465b92000 r-xp 00000000 08:12 1049113 /usr/lib/x86_64-linux-gnu/libjasper.so.1.0.0 7fb465b92000-7fb465d91000 ---p 0004a000 08:12 1049113 /usr/lib/x86_64-linux-gnu/libjasper.so.1.0.0 7fb465d91000-7fb465d92000 r--p 00049000 08:12 1049113 /usr/lib/x86_64-linux-gnu/libjasper.so.1.0.0 7fb465d92000-7fb465d96000 rw-p 0004a000 08:12 1049113 /usr/lib/x86_64-linux-gnu/libjasper.so.1.0.0 7fb465d96000-7fb465d9d000 rw-p 00000000 00:00 0 7fb465d9d000-7fb465e0e000 r-xp 00000000 08:12 1048891 /usr/lib/x86_64-linux-gnu/libtiff.so.5.2.4 7fb465e0e000-7fb46600d000 ---p 00071000 08:12 1048891 /usr/lib/x86_64-linux-gnu/libtiff.so.5.2.4 7fb46600d000-7fb46600e000 r--p 00070000 08:12 1048891 /usr/lib/x86_64-linux-gnu/libtiff.so.5.2.4 7fb46600e000-7fb466011000 rw-p 00071000 08:12 1048891 /usr/lib/x86_64-linux-gnu/libtiff.so.5.2.4 7fb466011000-7fb466035000 r-xp 00000000 08:12 267512 /lib/x86_64-linux-gnu/libpng12.so.0.54.0 7fb466035000-7fb466234000 ---p 00024000 08:12 267512 /lib/x86_64-linux-gnu/libpng12.so.0.54.0 7fb466234000-7fb466235000 r--p 00023000 08:12 267512 /lib/x86_64-linux-gnu/libpng12.so.0.54.0 7fb466235000-7fb466236000 rw-p 00024000 08:12 267512 /lib/x86_64-linux-gnu/libpng12.so.0.54.0 7fb466236000-7fb46628d000 r-xp 00000000 08:12 1071801 /usr/lib/x86_64-linux-gnu/libjpeg.so.8.0.2 7fb46628d000-7fb46648d000 ---p 00057000 08:12 1071801 /usr/lib/x86_64-linux-gnu/libjpeg.so.8.0.2 7fb46648d000-7fb46648e000 r--p 00057000 08:12 1071801 /usr/lib/x86_64-linux-gnu/libjpeg.so.8.0.2 7fb46648e000-7fb46648f000 rw-p 00058000 08:12 1071801 /usr/lib/x86_64-linux-gnu/libjpeg.so.8.0.2 7fb46648f000-7fb4665b8000 r-xp 00000000 08:12 1049227 /usr/lib/x86_64-linux-gnu/libgfortran.so.3.0.0 7fb4665b8000-7fb4667b7000 ---p 00129000 08:12 1049227 /usr/lib/x86_64-linux-gnu/libgfortran.so.3.0.0 7fb4667b7000-7fb4667b8000 r--p 00128000 08:12 1049227 /usr/lib/x86_64-linux-gnu/libgfortran.so.3.0.0 7fb4667b8000-7fb4667ba000 rw-p 00129000 08:12 1049227 /usr/lib/x86_64-linux-gnu/libgfortran.so.3.0.0 7fb4667ba000-7fb466b51000 r-xp 00000000 08:12 1197428 /usr/lib/atlas-base/libatlas.so.3.0 7fb466b51000-7fb466d51000 ---p 00397000 08:12 1197428 /usr/lib/atlas-base/libatlas.so.3.0 7fb466d51000-7fb466d58000 rw-p 00397000 08:12 1197428 /usr/lib/atlas-base/libatlas.so.3.0 7fb466d58000-7fb466ddd000 r-xp 00000000 08:12 1048449 /usr/lib/x86_64-linux-gnu/libswscale-ffmpeg.so.3.1.101 7fb466ddd000-7fb466fdc000 ---p 00085000 08:12 1048449 /usr/lib/x86_64-linux-gnu/libswscale-ffmpeg.so.3.1.101 7fb466fdc000-7fb466fde000 r--p 00084000 08:12 1048449 /usr/lib/x86_64-linux-gnu/libswscale-ffmpeg.so.3.1.101 7fb466fde000-7fb466fdf000 rw-p 00086000 08:12 1048449 /usr/lib/x86_64-linux-gnu/libswscale-ffmpeg.so.3.1.101 7fb466fdf000-7fb466fe7000 rw-p 00000000 00:00 0 7fb466fe7000-7fb46703d000 r-xp 00000000 08:12 1048464 /usr/lib/x86_64-linux-gnu/libavutil-ffmpeg.so.54.31.100 7fb46703d000-7fb46723c000 ---p 00056000 08:12 1048464 /usr/lib/x86_64-linux-gnu/libavutil-ffmpeg.so.54.31.100 7fb46723c000-7fb467242000 r--p 00055000 08:12 1048464 /usr/lib/x86_64-linux-gnu/libavutil-ffmpeg.so.54.31.100 7fb467242000-7fb467243000 rw-p 0005b000 08:12 1048464 /usr/lib/x86_64-linux-gnu/libavutil-ffmpeg.so.54.31.100 7fb467243000-7fb467256000 rw-p 00000000 00:00 0 7fb467256000-7fb46742c000 r-xp 00000000 08:12 1048460 /usr/lib/x86_64-linux-gnu/libavformat-ffmpeg.so.56.40.101 7fb46742c000-7fb46762c000 ---p 001d6000 08:12 1048460 /usr/lib/x86_64-linux-gnu/libavformat-ffmpeg.so.56.40.101 7fb46762c000-7fb467640000 r--p 001d6000 08:12 1048460 /usr/lib/x86_64-linux-gnu/libavformat-ffmpeg.so.56.40.101 7fb467640000-7fb467655000 rw-p 001ea000 08:12 1048460 /usr/lib/x86_64-linux-gnu/libavformat-ffmpeg.so.56.40.101 7fb467655000-7fb468186000 r-xp 00000000 08:12 1048462 /usr/lib/x86_64-linux-gnu/libavcodec-ffmpeg.so.56.60.100 7fb468186000-7fb468385000 ---p 00b31000 08:12 1048462 /usr/lib/x86_64-linux-gnu/libavcodec-ffmpeg.so.56.60.100 7fb468385000-7fb4683b0000 r--p 00b30000 08:12 1048462 /usr/lib/x86_64-linux-gnu/libavcodec-ffmpeg.so.56.60.100 7fb4683b0000-7fb4683d3000 rw-p 00b5b000 08:12 1048462 /usr/lib/x86_64-linux-gnu/libavcodec-ffmpeg.so.56.60.100 7fb4683d3000-7fb468a86000 rw-p 00000000 00:00 0 7fb468a86000-7fb468abb000 r-xp 00000000 08:12 1052809 /usr/lib/x86_64-linux-gnu/libdc1394.so.22.1.11 7fb468abb000-7fb468cba000 ---p 00035000 08:12 1052809 /usr/lib/x86_64-linux-gnu/libdc1394.so.22.1.11 7fb468cba000-7fb468cbb000 r--p 00034000 08:12 1052809 /usr/lib/x86_64-linux-gnu/libdc1394.so.22.1.11 7fb468cbb000-7fb468cbc000 rw-p 00035000 08:12 1052809 /usr/lib/x86_64-linux-gnu/libdc1394.so.22.1.11 7fb468cbc000-7fb468cfc000 rw-p 00000000 00:00 0 7fb468cfc000-7fb468e0b000 r-xp 00000000 08:12 261914 /lib/x86_64-linux-gnu/libglib-2.0.so.0.4800.2 7fb468e0b000-7fb46900a000 ---p 0010f000 08:12 261914 /lib/x86_64-linux-gnu/libglib-2.0.so.0.4800.2 7fb46900a000-7fb46900b000 r--p 0010e000 08:12 261914 /lib/x86_64-linux-gnu/libglib-2.0.so.0.4800.2 7fb46900b000-7fb46900c000 rw-p 0010f000 08:12 261914 /lib/x86_64-linux-gnu/libglib-2.0.so.0.4800.2 7fb46900c000-7fb46900d000 rw-p 00000000 00:00 0 7fb46900d000-7fb46905f000 r-xp 00000000 08:12 1048812 /usr/lib/x86_64-linux-gnu/libgobject-2.0.so.0.4800.2 7fb46905f000-7fb46925e000 ---p 00052000 08:12 1048812 /usr/lib/x86_64-linux-gnu/libgobject-2.0.so.0.4800.2 7fb46925e000-7fb46925f000 r--p 00051000 08:12 1048812 /usr/lib/x86_64-linux-gnu/libgobject-2.0.so.0.4800.2 7fb46925f000-7fb469260000 rw-p 00052000 08:12 1048812 /usr/lib/x86_64-linux-gnu/libgobject-2.0.so.0.4800.2 7fb469260000-7fb469281000 r-xp 00000000 08:12 1048894 /usr/lib/x86_64-linux-gnu/libgdk_pixbuf-2.0.so.0.3200.2 7fb469281000-7fb469480000 ---p 00021000 08:12 1048894 /usr/lib/x86_64-linux-gnu/libgdk_pixbuf-2.0.so.0.3200.2 7fb469480000-7fb469481000 r--p 00020000 08:12 1048894 /usr/lib/x86_64-linux-gnu/libgdk_pixbuf-2.0.so.0.3200.2 7fb469481000-7fb469482000 rw-p 00021000 08:12 1048894 /usr/lib/x86_64-linux-gnu/libgdk_pixbuf-2.0.so.0.3200.2 7fb469482000-7fb469590000 r-xp 00000000 08:12 1057466 /usr/lib/x86_64-linux-gnu/libcairo.so.2.11400.6 7fb469590000-7fb469790000 ---p 0010e000 08:12 1057466 /usr/lib/x86_64-linux-gnu/libcairo.so.2.11400.6 7fb469790000-7fb469793000 r--p 0010e000 08:12 1057466 /usr/lib/x86_64-linux-gnu/libcairo.so.2.11400.6 7fb469793000-7fb469794000 rw-p 00111000 08:12 1057466 /usr/lib/x86_64-linux-gnu/libcairo.so.2.11400.6 7fb469794000-7fb469796000 rw-p 00000000 00:00 0 7fb469796000-7fb46986a000 r-xp 00000000 08:12 1057778 /usr/lib/x86_64-linux-gnu/libgdk-3.so.0.1800.9 7fb46986a000-7fb469a69000 ---p 000d4000 08:12 1057778 /usr/lib/x86_64-linux-gnu/libgdk-3.so.0.1800.9 7fb469a69000-7fb469a6e000 r--p 000d3000 08:12 1057778 /usr/lib/x86_64-linux-gnu/libgdk-3.so.0.1800.9 7fb469a6e000-7fb469a71000 rw-p 000d8000 08:12 1057778 /usr/lib/x86_64-linux-gnu/libgdk-3.so.0.1800.9 7fb469a71000-7fb46a18b000 r-xp 00000000 08:12 1057923 /usr/lib/x86_64-linux-gnu/libgtk-3.so.0.1800.9 7fb46a18b000-7fb46a38b000 ---p 0071a000 08:12 1057923 /usr/lib/x86_64-linux-gnu/libgtk-3.so.0.1800.9 7fb46a38b000-7fb46a395000 r--p 0071a000 08:12 1057923 /usr/lib/x86_64-linux-gnu/libgtk-3.so.0.1800.9 7fb46a395000-7fb46a39b000 rw-p 00724000 08:12 1057923 /usr/lib/x86_64-linux-gnu/libgtk-3.so.0.1800.9 7fb46a39b000-7fb46a3a0000 rw-p 00000000 00:00 0 7fb46a3a0000-7fb46a3a7000 r-xp 00000000 08:12 1052769 /usr/lib/x86_64-linux-gnu/libsnappy.so.1.3.0 7fb46a3a7000-7fb46a5a6000 ---p 00007000 08:12 1052769 /usr/lib/x86_64-linux-gnu/libsnappy.so.1.3.0 7fb46a5a6000-7fb46a5a7000 r--p 00006000 08:12 1052769 /usr/lib/x86_64-linux-gnu/libsnappy.so.1.3.0 7fb46a5a7000-7fb46a5a8000 rw-p 00007000 08:12 1052769 /usr/lib/x86_64-linux-gnu/libsnappy.so.1.3.0 7fb46a5a8000-7fb46a5aa000 r-xp 00000000 08:12 1049229 /usr/lib/x86_64-linux-gnu/libsz.so.2.0.1 7fb46a5aa000-7fb46a7a9000 ---p 00002000 08:12 1049229 /usr/lib/x86_64-linux-gnu/libsz.so.2.0.1 7fb46a7a9000-7fb46a7aa000 r--p 00001000 08:12 1049229 /usr/lib/x86_64-linux-gnu/libsz.so.2.0.1 7fb46a7aa000-7fb46a7ab000 rw-p 00002000 08:12 1049229 /usr/lib/x86_64-linux-gnu/libsz.so.2.0.1 7fb46a7ab000-7fb46a92a000 r-xp 00000000 08:12 1055831 /usr/lib/x86_64-linux-gnu/libicuuc.so.55.1 7fb46a92a000-7fb46ab2a000 ---p 0017f000 08:12 1055831 /usr/lib/x86_64-linux-gnu/libicuuc.so.55.1 7fb46ab2a000-7fb46ab3a000 r--p 0017f000 08:12 1055831 /usr/lib/x86_64-linux-gnu/libicuuc.so.55.1 7fb46ab3a000-7fb46ab3b000 rw-p 0018f000 08:12 1055831 /usr/lib/x86_64-linux-gnu/libicuuc.so.55.1 7fb46ab3b000-7fb46ab3f000 rw-p 00000000 00:00 0 7fb46ab3f000-7fb46ad91000 r-xp 00000000 08:12 1047604 /usr/lib/x86_64-linux-gnu/libicui18n.so.55.1 7fb46ad91000-7fb46af91000 ---p 00252000 08:12 1047604 /usr/lib/x86_64-linux-gnu/libicui18n.so.55.1 7fb46af91000-7fb46afa0000 r--p 00252000 08:12 1047604 /usr/lib/x86_64-linux-gnu/libicui18n.so.55.1 7fb46afa0000-7fb46afa1000 rw-p 00261000 08:12 1047604 /usr/lib/x86_64-linux-gnu/libicui18n.so.55.1 7fb46afa1000-7fb46afa3000 r-xp 00000000 08:12 273865 /lib/x86_64-linux-gnu/libutil-2.23.so 7fb46afa3000-7fb46b1a2000 ---p 00002000 08:12 273865 /lib/x86_64-linux-gnu/libutil-2.23.so 7fb46b1a2000-7fb46b1a3000 r--p 00001000 08:12 273865 /lib/x86_64-linux-gnu/libutil-2.23.so 7fb46b1a3000-7fb46b1a4000 rw-p 00002000 08:12 273865 /lib/x86_64-linux-gnu/libutil-2.23.so 7fb46b1a4000-7fb46b1ab000 r-xp 00000000 08:12 273876 /lib/x86_64-linux-gnu/librt-2.23.so 7fb46b1ab000-7fb46b3aa000 ---p 00007000 08:12 273876 /lib/x86_64-linux-gnu/librt-2.23.so 7fb46b3aa000-7fb46b3ab000 r--p 00006000 08:12 273876 /lib/x86_64-linux-gnu/librt-2.23.so 7fb46b3ab000-7fb46b3ac000 rw-p 00007000 08:12 273876 /lib/x86_64-linux-gnu/librt-2.23.so 7fb46b3ac000-7fb46b3af000 r-xp 00000000 08:12 273860 /lib/x86_64-linux-gnu/libdl-2.23.so 7fb46b3af000-7fb46b5ae000 ---p 00003000 08:12 273860 /lib/x86_64-linux-gnu/libdl-2.23.so 7fb46b5ae000-7fb46b5af000 r--p 00002000 08:12 273860 /lib/x86_64-linux-gnu/libdl-2.23.so 7fb46b5af000-7fb46b5b0000 rw-p 00003000 08:12 273860 /lib/x86_64-linux-gnu/libdl-2.23.so 7fb46b5b0000-7fb46b5c9000 r-xp 00000000 08:12 267362 /lib/x86_64-linux-gnu/libz.so.1.2.8 7fb46b5c9000-7fb46b7c8000 ---p 00019000 08:12 267362 /lib/x86_64-linux-gnu/libz.so.1.2.8 7fb46b7c8000-7fb46b7c9000 r--p 00018000 08:12 267362 /lib/x86_64-linux-gnu/libz.so.1.2.8 7fb46b7c9000-7fb46b7ca000 rw-p 00019000 08:12 267362 /lib/x86_64-linux-gnu/libz.so.1.2.8 7fb46b7ca000-7fb46b7d6000 r-xp 00000000 08:12 1058568 /usr/lib/x86_64-linux-gnu/libunwind.so.8.0.1 7fb46b7d6000-7fb46b9d5000 ---p 0000c000 08:12 1058568 /usr/lib/x86_64-linux-gnu/libunwind.so.8.0.1 7fb46b9d5000-7fb46b9d6000 r--p 0000b000 08:12 1058568 /usr/lib/x86_64-linux-gnu/libunwind.so.8.0.1 7fb46b9d6000-7fb46b9d7000 rw-p 0000c000 08:12 1058568 /usr/lib/x86_64-linux-gnu/libunwind.so.8.0.1 7fb46b9d7000-7fb46b9e5000 rw-p 00000000 00:00 0 7fb46b9e5000-7fb46c837000 r-xp 00000000 08:13 9178264 /home/zsy/opencv-3.1.0/build/lib/libopencv_core.so.3.1.0 7fb46c837000-7fb46ca37000 ---p 00e52000 08:13 9178264 /home/zsy/opencv-3.1.0/build/lib/libopencv_core.so.3.1.0 7fb46ca37000-7fb46ca40000 r--p 00e52000 08:13 9178264 /home/zsy/opencv-3.1.0/build/lib/libopencv_core.so.3.1.0 7fb46ca40000-7fb46ca6d000 rw-p 00e5b000 08:13 9178264 /home/zsy/opencv-3.1.0/build/lib/libopencv_core.so.3.1.0 7fb46ca6d000-7fb46ca7c000 rw-p 00000000 00:00 0 7fb46ca7c000-7fb46e1ff000 r-xp 00000000 08:13 9178273 /home/zsy/opencv-3.1.0/build/lib/libopencv_imgproc.so.3.1.0 7fb46e1ff000-7fb46e3ff000 ---p 01783000 08:13 9178273 /home/zsy/opencv-3.1.0/build/lib/libopencv_imgproc.so.3.1.0 7fb46e3ff000-7fb46e407000 r--p 01783000 08:13 9178273 /home/zsy/opencv-3.1.0/build/lib/libopencv_imgproc.so.3.1.0 7fb46e407000-7fb46e429000 rw-p 0178b000 08:13 9178273 /home/zsy/opencv-3.1.0/build/lib/libopencv_imgproc.so.3.1.0 7fb46e429000-7fb46e4bf000 rw-p 00000000 00:00 0 7fb46e4bf000-7fb46e675000 r-xp 00000000 08:13 9178276 /home/zsy/opencv-3.1.0/build/lib/libopencv_imgcodecs.so.3.1.0 7fb46e675000-7fb46e875000 ---p 001b6000 08:13 9178276 /home/zsy/opencv-3.1.0/build/lib/libopencv_imgcodecs.so.3.1.0 7fb46e875000-7fb46e877000 r--p 001b6000 08:13 9178276 /home/zsy/opencv-3.1.0/build/lib/libopencv_imgcodecs.so.3.1.0 7fb46e877000-7fb46e87a000 rw-p 001b8000 08:13 9178276 /home/zsy/opencv-3.1.0/build/lib/libopencv_imgcodecs.so.3.1.0 7fb46e87a000-7fb46e87d000 rw-p 00000000 00:00 0 7fb46e87d000-7fb46e985000 r-xp 00000000 08:12 267213 /lib/x86_64-linux-gnu/libm-2.23.so 7fb46e985000-7fb46eb84000 ---p 00108000 08:12 267213 /lib/x86_64-linux-gnu/libm-2.23.so 7fb46eb84000-7fb46eb85000 r--p 00107000 08:12 267213 /lib/x86_64-linux-gnu/libm-2.23.so 7fb46eb85000-7fb46eb86000 rw-p 00108000 08:12 267213 /lib/x86_64-linux-gnu/libm-2.23.so 7fb46eb86000-7fb46eba7000 r-xp 00000000 08:12 1197429 /usr/lib/atlas-base/libcblas.so.3.0 7fb46eba7000-7fb46eda7000 ---p 00021000 08:12 1197429 /usr/lib/atlas-base/libcblas.so.3.0 7fb46eda7000-7fb46eda8000 rw-p 00021000 08:12 1197429 /usr/lib/atlas-base/libcblas.so.3.0 7fb46eda8000-7fb46edd4000 r-xp 00000000 08:13 9178282 /home/zsy/opencv-3.1.0/build/lib/libopencv_videoio.so.3.1.0 7fb46edd4000-7fb46efd4000 ---p 0002c000 08:13 9178282 /home/zsy/opencv-3.1.0/build/lib/libopencv_videoio.so.3.1.0 7fb46efd4000-7fb46efd5000 r--p 0002c000 08:13 9178282 /home/zsy/opencv-3.1.0/build/lib/libopencv_videoio.so.3.1.0 7fb46efd5000-7fb46efd6000 rw-p 0002d000 08:13 9178282 /home/zsy/opencv-3.1.0/build/lib/libopencv_videoio.so.3.1.0 7fb46efd6000-7fb46efd9000 rw-p 00000000 00:00 0 7fb46efd9000-7fb46efe5000 r-xp 00000000 08:13 9178288 /home/zsy/opencv-3.1.0/build/lib/libopencv_highgui.so.3.1.0 7fb46efe5000-7fb46f1e4000 ---p 0000c000 08:13 9178288 /home/zsy/opencv-3.1.0/build/lib/libopencv_highgui.so.3.1.0 7fb46f1e4000-7fb46f1e5000 r--p 0000b000 08:13 9178288 /home/zsy/opencv-3.1.0/build/lib/libopencv_highgui.so.3.1.0 7fb46f1e5000-7fb46f1e6000 rw-p 0000c000 08:13 9178288 /home/zsy/opencv-3.1.0/build/lib/libopencv_highgui.so.3.1.0 7fb46f1e6000-7fb474208000 r-xp 00000000 08:12 1071699 /usr/local/cuda-8.0/lib64/libcudnn.so.5.1.10 7fb474208000-7fb474408000 ---p 05022000 08:12 1071699 /usr/local/cuda-8.0/lib64/libcudnn.so.5.1.10 7fb474408000-7fb47442a000 rw-p 05022000 08:12 1071699 /usr/local/cuda-8.0/lib64/libcudnn.so.5.1.10 7fb47442a000-7fb474455000 rw-p 00000000 00:00 0 7fb474455000-7fb476cc1000 r-xp 00000000 08:12 1068246 /usr/local/cuda-8.0/lib64/libcublas.so.8.0.61 7fb476cc1000-7fb476ec1000 ---p 0286c000 08:12 1068246 /usr/local/cuda-8.0/lib64/libcublas.so.8.0.61 7fb476ec1000-7fb476ede000 rw-p 0286c000 08:12 1068246 /usr/local/cuda-8.0/lib64/libcublas.so.8.0.61 7fb476ede000-7fb476eed000 rw-p 00000000 00:00 0 7fb476eed000-7fb479388000 r-xp 00000000 08:12 1068328 /usr/local/cuda-8.0/lib64/libcurand.so.8.0.61 7fb479388000-7fb479588000 ---p 0249b000 08:12 1068328 /usr/local/cuda-8.0/lib64/libcurand.so.8.0.61 7fb479588000-7fb47a959000 rw-p 0249b000 08:12 1068328 /usr/local/cuda-8.0/lib64/libcurand.so.8.0.61 7fb47a959000-7fb47ae63000 rw-p 00000000 00:00 0 7fb47ae63000-7fb47aebb000 r-xp 00000000 08:12 1049262 /usr/lib/x86_64-linux-gnu/libleveldb.so.1.18 7fb47aebb000-7fb47b0ba000 ---p 00058000 08:12 1049262 /usr/lib/x86_64-linux-gnu/libleveldb.so.1.18 7fb47b0ba000-7fb47b0bc000 r--p 00057000 08:12 1049262 /usr/lib/x86_64-linux-gnu/libleveldb.so.1.18 7fb47b0bc000-7fb47b0bd000 rw-p 00059000 08:12 1049262 /usr/lib/x86_64-linux-gnu/libleveldb.so.1.18 7fb47b0bd000-7fb47b0d1000 r-xp 00000000 08:12 1072741 /usr/lib/x86_64-linux-gnu/liblmdb.so.0.0.0 7fb47b0d1000-7fb47b2d0000 ---p 00014000 08:12 1072741 /usr/lib/x86_64-linux-gnu/liblmdb.so.0.0.0 7fb47b2d0000-7fb47b2d1000 r--p 00013000 08:12 1072741 /usr/lib/x86_64-linux-gnu/liblmdb.so.0.0.0 7fb47b2d1000-7fb47b2d2000 rw-p 00014000 08:12 1072741 /usr/lib/x86_64-linux-gnu/liblmdb.so.0.0.0 7fb47b2d2000-7fb47b2f0000 r-xp 00000000 08:12 1049242 /usr/lib/x86_64-linux-gnu/libhdf5_serial_hl.so.10.0.2 7fb47b2f0000-7fb47b4ef000 ---p 0001e000 08:12 1049242 /usr/lib/x86_64-linux-gnu/libhdf5_serial_hl.so.10.0.2 7fb47b4ef000-7fb47b4f0000 r--p 0001d000 08:12 1049242 /usr/lib/x86_64-linux-gnu/libhdf5_serial_hl.so.10.0.2 7fb47b4f0000-7fb47b4f1000 rw-p 0001e000 08:12 1049242 /usr/lib/x86_64-linux-gnu/libhdf5_serial_hl.so.10.0.2 7fb47b4f1000-7fb47b4f2000 rw-p 00000000 00:00 0 7fb47b4f2000-7fb47b786000 r-xp 00000000 08:12 1049240 /usr/lib/x86_64-linux-gnu/libhdf5_serial.so.10.1.0 7fb47b786000-7fb47b985000 ---p 00294000 08:12 1049240 /usr/lib/x86_64-linux-gnu/libhdf5_serial.so.10.1.0 7fb47b985000-7fb47b98a000 r--p 00293000 08:12 1049240 /usr/lib/x86_64-linux-gnu/libhdf5_serial.so.10.1.0 7fb47b98a000-7fb47b98f000 rw-p 00298000 08:12 1049240 /usr/lib/x86_64-linux-gnu/libhdf5_serial.so.10.1.0 7fb47b98f000-7fb47b990000 rw-p 00000000 00:00 0 7fb47b990000-7fb47b9a8000 r-xp 00000000 08:12 273857 /lib/x86_64-linux-gnu/libpthread-2.23.so 7fb47b9a8000-7fb47bba7000 ---p 00018000 08:12 273857 /lib/x86_64-linux-gnu/libpthread-2.23.so 7fb47bba7000-7fb47bba8000 r--p 00017000 08:12 273857 /lib/x86_64-linux-gnu/libpthread-2.23.so 7fb47bba8000-7fb47bba9000 rw-p 00018000 08:12 273857 /lib/x86_64-linux-gnu/libpthread-2.23.so 7fb47bba9000-7fb47bbad000 rw-p 00000000 00:00 0 7fb47bbad000-7fb47bcb0000 r-xp 00000000 08:12 1055893 /usr/lib/x86_64-linux-gnu/libboost_regex.so.1.58.0 7fb47bcb0000-7fb47beb0000 ---p 00103000 08:12 1055893 /usr/lib/x86_64-linux-gnu/libboost_regex.so.1.58.0 7fb47beb0000-7fb47beb4000 r--p 00103000 08:12 1055893 /usr/lib/x86_64-linux-gnu/libboost_regex.so.1.58.0 7fb47beb4000-7fb47beb5000 rw-p 00107000 08:12 1055893 /usr/lib/x86_64-linux-gnu/libboost_regex.so.1.58.0 7fb47beb5000-7fb47becc000 r-xp 00000000 08:12 1057453 /usr/lib/x86_64-linux-gnu/libboost_filesystem.so.1.58.0 7fb47becc000-7fb47c0cb000 ---p 00017000 08:12 1057453 /usr/lib/x86_64-linux-gnu/libboost_filesystem.so.1.58.0 7fb47c0cb000-7fb47c0cc000 r--p 00016000 08:12 1057453 /usr/lib/x86_64-linux-gnu/libboost_filesystem.so.1.58.0 7fb47c0cc000-7fb47c0cd000 rw-p 00017000 08:12 1057453 /usr/lib/x86_64-linux-gnu/libboost_filesystem.so.1.58.0 7fb47c0cd000-7fb47c0f1000 r-xp 00000000 08:12 1055873 /usr/lib/x86_64-linux-gnu/libboost_thread.so.1.58.0 7fb47c0f1000-7fb47c2f0000 ---p 00024000 08:12 1055873 /usr/lib/x86_64-linux-gnu/libboost_thread.so.1.58.0 7fb47c2f0000-7fb47c2f2000 r--p 00023000 08:12 1055873 /usr/lib/x86_64-linux-gnu/libboost_thread.so.1.58.0 7fb47c2f2000-7fb47c2f3000 rw-p 00025000 08:12 1055873 /usr/lib/x86_64-linux-gnu/libboost_thread.so.1.58.0 7fb47c2f3000-7fb47c4b3000 r-xp 00000000 08:12 273858 /lib/x86_64-linux-gnu/libc-2.23.so 7fb47c4b3000-7fb47c6b3000 ---p 001c0000 08:12 273858 /lib/x86_64-linux-gnu/libc-2.23.so 7fb47c6b3000-7fb47c6b7000 r--p 001c0000 08:12 273858 /lib/x86_64-linux-gnu/libc-2.23.so 7fb47c6b7000-7fb47c6b9000 rw-p 001c4000 08:12 273858 /lib/x86_64-linux-gnu/libc-2.23.so 7fb47c6b9000-7fb47c6bd000 rw-p 00000000 00:00 0 7fb47c6bd000-7fb47c6d3000 r-xp 00000000 08:12 267209 /lib/x86_64-linux-gnu/libgcc_s.so.1 7fb47c6d3000-7fb47c8d2000 ---p 00016000 08:12 267209 /lib/x86_64-linux-gnu/libgcc_s.so.1 7fb47c8d2000-7fb47c8d3000 rw-p 00015000 08:12 267209 /lib/x86_64-linux-gnu/libgcc_s.so.1 7fb47c8d3000-7fb47ca45000 r-xp 00000000 08:12 1048800 /usr/lib/x86_64-linux-gnu/libstdc++.so.6.0.21 7fb47ca45000-7fb47cc45000 ---p 00172000 08:12 1048800 /usr/lib/x86_64-linux-gnu/libstdc++.so.6.0.21 7fb47cc45000-7fb47cc4f000 r--p 00172000 08:12 1048800 /usr/lib/x86_64-linux-gnu/libstdc++.so.6.0.21 7fb47cc4f000-7fb47cc51000 rw-p 0017c000 08:12 1048800 /usr/lib/x86_64-linux-gnu/libstdc++.so.6.0.21 7fb47cc51000-7fb47cc55000 rw-p 00000000 00:00 0 7fb47cc55000-7fb47cc9e000 r-xp 00000000 08:12 1061092 /usr/lib/x86_64-linux-gnu/libboost_python-py27.so.1.58.0 7fb47cc9e000-7fb47ce9e000 ---p 00049000 08:12 1061092 /usr/lib/x86_64-linux-gnu/libboost_python-py27.so.1.58.0 7fb47ce9e000-7fb47ce9f000 r--p 00049000 08:12 1061092 /usr/lib/x86_64-linux-gnu/libboost_python-py27.so.1.58.0 7fb47ce9f000-7fb47cea1000 rw-p 0004a000 08:12 1061092 /usr/lib/x86_64-linux-gnu/libboost_python-py27.so.1.58.0 7fb47cea1000-7fb47d193000 r-xp 00000000 08:12 1046632 /usr/lib/x86_64-linux-gnu/libpython2.7.so.1.0 7fb47d193000-7fb47d393000 ---p 002f2000 08:12 1046632 /usr/lib/x86_64-linux-gnu/libpython2.7.so.1.0 7fb47d393000-7fb47d395000 r--p 002f2000 08:12 1046632 /usr/lib/x86_64-linux-gnu/libpython2.7.so.1.0 7fb47d395000-7fb47d40c000 rw-p 002f4000 08:12 1046632 /usr/lib/x86_64-linux-gnu/libpython2.7.so.1.0 7fb47d40c000-7fb47d42f000 rw-p 00000000 00:00 0 7fb47d42f000-7fb47d491000 r-xp 00000000 08:12 1068334 /usr/local/cuda-8.0/lib64/libcudart.so.8.0.61 7fb47d491000-7fb47d691000 ---p 00062000 08:12 1068334 /usr/local/cuda-8.0/lib64/libcudart.so.8.0.61 7fb47d691000-7fb47d694000 rw-p 00062000 08:12 1068334 /usr/local/cuda-8.0/lib64/libcudart.so.8.0.61 7fb47d694000-7fb47d695000 rw-p 00000000 00:00 0 7fb47d695000-7fb47d7af000 r-xp 00000000 08:12 1058315 /usr/lib/x86_64-linux-gnu/libprotobuf.so.9.0.1 7fb47d7af000-7fb47d9ae000 ---p 0011a000 08:12 1058315 /usr/lib/x86_64-linux-gnu/libprotobuf.so.9.0.1 7fb47d9ae000-7fb47d9b2000 r--p 00119000 08:12 1058315 /usr/lib/x86_64-linux-gnu/libprotobuf.so.9.0.1 7fb47d9b2000-7fb47d9b3000 rw-p 0011d000 08:12 1058315 /usr/lib/x86_64-linux-gnu/libprotobuf.so.9.0.1 7fb47d9b3000-7fb47d9d3000 r-xp 00000000 08:12 1072746 /usr/lib/x86_64-linux-gnu/libgflags.so.2.1.2 7fb47d9d3000-7fb47dbd2000 ---p 00020000 08:12 1072746 /usr/lib/x86_64-linux-gnu/libgflags.so.2.1.2 7fb47dbd2000-7fb47dbd3000 r--p 0001f000 08:12 1072746 /usr/lib/x86_64-linux-gnu/libgflags.so.2.1.2 7fb47dbd3000-7fb47dbd4000 rw-p 00020000 08:12 1072746 /usr/lib/x86_64-linux-gnu/libgflags.so.2.1.2 7fb47dbd4000-7fb47dbf2000 r-xp 00000000 08:12 1072754 /usr/lib/x86_64-linux-gnu/libglog.so.0.0.0 7fb47dbf2000-7fb47ddf1000 ---p 0001e000 08:12 1072754 /usr/lib/x86_64-linux-gnu/libglog.so.0.0.0 7fb47ddf1000-7fb47ddf2000 r--p 0001d000 08:12 1072754 /usr/lib/x86_64-linux-gnu/libglog.so.0.0.0 7fb47ddf2000-7fb47ddf3000 rw-p 0001e000 08:12 1072754 /usr/lib/x86_64-linux-gnu/libglog.so.0.0.0 7fb47ddf3000-7fb47de03000 rw-p 00000000 00:00 0 7fb47de03000-7fb47de06000 r-xp 00000000 08:12 1057455 /usr/lib/x86_64-linux-gnu/libboost_system.so.1.58.0 7fb47de06000-7fb47e005000 ---p 00003000 08:12 1057455 /usr/lib/x86_64-linux-gnu/libboost_system.so.1.58.0 7fb47e005000-7fb47e006000 r--p 00002000 08:12 1057455 /usr/lib/x86_64-linux-gnu/libboost_system.so.1.58.0 7fb47e006000-7fb47e007000 rw-p 00003000 08:12 1057455 /usr/lib/x86_64-linux-gnu/libboost_system.so.1.58.0 7fb47e007000-7fb47ec5d000 r-xp 00000000 08:13 12717974 /home/zsy/DeepLearning/caffe-ssd/cmake-build-debug/lib/libcaffe-d.so.1.0.0-rc3 7fb47ec5d000-7fb47ee5d000 ---p 00c56000 08:13 12717974 /home/zsy/DeepLearning/caffe-ssd/cmake-build-debug/lib/libcaffe-d.so.1.0.0-rc3 7fb47ee5d000-7fb47ee76000 r--p 00c56000 08:13 12717974 /home/zsy/DeepLearning/caffe-ssd/cmake-build-debug/lib/libcaffe-d.so.1.0.0-rc3 7fb47ee76000-7fb47eea0000 rw-p 00c6f000 08:13 12717974 /home/zsy/DeepLearning/caffe-ssd/cmake-build-debug/lib/libcaffe-d.so.1.0.0-rc3 7fb47eea0000-7fb47eea2000 rw-p 00000000 00:00 0 7fb47eea2000-7fb47eec8000 r-xp 00000000 08:12 273854 /lib/x86_64-linux-gnu/ld-2.23.so 7fb47efa9000-7fb47efc4000 rw-p 00000000 00:00 0 7fb47efc4000-7fb47f044000 r-xp 00000000 08:12 267144 /lib/x86_64-linux-gnu/libsystemd.so.0.14.0 7fb47f044000-7fb47f047000 r--p 0007f000 08:12 267144 /lib/x86_64-linux-gnu/libsystemd.so.0.14.0 7fb47f047000-7fb47f048000 rw-p 00082000 08:12 267144 /lib/x86_64-linux-gnu/libsystemd.so.0.14.0 7fb47f048000-7fb47f04f000 rw-p 00000000 00:00 0 7fb47f04f000-7fb47f06d000 r-xp 00000000 08:12 266771 /lib/x86_64-linux-gnu/libudev.so.1.6.4 7fb47f06d000-7fb47f06e000 r--p 0001d000 08:12 266771 /lib/x86_64-linux-gnu/libudev.so.1.6.4 7fb47f06e000-7fb47f06f000 rw-p 0001e000 08:12 266771 /lib/x86_64-linux-gnu/libudev.so.1.6.4 7fb47f06f000-7fb47f0a2000 rw-p 00000000 00:00 0 7fb47f0c5000-7fb47f0c7000 rw-p 00000000 00:00 0 7fb47f0c7000-7fb47f0c8000 r--p 00025000 08:12 273854 /lib/x86_64-linux-gnu/ld-2.23.so 7fb47f0c8000-7fb47f0c9000 rw-p 00026000 08:12 273854 /lib/x86_64-linux-gnu/ld-2.23.so 7fb47f0c9000-7fb47f0ca000 rw-p 00000000 00:00 0 7ffd3aaac000-7ffd3aacb000 rwxp 00000000 00:00 0 [stack] 7ffd3aacb000-7ffd3aacd000 rw-p 00000000 00:00 0 7ffd3abb3000-7ffd3abb5000 r--p 00000000 00:00 0 [vvar] 7ffd3abb5000-7ffd3abb7000 r-xp 00000000 00:00 0 [vdso] ffffffffff600000-ffffffffff601000 r-xp 00000000 00:00 0 [vsyscall] *** Aborted at 1537413282 (unix time) try "date -d @1537413282" if you are using GNU date *** PC: @ 0x7fb47c328428 gsignal *** SIGABRT (@0x3e800007a97) received by PID 31383 (TID 0x7fb47efb1b00) from PID 31383; stack trace: *** @ 0x7fb47c3284b0 (unknown) @ 0x7fb47c328428 gsignal @ 0x7fb47c32a02a abort @ 0x7fb47c36a7ea (unknown) @ 0x7fb47c37337a (unknown) @ 0x7fb47c37753c cfree @ 0x7fb47d6e38af google::protobuf::internal::DestroyDefaultRepeatedFields() @ 0x7fb47d6e2b3b google::protobuf::ShutdownProtobufLibrary() @ 0x7fb457b6b3b9 (unknown) @ 0x7fb47eeb2de7 (unknown) @ 0x7fb47c32cff8 (unknown) @ 0x7fb47c32d045 exit @ 0x7fb47c313837 __libc_start_main @ 0x435439 _start @ 0x0 (unknown)
python matplotlib报错 mac系统,急!!!
各位大神好, 我在spyder中输入import matplotlib.pyplot as plt 结果就报错了: Traceback (most recent call last): File "<stdin>", line 1, in <module> File "/Users/kevin/anaconda/lib/python2.7/site-packages/spyderlib/widgets/externalshell/sitecustomize.py", line 685, in runfile execfile(filename, namespace) File "/Users/kevin/anaconda/lib/python2.7/site-packages/spyderlib/widgets/externalshell/sitecustomize.py", line 78, in execfile builtins.execfile(filename, *where) File "/Users/kevin/Desktop/matplot.py", line 8, in <module> import matplotlib.pyplot as plt File "/Users/kevin/anaconda/lib/python2.7/site-packages/matplotlib/pyplot.py", line 27, in <module> import matplotlib.colorbar File "/Users/kevin/anaconda/lib/python2.7/site-packages/matplotlib/colorbar.py", line 34, in <module> import matplotlib.collections as collections File "/Users/kevin/anaconda/lib/python2.7/site-packages/matplotlib/collections.py", line 27, in <module> import matplotlib.backend_bases as backend_bases File "/Users/kevin/anaconda/lib/python2.7/site-packages/matplotlib/backend_bases.py", line 56, in <module> import matplotlib.textpath as textpath File "/Users/kevin/anaconda/lib/python2.7/site-packages/matplotlib/textpath.py", line 22, in <module> from matplotlib.mathtext import MathTextParser File "/Users/kevin/anaconda/lib/python2.7/site-packages/matplotlib/mathtext.py", line 63, in <module> import matplotlib._png as _png ImportError: dlopen(/Users/kevin/anaconda/lib/python2.7/site-packages/matplotlib/_png.so, 2): Library not loaded: @loader_path/../../../libpng15.15.dylib Referenced from: /Users/kevin/anaconda/lib/python2.7/site-packages/matplotlib/_png.so Reason: image not found 好像是libpng15.15.dylib没安装?求问这是什么?具体怎么操作? 我用的OSX,anaconda 多谢!! ---------------------------------- 日了,直接重新换了个解释器,解决了!
终于明白阿里百度这样的大公司,为什么面试经常拿ThreadLocal考验求职者了
点击上面↑「爱开发」关注我们每晚10点,捕获技术思考和创业资源洞察什么是ThreadLocalThreadLocal是一个本地线程副本变量工具类,各个线程都拥有一份线程私有的数
程序员必须掌握的核心算法有哪些?
由于我之前一直强调数据结构以及算法学习的重要性,所以就有一些读者经常问我,数据结构与算法应该要学习到哪个程度呢?,说实话,这个问题我不知道要怎么回答你,主要取决于你想学习到哪些程度,不过针对这个问题,我稍微总结一下我学过的算法知识点,以及我觉得值得学习的算法。这些算法与数据结构的学习大多数是零散的,并没有一本把他们全部覆盖的书籍。下面是我觉得值得学习的一些算法以及数据结构,当然,我也会整理一些看过...
《奇巧淫技》系列-python!!每天早上八点自动发送天气预报邮件到QQ邮箱
此博客仅为我业余记录文章所用,发布到此,仅供网友阅读参考,如有侵权,请通知我,我会删掉。 补充 有不少读者留言说本文章没有用,因为天气预报直接打开手机就可以收到了,为何要多此一举发送到邮箱呢!!!那我在这里只能说:因为你没用,所以你没用!!! 这里主要介绍的是思路,不是天气预报!不是天气预报!!不是天气预报!!!天气预报只是用于举例。请各位不要再刚了!!! 下面是我会用到的两个场景: 每日下
面试官问我:什么是消息队列?什么场景需要他?用了会出现什么问题?
你知道的越多,你不知道的越多 点赞再看,养成习惯 GitHub上已经开源 https://github.com/JavaFamily 有一线大厂面试点脑图、个人联系方式,欢迎Star和完善 前言 消息队列在互联网技术存储方面使用如此广泛,几乎所有的后端技术面试官都要在消息队列的使用和原理方面对小伙伴们进行360°的刁难。 作为一个在互联网公司面一次拿一次Offer的面霸,打败了无数
8年经验面试官详解 Java 面试秘诀
    作者 | 胡书敏 责编 | 刘静 出品 | CSDN(ID:CSDNnews) 本人目前在一家知名外企担任架构师,而且最近八年来,在多家外企和互联网公司担任Java技术面试官,前后累计面试了有两三百位候选人。在本文里,就将结合本人的面试经验,针对Java初学者、Java初级开发和Java开发,给出若干准备简历和准备面试的建议。   Java程序员准备和投递简历的实
究竟你适不适合买Mac?
我清晰的记得,刚买的macbook pro回到家,开机后第一件事情,就是上了淘宝网,花了500元钱,找了一个上门维修电脑的师傅,上门给我装了一个windows系统。。。。。。 表砍我。。。 当时买mac的初衷,只是想要个固态硬盘的笔记本,用来运行一些复杂的扑克软件。而看了当时所有的SSD笔记本后,最终决定,还是买个好(xiong)看(da)的。 已经有好几个朋友问我mba怎么样了,所以今天尽量客观
程序员一般通过什么途径接私活?
二哥,你好,我想知道一般程序猿都如何接私活,我也想接,能告诉我一些方法吗? 上面是一个读者“烦不烦”问我的一个问题。其实不止是“烦不烦”,还有很多读者问过我类似这样的问题。 我接的私活不算多,挣到的钱也没有多少,加起来不到 20W。说实话,这个数目说出来我是有点心虚的,毕竟太少了,大家轻喷。但我想,恰好配得上“一般程序员”这个称号啊。毕竟苍蝇再小也是肉,我也算是有经验的人了。 唾弃接私活、做外
大学四年自学走来,这些珍藏的「实用工具/学习网站」我全贡献出来了
知乎高赞:文中列举了互联网一线大厂程序员都在用的工具集合,涉及面非常广,小白和老手都可以进来看看,或许有新收获。
《阿里巴巴开发手册》读书笔记-编程规约
Java编程规约命名风格 命名风格 类名使用UpperCamelCase风格 方法名,参数名,成员变量,局部变量都统一使用lowerCamelcase风格 常量命名全部大写,单词间用下划线隔开, 力求语义表达完整清楚,不要嫌名字长 ...
Python爬虫爬取淘宝,京东商品信息
小编是一个理科生,不善长说一些废话。简单介绍下原理然后直接上代码。 使用的工具(Python+pycharm2019.3+selenium+xpath+chromedriver)其中要使用pycharm也可以私聊我selenium是一个框架可以通过pip下载 pip install selenium -i https://pypi.tuna.tsinghua.edu.cn/simple/ 
阿里程序员写了一个新手都写不出的低级bug,被骂惨了。
你知道的越多,你不知道的越多 点赞再看,养成习惯 本文 GitHub https://github.com/JavaFamily 已收录,有一线大厂面试点思维导图,也整理了很多我的文档,欢迎Star和完善,大家面试可以参照考点复习,希望我们一起有点东西。 前前言 为啥今天有个前前言呢? 因为你们的丙丙啊,昨天有牌面了哟,直接被微信官方推荐,知乎推荐,也就仅仅是还行吧(心里乐开花)
Java工作4年来应聘要16K最后没要,细节如下。。。
前奏: 今天2B哥和大家分享一位前几天面试的一位应聘者,工作4年26岁,统招本科。 以下就是他的简历和面试情况。 基本情况: 专业技能: 1、&nbsp;熟悉Sping了解SpringMVC、SpringBoot、Mybatis等框架、了解SpringCloud微服务 2、&nbsp;熟悉常用项目管理工具:SVN、GIT、MAVEN、Jenkins 3、&nbsp;熟悉Nginx、tomca
Python爬虫精简步骤1 获取数据
爬虫的工作分为四步: 1.获取数据。爬虫程序会根据我们提供的网址,向服务器发起请求,然后返回数据。 2.解析数据。爬虫程序会把服务器返回的数据解析成我们能读懂的格式。 3.提取数据。爬虫程序再从中提取出我们需要的数据。 4.储存数据。爬虫程序把这些有用的数据保存起来,便于你日后的使用和分析。 这一篇的内容就是:获取数据。 首先,我们将会利用一个强大的库——requests来获取数据。 在电脑上安装
Python绘图,圣诞树,花,爱心 | Turtle篇
1.画圣诞树 import turtle screen = turtle.Screen() screen.setup(800,600) circle = turtle.Turtle() circle.shape('circle') circle.color('red') circle.speed('fastest') circle.up() square = turtle.Turtle()
作为一个程序员,CPU的这些硬核知识你必须会!
CPU对每个程序员来说,是个既熟悉又陌生的东西? 如果你只知道CPU是中央处理器的话,那可能对你并没有什么用,那么作为程序员的我们,必须要搞懂的就是CPU这家伙是如何运行的,尤其要搞懂它里面的寄存器是怎么一回事,因为这将让你从底层明白程序的运行机制。 随我一起,来好好认识下CPU这货吧 把CPU掰开来看 对于CPU来说,我们首先就要搞明白它是怎么回事,也就是它的内部构造,当然,CPU那么牛的一个东
破14亿,Python分析我国存在哪些人口危机!
2020年1月17日,国家统计局发布了2019年国民经济报告,报告中指出我国人口突破14亿。 猪哥的朋友圈被14亿人口刷屏,但是很多人并没有看到我国复杂的人口问题:老龄化、男女比例失衡、生育率下降、人口红利下降等。 今天我们就来分析一下我们国家的人口数据吧! 更多有趣分析教程,扫描下方二维码关注vx公号「裸睡的猪」 即可查看! 一、背景 1.人口突破14亿 2020年1月17日,国家统计局发布
听说想当黑客的都玩过这个Monyer游戏(1~14攻略)
第零关 进入传送门开始第0关(游戏链接) 请点击链接进入第1关: 连接在左边→ ←连接在右边 看不到啊。。。。(只能看到一堆大佬做完的留名,也能看到菜鸡的我,在后面~~) 直接fn+f12吧 &lt;span&gt;连接在左边→&lt;/span&gt; &lt;a href="first.php"&gt;&lt;/a&gt; &lt;span&gt;←连接在右边&lt;/span&gt; o
在家远程办公效率低?那你一定要收好这个「在家办公」神器!
相信大家都已经收到国务院延长春节假期的消息,接下来,在家远程办公可能将会持续一段时间。 但是问题来了。远程办公不是人在电脑前就当坐班了,相反,对于沟通效率,文件协作,以及信息安全都有着极高的要求。有着非常多的挑战,比如: 1在异地互相不见面的会议上,如何提高沟通效率? 2文件之间的来往反馈如何做到及时性?如何保证信息安全? 3如何规划安排每天工作,以及如何进行成果验收? ......
作为一个程序员,内存和磁盘的这些事情,你不得不知道啊!!!
截止目前,我已经分享了如下几篇文章: 一个程序在计算机中是如何运行的?超级干货!!! 作为一个程序员,CPU的这些硬核知识你必须会! 作为一个程序员,内存的这些硬核知识你必须懂! 这些知识可以说是我们之前都不太重视的基础知识,可能大家在上大学的时候都学习过了,但是嘞,当时由于老师讲解的没那么有趣,又加上这些知识本身就比较枯燥,所以嘞,大家当初几乎等于没学。 再说啦,学习这些,也看不出来有什么用啊!
别低估自己的直觉,也别高估自己的智商
所有群全部吵翻天,朋友圈全部沦陷,公众号疯狂转发。这两周没怎么发原创,只发新闻,可能有人注意到了。我不是懒,是文章写了却没发,因为大家的关注力始终在这次的疫情上面,发了也没人看。当然,我...
这个世界上人真的分三六九等,你信吗?
偶然间,在知乎上看到一个问题 一时间,勾起了我深深的回忆。 以前在厂里打过两次工,做过家教,干过辅导班,做过中介。零下几度的晚上,贴过广告,满脸、满手地长冻疮。   再回首那段岁月,虽然苦,但让我学会了坚持和忍耐。让我明白了,在这个世界上,无论环境多么的恶劣,只要心存希望,星星之火,亦可燎原。   下文是原回答,希望能对你能有所启发。   如果我说,这个世界上人真的分三六九等,
为什么听过很多道理,依然过不好这一生?
记录学习笔记是一个重要的习惯,不希望学习过的东西成为过眼云烟。做总结的同时也是一次复盘思考的过程。 本文是根据阅读得到 App上《万维钢·精英日课》部分文章后所做的一点笔记和思考。学习是一个系统的过程,思维模型的建立需要相对完整的学习和思考过程。以下观点是在碎片化阅读后总结的一点心得总结。
B 站上有哪些很好的学习资源?
哇说起B站,在小九眼里就是宝藏般的存在,放年假宅在家时一天刷6、7个小时不在话下,更别提今年的跨年晚会,我简直是跪着看完的!! 最早大家聚在在B站是为了追番,再后来我在上面刷欧美新歌和漂亮小姐姐的舞蹈视频,最近两年我和周围的朋友们已经把B站当作学习教室了,而且学习成本还免费,真是个励志的好平台ヽ(.◕ฺˇд ˇ◕ฺ;)ノ 下面我们就来盘点一下B站上优质的学习资源: 综合类 Oeasy: 综合
如何优雅地打印一个Java对象?
你好呀,我是沉默王二,一个和黄家驹一样身高,和刘德华一样颜值的程序员。虽然已经写了十多年的 Java 代码,但仍然觉得自己是个菜鸟(请允许我惭愧一下)。 在一个月黑风高的夜晚,我思前想后,觉得再也不能这么蹉跎下去了。于是痛下决心,准备通过输出的方式倒逼输入,以此来修炼自己的内功,从而进阶成为一名真正意义上的大神。与此同时,希望这些文章能够帮助到更多的读者,让大家在学习的路上不再寂寞、空虚和冷。 ...
雷火神山直播超两亿,Web播放器事件监听是怎么实现的?
Web播放器解决了在手机浏览器和PC浏览器上播放音视频数据的问题,让视音频内容可以不依赖用户安装App,就能进行播放以及在社交平台进行传播。在视频业务大数据平台中,播放数据的统计分析非常重要,所以Web播放器在使用过程中,需要对其内部的数据进行收集并上报至服务端,此时,就需要对发生在其内部的一些播放行为进行事件监听。 那么Web播放器事件监听是怎么实现的呢? 01 监听事件明细表 名
3万字总结,Mysql优化之精髓
本文知识点较多,篇幅较长,请耐心学习 MySQL已经成为时下关系型数据库产品的中坚力量,备受互联网大厂的青睐,出门面试想进BAT,想拿高工资,不会点MySQL优化知识,拿offer的成功率会大大下降。 为什么要优化 系统的吞吐量瓶颈往往出现在数据库的访问速度上 随着应用程序的运行,数据库的中的数据会越来越多,处理时间会相应变慢 数据是存放在磁盘上的,读写速度无法和内存相比 如何优化 设计
Linux 命令(122)—— watch 命令
1.命令简介 2.命令格式 3.选项说明 4.常用示例 参考文献 [1] watch(1) manual
Linux 命令(121)—— cal 命令
1.命令简介 2.命令格式 3.选项说明 4.常用示例 参考文献 [1] cal(1) manual
记jsp+servlet+jdbc实现的新闻管理系统
1.工具:eclipse+SQLyog 2.介绍:实现的内容就是显示新闻的基本信息,然后一个增删改查的操作。 3.数据库表设计 列名 中文名称 数据类型 长度 非空 newsId 文章ID int 11 √ newsTitle 文章标题 varchar 20 √ newsContent 文章内容 text newsStatus 是否审核 varchar 10 news...
Python新型冠状病毒疫情数据自动爬取+统计+发送报告+数据屏幕(三)发送篇
今天介绍的项目是使用 Itchat 发送统计报告 项目功能设计: 定时爬取疫情数据存入Mysql 进行数据分析制作疫情报告 使用itchat给亲人朋友发送分析报告(本文) 基于Django做数据屏幕 使用Tableau做数据分析 来看看最终效果 目前已经完成,预计2月12日前更新 使用 itchat 发送数据统计报告 itchat 是一个基于 web微信的一个框架,但微信官方并不允
相关热词 c# 时间比天数 c# oracle查询 c# 主动推送 事件 c# java 属性 c# 控制台 窗体 c# 静态类存值 c#矢量作图 c#窗体调用外部程式 c# enum是否合法 c# 如何卸载引用
立即提问