tx-lcn分布式事务客户端无法启动 5C

18:14:00.235 [main] DEBUG org.springframework.boot.devtools.settings.DevToolsSettings - Included patterns for restart : []
18:14:00.238 [main] DEBUG org.springframework.boot.devtools.settings.DevToolsSettings - Excluded patterns for restart : [/spring-boot-actuator/target/classes/, /spring-boot-devtools/target/classes/, /spring-boot/target/classes/, /spring-boot-starter-[\w-]+/, /spring-boot-autoconfigure/target/classes/, /spring-boot-starter/target/classes/]
18:14:00.238 [main] DEBUG org.springframework.boot.devtools.restart.ChangeableUrls - Matching URLs for reloading : [file:/D:/ocean-workspace/ocean-vehicle-service/target/classes/]
2019-06-25 18:14:00.722 INFO 13504 --- [ restartedMain] s.c.a.AnnotationConfigApplicationContext : Refreshing org.springframework.context.annotation.AnnotationConfigApplicationContext@5442519c: startup date [Tue Jun 25 18:14:00 CST 2019]; root of context hierarchy
2019-06-25 18:14:00.995 INFO 13504 --- [ restartedMain] f.a.AutowiredAnnotationBeanPostProcessor : JSR-330 'javax.inject.Inject' annotation found and supported for autowiring
2019-06-25 18:14:01.018 INFO 13504 --- [ restartedMain] trationDelegate$BeanPostProcessorChecker : Bean 'configurationPropertiesRebinderAutoConfiguration' of type [org.springframework.cloud.autoconfigure.ConfigurationPropertiesRebinderAutoConfiguration$$EnhancerBySpringCGLIB$$3b66cedb] is not eligible for getting processed by all BeanPostProcessors (for example: not eligible for auto-proxying)
2019-06-25 18:14:01.173 INFO 13504 --- [ restartedMain] o.s.c.n.eureka.InstanceInfoFactory : Setting initial instance status as: STARTING
2019-06-25 18:14:01.227 INFO 13504 --- [ restartedMain] com.netflix.discovery.DiscoveryClient : Initializing Eureka in region us-east-1
2019-06-25 18:14:01.458 INFO 13504 --- [ restartedMain] c.n.d.provider.DiscoveryJerseyProvider : Using JSON encoding codec LegacyJacksonJson
2019-06-25 18:14:01.458 INFO 13504 --- [ restartedMain] c.n.d.provider.DiscoveryJerseyProvider : Using JSON decoding codec LegacyJacksonJson
2019-06-25 18:14:01.560 INFO 13504 --- [ restartedMain] c.n.d.provider.DiscoveryJerseyProvider : Using XML encoding codec XStreamXml
2019-06-25 18:14:01.560 INFO 13504 --- [ restartedMain] c.n.d.provider.DiscoveryJerseyProvider : Using XML decoding codec XStreamXml
2019-06-25 18:14:01.688 INFO 13504 --- [ restartedMain] c.n.d.s.r.aws.ConfigClusterResolver : Resolving eureka endpoints via configuration
2019-06-25 18:14:01.727 INFO 13504 --- [ restartedMain] com.netflix.discovery.DiscoveryClient : Disable delta property : false
2019-06-25 18:14:01.728 INFO 13504 --- [ restartedMain] com.netflix.discovery.DiscoveryClient : Single vip registry refresh property : null
2019-06-25 18:14:01.728 INFO 13504 --- [ restartedMain] com.netflix.discovery.DiscoveryClient : Force full registry fetch : false
2019-06-25 18:14:01.728 INFO 13504 --- [ restartedMain] com.netflix.discovery.DiscoveryClient : Application is null : false
2019-06-25 18:14:01.728 INFO 13504 --- [ restartedMain] com.netflix.discovery.DiscoveryClient : Registered Applications size is zero : true
2019-06-25 18:14:01.728 INFO 13504 --- [ restartedMain] com.netflix.discovery.DiscoveryClient : Application version is -1: true
2019-06-25 18:14:01.728 INFO 13504 --- [ restartedMain] com.netflix.discovery.DiscoveryClient : Getting all instance registry info from the eureka server
2019-06-25 18:14:01.947 INFO 13504 --- [ restartedMain] com.netflix.discovery.DiscoveryClient : The response status is 200
2019-06-25 18:14:01.949 INFO 13504 --- [ restartedMain] com.netflix.discovery.DiscoveryClient : Not registering with Eureka server per configuration
2019-06-25 18:14:01.951 INFO 13504 --- [ restartedMain] com.netflix.discovery.DiscoveryClient : Discovery Client initialized at timestamp 1561457641950 with initial instances count: 20

    _______   __      _     _____  _   _
   |_   _\ \ / /     | |   /  __ \| \ | |
     | |  \ V /______| |   | /  \/|  \| |
     | |  /   \______| |   | |    | . ` |
     | | / /^\ \     | |___| \__/\| |\  |
     \_/ \/   \/     \_____/\____/\_| \_/

           TC  version:5.0.2.RELEASE

2019-06-25 18:14:02.100 INFO 13504 --- [ restartedMain] c.c.c.ConfigServicePropertySourceLocator : Fetching config from server at : http://10.115.132.40:9000/
2019-06-25 18:14:02.220 INFO 13504 --- [ restartedMain] c.c.c.ConfigServicePropertySourceLocator : Located environment: name=ocean-vehicle-service, profiles=[dev], label=master, version=null, state=null
2019-06-25 18:14:02.220 INFO 13504 --- [ restartedMain] b.c.PropertySourceBootstrapConfiguration : Located property source: CompositePropertySource {name='configService', propertySources=[MapPropertySource {name='file:/home/ocean/conf/ocean-vehicle-service-dev.yml'}]}
2019-06-25 18:14:02,250 -[INFO ] restartedMain com.ocean.vehicle.OceanVehicleServiceApplication:SpringApplication.java:658- The following profiles are active: dev
2019-06-25 18:14:02,250 [INFO ] restartedMain com.ocean.vehicle.OceanVehicleServiceApplication:SpringApplication.java:658- The following profiles are active: dev
2019-06-25 18:14:05,558 [WARN ] localhost-startStop-1 com.netflix.config.sources.URLConfigurationSource:URLConfigurationSource.java:121- No URLs will be polled as dynamic configuration sources.
2019-06-25 18:14:06,606 [ERROR ] localhost-startStop-1 org.springframework.boot.web.embedded.tomcat.TomcatStarter:TomcatStarter.java:62- Error starting Tomcat context. Exception: org.springframework.beans.factory.BeanCreationException. Message: Error creating bean with name 'servletEndpointRegistrar' defined in class path resource [org/springframework/boot/actuate/autoconfigure/endpoint/web/ServletEndpointManagementContextConfiguration$WebMvcServletEndpointManagementContextConfiguration.class]: Bean instantiation via factory method failed; nested exception is org.springframework.beans.BeanInstantiationException: Failed to instantiate [org.springframework.boot.actuate.endpoint.web.ServletEndpointRegistrar]: Factory method 'servletEndpointRegistrar' threw exception; nested exception is org.springframework.beans.factory.BeanCreationException: Error creating bean with name 'healthEndpoint' defined in class path resource [org/springframework/boot/actuate/autoconfigure/health/HealthEndpointConfiguration.class]: Bean instantiation via factory method failed; nested exception is org.springframework.beans.BeanInstantiationException: Failed to instantiate [org.springframework.boot.actuate.health.HealthEndpoint]: Factory method 'healthEndpoint' threw exception; nested exception is org.springframework.beans.factory.BeanCreationException: Error creating bean with name 'org.springframework.boot.actuate.autoconfigure.jdbc.DataSourceHealthIndicatorAutoConfiguration': Bean instantiation via constructor failed; nested exception is org.springframework.beans.BeanInstantiationException: Failed to instantiate [org.springframework.boot.actuate.autoconfigure.jdbc.DataSourceHealthIndicatorAutoConfiguration$$EnhancerBySpringCGLIB$$8e311d64]: Constructor threw exception; nested exception is org.springframework.beans.factory.BeanCreationException: Error creating bean with name 'dataSource' defined in class path resource [com/alibaba/druid/spring/boot/autoconfigure/DruidDataSourceAutoConfigure.class]: Initialization of bean failed; nested exception is org.springframework.aop.framework.AopConfigException: Could not generate CGLIB subclass of class com.alibaba.druid.spring.boot.autoconfigure.DruidDataSourceWrapper: Common causes of this problem include using a final class or a non-visible class; nested exception is org.springframework.cglib.core.CodeGenerationException: java.lang.reflect.InvocationTargetException-->null
2019-06-25 18:14:06,631 [WARN ] localhost-startStop-1 org.apache.catalina.loader.WebappClassLoaderBase:DirectJDKLog.java:180- The web application [ROOT] appears to have started a thread named [Druid-ConnectionPool-Create-1457476048] but has failed to stop it. This is very likely to create a memory leak. Stack trace of thread:
sun.misc.Unsafe.park(Native Method)
java.util.concurrent.locks.LockSupport.park(LockSupport.java:175)
java.util.concurrent.locks.AbstractQueuedSynchronizer$ConditionObject.await(AbstractQueuedSynchronizer.java:2039)
com.alibaba.druid.pool.DruidDataSource$CreateConnectionThread.run(DruidDataSource.java:2441)
2019-06-25 18:14:06,631 [WARN ] localhost-startStop-1 org.apache.catalina.loader.WebappClassLoaderBase:DirectJDKLog.java:180- The web application [ROOT] appears to have started a thread named [Druid-ConnectionPool-Destroy-1457476048] but has failed to stop it. This is very likely to create a memory leak. Stack trace of thread:
java.lang.Thread.sleep(Native Method)
com.alibaba.druid.pool.DruidDataSource$DestroyConnectionThread.run(DruidDataSource.java:2538)
2019-06-25 18:14:06,634 [WARN ] restartedMain org.springframework.boot.web.servlet.context.AnnotationConfigServletWebServerApplicationContext:AbstractApplicationContext.java:556- Exception encountered during context initialization - cancelling refresh attempt: org.springframework.context.ApplicationContextException: Unable to start web server; nested exception is org.springframework.boot.web.server.WebServerException: Unable to start embedded Tomcat
2019-06-25 18:14:06,648 [ERROR ] restartedMain org.springframework.boot.SpringApplication:SpringApplication.java:837- Application run failed
org.springframework.context.ApplicationContextException: Unable to start web server; nested exception is org.springframework.boot.web.server.WebServerException: Unable to start embedded Tomcat
at org.springframework.boot.web.servlet.context.ServletWebServerApplicationContext.onRefresh(ServletWebServerApplicationContext.java:155)
at org.springframework.context.support.AbstractApplicationContext.refresh(AbstractApplicationContext.java:542)
at org.springframework.boot.web.servlet.context.ServletWebServerApplicationContext.refresh(ServletWebServerApplicationContext.java:140)
at org.springframework.boot.SpringApplication.refresh(SpringApplication.java:754)
at org.springframework.boot.SpringApplication.refreshContext(SpringApplication.java:386)
at org.springframework.boot.SpringApplication.run(SpringApplication.java:307)
at org.springframework.boot.SpringApplication.run(SpringApplication.java:1242)
at org.springframework.boot.SpringApplication.run(SpringApplication.java:1230)
at com.ocean.vehicle.OceanVehicleServiceApplication.main(OceanVehicleServiceApplication.java:28)
at sun.reflect.NativeMethodAccessorImpl.invoke0(Native Method)
at sun.reflect.NativeMethodAccessorImpl.invoke(NativeMethodAccessorImpl.java:62)
at sun.reflect.DelegatingMethodAccessorImpl.invoke(DelegatingMethodAccessorImpl.java:43)
at java.lang.reflect.Method.invoke(Method.java:498)
at org.springframework.boot.devtools.restart.RestartLauncher.run(RestartLauncher.java:49)
Caused by: org.springframework.boot.web.server.WebServerException: Unable to start embedded Tomcat
at org.springframework.boot.web.embedded.tomcat.TomcatWebServer.initialize(TomcatWebServer.java:126)
at org.springframework.boot.web.embedded.tomcat.TomcatWebServer.(TomcatWebServer.java:86)
at org.springframework.boot.web.embedded.tomcat.TomcatServletWebServerFactory.getTomcatWebServer(TomcatServletWebServerFactory.java:413)
at org.springframework.boot.web.embedded.tomcat.TomcatServletWebServerFactory.getWebServer(TomcatServletWebServerFactory.java:174)
at org.springframework.boot.web.servlet.context.ServletWebServerApplicationContext.createWebServer(ServletWebServerApplicationContext.java:179)
at org.springframework.boot.web.servlet.context.ServletWebServerApplicationContext.onRefresh(ServletWebServerApplicationContext.java:152)
... 13 common frames omitted
Caused by: org.springframework.beans.factory.BeanCreationException: Error creating bean with name 'servletEndpointRegistrar' defined in class path resource [org/springframework/boot/actuate/autoconfigure/endpoint/web/ServletEndpointManagementContextConfiguration$WebMvcServletEndpointManagementContextConfiguration.class]: Bean instantiation via factory method failed; nested exception is org.springframework.beans.BeanInstantiationException: Failed to instantiate [org.springframework.boot.actuate.endpoint.web.ServletEndpointRegistrar]: Factory method 'servletEndpointRegistrar' threw exception; nested exception is org.springframework.beans.factory.BeanCreationException: Error creating bean with name 'healthEndpoint' defined in class path resource [org/springframework/boot/actuate/autoconfigure/health/HealthEndpointConfiguration.class]: Bean instantiation via factory method failed; nested exception is org.springframework.beans.BeanInstantiationException: Failed to instantiate [org.springframework.boot.actuate.health.HealthEndpoint]: Factory method 'healthEndpoint' threw exception; nested exception is org.springframework.beans.factory.BeanCreationException: Error creating bean with name 'org.springframework.boot.actuate.autoconfigure.jdbc.DataSourceHealthIndicatorAutoConfiguration': Bean instantiation via constructor failed; nested exception is org.springframework.beans.BeanInstantiationException: Failed to instantiate [org.springframework.boot.actuate.autoconfigure.jdbc.DataSourceHealthIndicatorAutoConfiguration$$EnhancerBySpringCGLIB$$8e311d64]: Constructor threw exception; nested exception is org.springframework.beans.factory.BeanCreationException: Error creating bean with name 'dataSource' defined in class path resource [com/alibaba/druid/spring/boot/autoconfigure/DruidDataSourceAutoConfigure.class]: Initialization of bean failed; nested exception is org.springframework.aop.framework.AopConfigException: Could not generate CGLIB subclass of class com.alibaba.druid.spring.boot.autoconfigure.DruidDataSourceWrapper: Common causes of this problem include using a final class or a non-visible class; nested exception is org.springframework.cglib.core.CodeGenerationException: java.lang.reflect.InvocationTargetException-->null
at org.springframework.beans.factory.support.ConstructorResolver.instantiateUsingFactoryMethod(ConstructorResolver.java:591)
at org.springframework.beans.factory.support.AbstractAutowireCapableBeanFactory.instantiateUsingFactoryMethod(AbstractAutowireCapableBeanFactory.java:1246)
at org.springframework.beans.factory.support.AbstractAutowireCapableBeanFactory.createBeanInstance(AbstractAutowireCapableBeanFactory.java:1096)
at org.springframework.beans.factory.support.AbstractAutowireCapableBeanFactory.doCreateBean(AbstractAutowireCapableBeanFactory.java:535)
at org.springframework.beans.factory.support.AbstractAutowireCapableBeanFactory.createBean(AbstractAutowireCapableBeanFactory.java:495)
at org.springframework.beans.factory.support.AbstractBeanFactory.lambda$doGetBean$0(AbstractBeanFactory.java:317)
at org.springframework.beans.factory.support.DefaultSingletonBeanRegistry.getSingleton(DefaultSingletonBeanRegistry.java:222)
at org.springframework.beans.factory.support.AbstractBeanFactory.doGetBean(AbstractBeanFactory.java:315)
at org.springframework.beans.factory.support.AbstractBeanFactory.getBean(AbstractBeanFactory.java:204)
at org.springframework.boot.web.servlet.ServletContextInitializerBeans.getOrderedBeansOfType(ServletContextInitializerBeans.java:226)
at org.springframework.boot.web.servlet.ServletContextInitializerBeans.getOrderedBeansOfType(ServletContextInitializerBeans.java:214)
at org.springframework.boot.web.servlet.ServletContextInitializerBeans.addServletContextInitializerBeans(ServletContextInitializerBeans.java:91)
at org.springframework.boot.web.servlet.ServletContextInitializerBeans.(ServletContextInitializerBeans.java:80)
at org.springframework.boot.web.servlet.context.ServletWebServerApplicationContext.getServletContextInitializerBeans(ServletWebServerApplicationContext.java:250)
at org.springframework.boot.web.servlet.context.ServletWebServerApplicationContext.selfInitialize(ServletWebServerApplicationContext.java:237)
at org.springframework.boot.web.embedded.tomcat.TomcatStarter.onStartup(TomcatStarter.java:54)
at org.apache.catalina.core.StandardContext.startInternal(StandardContext.java:5245)
at org.apache.catalina.util.LifecycleBase.start(LifecycleBase.java:150)
at org.apache.catalina.core.ContainerBase$StartChild.call(ContainerBase.java:1420)
at org.apache.catalina.core.ContainerBase$StartChild.call(ContainerBase.java:1410)
at java.util.concurrent.FutureTask.run(FutureTask.java:266)
at java.util.concurrent.ThreadPoolExecutor.runWorker(ThreadPoolExecutor.java:1149)
at java.util.concurrent.ThreadPoolExecutor$Worker.run(ThreadPoolExecutor.java:624)
at java.lang.Thread.run(Thread.java:748)
Caused by: org.springframework.beans.BeanInstantiationException: Failed to instantiate [org.springframework.boot.actuate.endpoint.web.ServletEndpointRegistrar]: Factory method 'servletEndpointRegistrar' threw exception; nested exception is org.springframework.beans.factory.BeanCreationException: Error creating bean with name 'healthEndpoint' defined in class path resource [org/springframework/boot/actuate/autoconfigure/health/HealthEndpointConfiguration.class]: Bean instantiation via factory method failed; nested exception is org.springframework.beans.BeanInstantiationException: Failed to instantiate [org.springframework.boot.actuate.health.HealthEndpoint]: Factory method 'healthEndpoint' threw exception; nested exception is org.springframework.beans.factory.BeanCreationException: Error creating bean with name 'org.springframework.boot.actuate.autoconfigure.jdbc.DataSourceHealthIndicatorAutoConfiguration': Bean instantiation via constructor failed; nested exception is org.springframework.beans.BeanInstantiationException: Failed to instantiate [org.springframework.boot.actuate.autoconfigure.jdbc.DataSourceHealthIndicatorAutoConfiguration$$EnhancerBySpringCGLIB$$8e311d64]: Constructor threw exception; nested exception is org.springframework.beans.factory.BeanCreationException: Error creating bean with name 'dataSource' defined in class path resource [com/alibaba/druid/spring/boot/autoconfigure/DruidDataSourceAutoConfigure.class]: Initialization of bean failed; nested exception is org.springframework.aop.framework.AopConfigException: Could not generate CGLIB subclass of class com.alibaba.druid.spring.boot.autoconfigure.DruidDataSourceWrapper: Common causes of this problem include using a final class or a non-visible class; nested exception is org.springframework.cglib.core.CodeGenerationException: java.lang.reflect.InvocationTargetException-->null
at org.springframework.beans.factory.support.SimpleInstantiationStrategy.instantiate(SimpleInstantiationStrategy.java:185)
at org.springframework.beans.factory.support.ConstructorResolver.instantiateUsingFactoryMethod(ConstructorResolver.java:583)
... 23 common frames omitted
Caused by: org.springframework.beans.factory.BeanCreationException: Error creating bean with name 'healthEndpoint' defined in class path resource [org/springframework/boot/actuate/autoconfigure/health/HealthEndpointConfiguration.class]: Bean instantiation via factory method failed; nested exception is org.springframework.beans.BeanInstantiationException: Failed to instantiate [org.springframework.boot.actuate.health.HealthEndpoint]: Factory method 'healthEndpoint' threw exception; nested exception is org.springframework.beans.factory.BeanCreationException: Error creating bean with name 'org.springframework.boot.actuate.autoconfigure.jdbc.DataSourceHealthIndicatorAutoConfiguration': Bean instantiation via constructor failed; nested exception is org.springframework.beans.BeanInstantiationException: Failed to instantiate [org.springframework.boot.actuate.autoconfigure.jdbc.DataSourceHealthIndicatorAutoConfiguration$$EnhancerBySpringCGLIB$$8e311d64]: Constructor threw exception; nested exception is org.springframework.beans.factory.BeanCreationException: Error creating bean with name 'dataSource' defined in class path resource [com/alibaba/druid/spring/boot/autoconfigure/DruidDataSourceAutoConfigure.class]: Initialization of bean failed; nested exception is org.springframework.aop.framework.AopConfigException: Could not generate CGLIB subclass of class com.alibaba.druid.spring.boot.autoconfigure.DruidDataSourceWrapper: Common causes of this problem include using a final class or a non-visible class; nested exception is org.springframework.cglib.core.CodeGenerationException: java.lang.reflect.InvocationTargetException-->null
at org.springframework.beans.factory.support.ConstructorResolver.instantiateUsingFactoryMethod(ConstructorResolver.java:591)
at org.springframework.beans.factory.support.AbstractAutowireCapableBeanFactory.instantiateUsingFactoryMethod(AbstractAutowireCapableBeanFactory.java:1246)
at org.springframework.beans.factory.support.AbstractAutowireCapableBeanFactory.createBeanInstance(AbstractAutowireCapableBeanFactory.java:1096)
at org.springframework.beans.factory.support.AbstractAutowireCapableBeanFactory.doCreateBean(AbstractAutowireCapableBeanFactory.java:535)
at org.springframework.beans.factory.support.AbstractAutowireCapableBeanFactory.createBean(AbstractAutowireCapableBeanFactory.java:495)
at org.springframework.beans.factory.support.AbstractBeanFactory.lambda$doGetBean$0(AbstractBeanFactory.java:317)
at org.springframework.beans.factory.support.DefaultSingletonBeanRegistry.getSingleton(DefaultSingletonBeanRegistry.java:222)
at org.springframework.beans.factory.support.AbstractBeanFactory.doGetBean(AbstractBeanFactory.java:315)
at org.springframework.beans.factory.support.AbstractBeanFactory.getBean(AbstractBeanFactory.java:199)
at org.springframework.context.support.AbstractApplicationContext.getBean(AbstractApplicationContext.java:1087)
at org.springframework.boot.actuate.endpoint.annotation.EndpointDiscoverer.createEndpointBean(EndpointDiscoverer.java:144)
at org.springframework.boot.actuate.endpoint.annotation.EndpointDiscoverer.createEndpointBeans(EndpointDiscoverer.java:133)
at org.springframework.boot.actuate.endpoint.annotation.EndpointDiscoverer.discoverEndpoints(EndpointDiscoverer.java:123)
at org.springframework.boot.actuate.endpoint.annotation.EndpointDiscoverer.getEndpoints(EndpointDiscoverer.java:117)
at org.springframework.boot.actuate.autoconfigure.endpoint.web.ServletEndpointManagementContextConfiguration$WebMvcServletEndpointManagementContextConfiguration.servletEndpointRegistrar(ServletEndpointManagementContextConfiguration.java:75)
at org.springframework.boot.actuate.autoconfigure.endpoint.web.ServletEndpointManagementContextConfiguration$WebMvcServletEndpointManagementContextConfiguration$$EnhancerBySpringCGLIB$$d58123b9.CGLIB$servletEndpointRegistrar$0()
at org.springframework.boot.actuate.autoconfigure.endpoint.web.ServletEndpointManagementContextConfiguration$WebMvcServletEndpointManagementContextConfiguration$$EnhancerBySpringCGLIB$$d58123b9$$FastClassBySpringCGLIB$$e40ba365.invoke()
at org.springframework.cglib.proxy.MethodProxy.invokeSuper(MethodProxy.java:228)
at org.springframework.context.annotation.ConfigurationClassEnhancer$BeanMethodInterceptor.intercept(ConfigurationClassEnhancer.java:365)
at org.springframework.boot.actuate.autoconfigure.endpoint.web.ServletEndpointManagementContextConfiguration$WebMvcServletEndpointManagementContextConfiguration$$EnhancerBySpringCGLIB$$d58123b9.servletEndpointRegistrar()
at sun.reflect.NativeMethodAccessorImpl.invoke0(Native Method)
at sun.reflect.NativeMethodAccessorImpl.invoke(NativeMethodAccessorImpl.java:62)
at sun.reflect.DelegatingMethodAccessorImpl.invoke(DelegatingMethodAccessorImpl.java:43)
at java.lang.reflect.Method.invoke(Method.java:498)
at org.springframework.beans.factory.support.SimpleInstantiationStrategy.instantiate(SimpleInstantiationStrategy.java:154)
... 24 common frames omitted
Caused by: org.springframework.beans.BeanInstantiationException: Failed to instantiate [org.springframework.boot.actuate.health.HealthEndpoint]: Factory method 'healthEndpoint' threw exception; nested exception is org.springframework.beans.factory.BeanCreationException: Error creating bean with name 'org.springframework.boot.actuate.autoconfigure.jdbc.DataSourceHealthIndicatorAutoConfiguration': Bean instantiation via constructor failed; nested exception is org.springframework.beans.BeanInstantiationException: Failed to instantiate [org.springframework.boot.actuate.autoconfigure.jdbc.DataSourceHealthIndicatorAutoConfiguration$$EnhancerBySpringCGLIB$$8e311d64]: Constructor threw exception; nested exception is org.springframework.beans.factory.BeanCreationException: Error creating bean with name 'dataSource' defined in class path resource [com/alibaba/druid/spring/boot/autoconfigure/DruidDataSourceAutoConfigure.class]: Initialization of bean failed; nested exception is org.springframework.aop.framework.AopConfigException: Could not generate CGLIB subclass of class com.alibaba.druid.spring.boot.autoconfigure.DruidDataSourceWrapper: Common causes of this problem include using a final class or a non-visible class; nested exception is org.springframework.cglib.core.CodeGenerationException: java.lang.reflect.InvocationTargetException-->null
at org.springframework.beans.factory.support.SimpleInstantiationStrategy.instantiate(SimpleInstantiationStrategy.java:185)
at org.springframework.beans.factory.support.ConstructorResolver.instantiateUsingFactoryMethod(ConstructorResolver.java:583)
... 48 common frames omitted
Caused by: org.springframework.beans.factory.BeanCreationException: Error creating bean with name 'org.springframework.boot.actuate.autoconfigure.jdbc.DataSourceHealthIndicatorAutoConfiguration': Bean instantiation via constructor failed; nested exception is org.springframework.beans.BeanInstantiationException: Failed to instantiate [org.springframework.boot.actuate.autoconfigure.jdbc.DataSourceHealthIndicatorAutoConfiguration$$EnhancerBySpringCGLIB$$8e311d64]: Constructor threw exception; nested exception is org.springframework.beans.factory.BeanCreationException: Error creating bean with name 'dataSource' defined in class path resource [com/alibaba/druid/spring/boot/autoconfigure/DruidDataSourceAutoConfigure.class]: Initialization of bean failed; nested exception is org.springframework.aop.framework.AopConfigException: Could not generate CGLIB subclass of class com.alibaba.druid.spring.boot.autoconfigure.DruidDataSourceWrapper: Common causes of this problem include using a final class or a non-visible class; nested exception is org.springframework.cglib.core.CodeGenerationException: java.lang.reflect.InvocationTargetException-->null
at org.springframework.beans.factory.support.ConstructorResolver.autowireConstructor(ConstructorResolver.java:283)
at org.springframework.beans.factory.support.AbstractAutowireCapableBeanFactory.autowireConstructor(AbstractAutowireCapableBeanFactory.java:1266)
at org.springframework.beans.factory.support.AbstractAutowireCapableBeanFactory.createBeanInstance(AbstractAutowireCapableBeanFactory.java:1123)
at org.springframework.beans.factory.support.AbstractAutowireCapableBeanFactory.doCreateBean(AbstractAutowireCapableBeanFactory.java:535)
at org.springframework.beans.factory.support.AbstractAutowireCapableBeanFactory.createBean(AbstractAutowireCapableBeanFactory.java:495)
at org.springframework.beans.factory.support.AbstractBeanFactory.lambda$doGetBean$0(AbstractBeanFactory.java:317)
at org.springframework.beans.factory.support.DefaultSingletonBeanRegistry.getSingleton(DefaultSingletonBeanRegistry.java:222)
at org.springframework.beans.factory.support.AbstractBeanFactory.doGetBean(AbstractBeanFactory.java:315)
at org.springframework.beans.factory.support.AbstractBeanFactory.getBean(AbstractBeanFactory.java:199)
at org.springframework.beans.factory.support.ConstructorResolver.instantiateUsingFactoryMethod(ConstructorResolver.java:373)
at org.springframework.beans.factory.support.AbstractAutowireCapableBeanFactory.instantiateUsingFactoryMethod(AbstractAutowireCapableBeanFactory.java:1246)
at org.springframework.beans.factory.support.AbstractAutowireCapableBeanFactory.createBeanInstance(AbstractAutowireCapableBeanFactory.java:1096)
at org.springframework.beans.factory.support.AbstractAutowireCapableBeanFactory.doCreateBean(AbstractAutowireCapableBeanFactory.java:535)
at org.springframework.beans.factory.support.AbstractAutowireCapableBeanFactory.createBean(AbstractAutowireCapableBeanFactory.java:495)
at org.springframework.beans.factory.support.AbstractBeanFactory.lambda$doGetBean$0(AbstractBeanFactory.java:317)
at org.springframework.beans.factory.support.DefaultSingletonBeanRegistry.getSingleton(DefaultSingletonBeanRegistry.java:222)
at org.springframework.beans.factory.support.AbstractBeanFactory.doGetBean(AbstractBeanFactory.java:315)
at org.springframework.beans.factory.support.AbstractBeanFactory.getBean(AbstractBeanFactory.java:199)
at org.springframework.beans.factory.support.DefaultListableBeanFactory.getBeansOfType(DefaultListableBeanFactory.java:514)
at org.springframework.beans.factory.support.DefaultListableBeanFactory.getBeansOfType(DefaultListableBeanFactory.java:502)
at org.springframework.context.support.AbstractApplicationContext.getBeansOfType(AbstractApplicationContext.java:1196)
at org.springframework.boot.actuate.autoconfigure.health.HealthIndicatorBeansComposite.get(HealthIndicatorBeansComposite.java:46)
at org.springframework.boot.actuate.autoconfigure.health.HealthEndpointConfiguration.healthEndpoint(HealthEndpointConfiguration.java:38)
at org.springframework.boot.actuate.autoconfigure.health.HealthEndpointConfiguration$$EnhancerBySpringCGLIB$$3bed81c1.CGLIB$healthEndpoint$0()
at org.springframework.boot.actuate.autoconfigure.health.HealthEndpointConfiguration$$EnhancerBySpringCGLIB$$3bed81c1$$FastClassBySpringCGLIB$$9f90890.invoke()
at org.springframework.cglib.proxy.MethodProxy.invokeSuper(MethodProxy.java:228)
at org.springframework.context.annotation.ConfigurationClassEnhancer$BeanMethodInterceptor.intercept(ConfigurationClassEnhancer.java:365)
at org.springframework.boot.actuate.autoconfigure.health.HealthEndpointConfiguration$$EnhancerBySpringCGLIB$$3bed81c1.healthEndpoint()
at sun.reflect.NativeMethodAccessorImpl.invoke0(Native Method)
at sun.reflect.NativeMethodAccessorImpl.invoke(NativeMethodAccessorImpl.java:62)
at sun.reflect.DelegatingMethodAccessorImpl.invoke(DelegatingMethodAccessorImpl.java:43)
at java.lang.reflect.Method.invoke(Method.java:498)
at org.springframework.beans.factory.support.SimpleInstantiationStrategy.instantiate(SimpleInstantiationStrategy.java:154)
... 49 common frames omitted
Caused by: org.springframework.beans.BeanInstantiationException: Failed to instantiate [org.springframework.boot.actuate.autoconfigure.jdbc.DataSourceHealthIndicatorAutoConfiguration$$EnhancerBySpringCGLIB$$8e311d64]: Constructor threw exception; nested exception is org.springframework.beans.factory.BeanCreationException: Error creating bean with name 'dataSource' defined in class path resource [com/alibaba/druid/spring/boot/autoconfigure/DruidDataSourceAutoConfigure.class]: Initialization of bean failed; nested exception is org.springframework.aop.framework.AopConfigException: Could not generate CGLIB subclass of class com.alibaba.druid.spring.boot.autoconfigure.DruidDataSourceWrapper: Common causes of this problem include using a final class or a non-visible class; nested exception is org.springframework.cglib.core.CodeGenerationException: java.lang.reflect.InvocationTargetException-->null
at org.springframework.beans.BeanUtils.instantiateClass(BeanUtils.java:182)
at org.springframework.beans.factory.support.SimpleInstantiationStrategy.instantiate(SimpleInstantiationStrategy.java:117)
at org.springframework.beans.factory.support.ConstructorResolver.autowireConstructor(ConstructorResolver.java:276)
... 81 common frames omitted
Caused by: org.springframework.beans.factory.BeanCreationException: Error creating bean with name 'dataSource' defined in class path resource [com/alibaba/druid/spring/boot/autoconfigure/DruidDataSourceAutoConfigure.class]: Initialization of bean failed; nested exception is org.springframework.aop.framework.AopConfigException: Could not generate CGLIB subclass of class com.alibaba.druid.spring.boot.autoconfigure.DruidDataSourceWrapper: Common causes of this problem include using a final class or a non-visible class; nested exception is org.springframework.cglib.core.CodeGenerationException: java.lang.reflect.InvocationTargetException-->null
at org.springframework.beans.factory.support.AbstractAutowireCapableBeanFactory.doCreateBean(AbstractAutowireCapableBeanFactory.java:581)
at org.springframework.beans.factory.support.AbstractAutowireCapableBeanFactory.createBean(AbstractAutowireCapableBeanFactory.java:495)
at org.springframework.beans.factory.support.AbstractBeanFactory.lambda$doGetBean$0(AbstractBeanFactory.java:317)
at org.springframework.beans.factory.support.DefaultSingletonBeanRegistry.getSingleton(DefaultSingletonBeanRegistry.java:222)
at org.springframework.beans.factory.support.AbstractBeanFactory.doGetBean(AbstractBeanFactory.java:315)
at org.springframework.beans.factory.support.AbstractBeanFactory.getBean(AbstractBeanFactory.java:199)
at org.springframework.beans.factory.config.DependencyDescriptor.resolveCandidate(DependencyDescriptor.java:251)
at org.springframework.beans.factory.support.DefaultListableBeanFactory.addCandidateEntry(DefaultListableBeanFactory.java:1322)
at org.springframework.beans.factory.support.DefaultListableBeanFactory.findAutowireCandidates(DefaultListableBeanFactory.java:1288)
at org.springframework.beans.factory.support.DefaultListableBeanFactory.resolveMultipleBeans(DefaultListableBeanFactory.java:1215)
at org.springframework.beans.factory.support.DefaultListableBeanFactory.doResolveDependency(DefaultListableBeanFactory.java:1093)
at org.springframework.beans.factory.support.DefaultListableBeanFactory$DependencyObjectProvider.getIfAvailable(DefaultListableBeanFactory.java:1706)
at org.springframework.boot.actuate.autoconfigure.jdbc.DataSourceHealthIndicatorAutoConfiguration.(DataSourceHealthIndicatorAutoConfiguration.java:77)
at org.springframework.boot.actuate.autoconfigure.jdbc.DataSourceHealthIndicatorAutoConfiguration$$EnhancerBySpringCGLIB$$8e311d64.()
at sun.reflect.NativeConstructorAccessorImpl.newInstance0(Native Method)
at sun.reflect.NativeConstructorAccessorImpl.newInstance(NativeConstructorAccessorImpl.java:62)
at sun.reflect.DelegatingConstructorAccessorImpl.newInstance(DelegatingConstructorAccessorImpl.java:45)
at java.lang.reflect.Constructor.newInstance(Constructor.java:423)
at org.springframework.beans.BeanUtils.instantiateClass(BeanUtils.java:170)
... 83 common frames omitted
Caused by: org.springframework.aop.framework.AopConfigException: Could not generate CGLIB subclass of class com.alibaba.druid.spring.boot.autoconfigure.DruidDataSourceWrapper: Common causes of this problem include using a final class or a non-visible class; nested exception is org.springframework.cglib.core.CodeGenerationException: java.lang.reflect.InvocationTargetException-->null
at org.springframework.aop.framework.CglibAopProxy.getProxy(CglibAopProxy.java:208)
at org.springframework.aop.framework.ProxyFactory.getProxy(ProxyFactory.java:110)
at org.springframework.aop.framework.autoproxy.AbstractAutoProxyCreator.createProxy(AbstractAutoProxyCreator.java:473)
at org.springframework.aop.framework.autoproxy.AbstractAutoProxyCreator.wrapIfNecessary(AbstractAutoProxyCreator.java:355)
at org.springframework.aop.framework.autoproxy.AbstractAutoProxyCreator.postProcessAfterInitialization(AbstractAutoProxyCreator.java:304)
at org.springframework.beans.factory.support.AbstractAutowireCapableBeanFactory.applyBeanPostProcessorsAfterInitialization(AbstractAutowireCapableBeanFactory.java:431)
at org.springframework.beans.factory.support.AbstractAutowireCapableBeanFactory.initializeBean(AbstractAutowireCapableBeanFactory.java:1698)
at org.springframework.beans.factory.support.AbstractAutowireCapableBeanFactory.doCreateBean(AbstractAutowireCapableBeanFactory.java:573)
... 101 common frames omitted
Caused by: org.springframework.cglib.core.CodeGenerationException: java.lang.reflect.InvocationTargetException-->null
at org.springframework.cglib.core.AbstractClassGenerator.generate(AbstractClassGenerator.java:345)
at org.springframework.cglib.proxy.Enhancer.generate(Enhancer.java:492)
at org.springframework.cglib.core.AbstractClassGenerator$ClassLoaderData$3.apply(AbstractClassGenerator.java:93)
at org.springframework.cglib.core.AbstractClassGenerator$ClassLoaderData$3.apply(AbstractClassGenerator.java:91)
at org.springframework.cglib.core.internal.LoadingCache$2.call(LoadingCache.java:54)
at java.util.concurrent.FutureTask.run(FutureTask.java:266)
at org.springframework.cglib.core.internal.LoadingCache.createEntry(LoadingCache.java:61)
at org.springframework.cglib.core.internal.LoadingCache.get(LoadingCache.java:34)
at org.springframework.cglib.core.AbstractClassGenerator$ClassLoaderData.get(AbstractClassGenerator.java:116)
at org.springframework.cglib.core.AbstractClassGenerator.create(AbstractClassGenerator.java:291)
at org.springframework.cglib.proxy.Enhancer.createHelper(Enhancer.java:480)
at org.springframework.cglib.proxy.Enhancer.createClass(Enhancer.java:337)
at org.springframework.aop.framework.ObjenesisCglibAopProxy.createProxyClassAndInstance(ObjenesisCglibAopProxy.java:58)
at org.springframework.aop.framework.CglibAopProxy.getProxy(CglibAopProxy.java:205)
... 108 common frames omitted
Caused by: java.lang.reflect.InvocationTargetException: null
at sun.reflect.GeneratedMethodAccessor44.invoke(Unknown Source)
at sun.reflect.DelegatingMethodAccessorImpl.invoke(DelegatingMethodAccessorImpl.java:43)
at java.lang.reflect.Method.invoke(Method.java:498)
at org.springframework.cglib.core.ReflectUtils.defineClass(ReflectUtils.java:459)
at org.springframework.cglib.core.AbstractClassGenerator.generate(AbstractClassGenerator.java:336)
... 121 common frames omitted
Caused by: java.lang.IllegalAccessError: class com.alibaba.druid.spring.boot.autoconfigure.DruidDataSourceWrapper$$EnhancerBySpringCGLIB$$244f293f cannot access its superclass com.alibaba.druid.spring.boot.autoconfigure.DruidDataSourceWrapper
at java.lang.ClassLoader.defineClass1(Native Method)
at java.lang.ClassLoader.defineClass(ClassLoader.java:763)
... 126 common frames omitted


1个回答

Csdn user default icon
上传中...
上传图片
插入图片
抄袭、复制答案,以达到刷声望分或其他目的的行为,在CSDN问答是严格禁止的,一经发现立刻封号。是时候展现真正的技术了!
其他相关推荐
分布式tx-lcn5.0.2版本,测试遇到的问题
首先是debug 断点调试 5.0.2 tm和tc,tm正在创建事务组的时候,tc会进入到这个函数里面,并且会进入到 log.warn("Non lcn connection when clear transaction."); @Override public void clear(String groupId, int state, String unitId, String unitType) throws TransactionClearException { try { LcnConnectionProxy connectionProxy = globalContext.getLcnConnection(groupId); connectionProxy.notify(state); // todo notify exception } catch (TCGlobalContextException e) { log.warn("Non lcn connection when clear transaction."); } } 不知道这个过程是如何调用的,是否是超时。 tm里面可以设置dtxTime,tc不能设置?tc会读取tc的这个文件,但是这得修改tc的源码,然后打jar包修改。按着官网上说的,tm里面设置的时间会传到tc这边来,但是没看到。修改tm的配置文件并没有影响到tc。求解答。 public class TxClientConfig { public TxClientConfig() { this.dtxAspectOrder = 0; this.dtxTime = 30 * 1000; this.managerAddress = Collections.singletonList("127.0.0.1:8070"); } 。。。。。 }
lcn的Socket对外服务IP是内网ip,socket连接失败,怎么解决!!!!!
各位大神,大牛们,急求!!!!!!!!!! lcn的Socket对外服务IP是内网ip,socket连接失败,怎么解决!!!!!
caffe生成解决方案时出错
编译环境:win10 vs2017 15.5.6 boost_1_70_0 主要报错: Unknown compiler version - please run the configure tests and report the results 再次点生成解决方案时的主要报错: for each 语句不能在“std::array *”类型的变量上操作 ; “std::array”: 模板 参数太少 ; 无法打开文件“libboost_date_time-vc140-mt-gd-1_59.lib” 等等; 因为只能一条条复制,所以如有需要,可提供详细错误; 下面是重新生成解决方案的具体报错,有大佬来救救我吗,感激不尽!需要更详细信息可以直说。 报错:1>------ 已启动全部重新生成: 项目: libcaffe, 配置: Debug x64 ------ 1>ProtoCompile.cmd : Create proto temp directory "C:\Users\Kay Chow\Documents\caffe-master\windows\..\src\caffe\proto\temp" 1>ProtoCompile.cmd : Generating "C:\Users\Kay Chow\Documents\caffe-master\windows\..\src\caffe\proto\temp\caffe.pb.h" and "C:\Users\Kay Chow\Documents\caffe-master\windows\..\src\caffe\proto\temp\caffe.pb.cc" 1>ProtoCompile.cmd : Create proto include directory 1>子目录或文件 C:\Users\Kay Chow\Documents\caffe-master\windows\..\include\caffe\proto 已经存在。 1>ProtoCompile.cmd : Compare newly compiled caffe.pb.h with existing one 1>blob.cpp 1>common.cpp 1>data_reader.cpp 1>data_transformer.cpp 1>internal_thread.cpp 1>layer.cpp 1>absval_layer.cpp 1>accuracy_layer.cpp 1>Unknown compiler version - please run the configure tests and report the results 1>Unknown compiler version - please run the configure tests and report the results 1>Unknown compiler version - please run the configure tests and report the results 1>Unknown compiler version - please run the configure tests and report the results 1>Unknown compiler version - please run the configure tests and report the results 1>Unknown compiler version - please run the configure tests and report the results 1>Unknown compiler version - please run the configure tests and report the results 1>Unknown compiler version - please run the configure tests and report the results 1>argmax_layer.cpp 1>base_conv_layer.cpp 1>base_data_layer.cpp 1>Unknown compiler version - please run the configure tests and report the results 1>Unknown compiler version - please run the configure tests and report the results 1>Unknown compiler version - please run the configure tests and report the results 1>batch_norm_layer.cpp 1>Unknown compiler version - please run the configure tests and report the results 1>batch_reindex_layer.cpp 1>bias_layer.cpp 1>Unknown compiler version - please run the configure tests and report the results 1>Unknown compiler version - please run the configure tests and report the results 1>bnll_layer.cpp 1>box_annotator_ohem_layer.cpp 1>Unknown compiler version - please run the configure tests and report the results 1>concat_layer.cpp 1>contrastive_loss_layer.cpp 1>Unknown compiler version - please run the configure tests and report the results 1>Unknown compiler version - please run the configure tests and report the results 1>Unknown compiler version - please run the configure tests and report the results 1>conv_layer.cpp 1>Unknown compiler version - please run the configure tests and report the results 1>crop_layer.cpp 1>cudnn_conv_layer.cpp 1>cudnn_lcn_layer.cpp 1>cudnn_lrn_layer.cpp 1>cudnn_pooling_layer.cpp 1>Unknown compiler version - please run the configure tests and report the results 1>cudnn_relu_layer.cpp 1>cudnn_sigmoid_layer.cpp 1>cudnn_softmax_layer.cpp 1>cudnn_tanh_layer.cpp 1>data_layer.cpp 1>deconv_layer.cpp 1>dropout_layer.cpp 1>dummy_data_layer.cpp 1>eltwise_layer.cpp 1>elu_layer.cpp 1>Unknown compiler version - please run the configure tests and report the results 1>Unknown compiler version - please run the configure tests and report the results 1>Unknown compiler version - please run the configure tests and report the results 1>Unknown compiler version - please run the configure tests and report the results 1>Unknown compiler version - please run the configure tests and report the results 1>Unknown compiler version - please run the configure tests and report the results 1>embed_layer.cpp 1>Unknown compiler version - please run the configure tests and report the results 1>euclidean_loss_layer.cpp 1>Unknown compiler version - please run the configure tests and report the results 1>exp_layer.cpp 1>filter_layer.cpp 1>flatten_layer.cpp 1>hdf5_data_layer.cpp 1>Unknown compiler version - please run the configure tests and report the results 1>Unknown compiler version - please run the configure tests and report the results 1>hdf5_output_layer.cpp 1>Unknown compiler version - please run the configure tests and report the results 1>Unknown compiler version - please run the configure tests and report the results 1>Unknown compiler version - please run the configure tests and report the results 1>hinge_loss_layer.cpp 1>Unknown compiler version - please run the configure tests and report the results 1>im2col_layer.cpp 1>image_data_layer.cpp 1>infogain_loss_layer.cpp 1>inner_product_layer.cpp 1>Unknown compiler version - please run the configure tests and report the results 1>input_layer.cpp 1>Unknown compiler version - please run the configure tests and report the results 1>log_layer.cpp 1>loss_layer.cpp 1>Unknown compiler version - please run the configure tests and report the results 1>Unknown compiler version - please run the configure tests and report the results 1>Unknown compiler version - please run the configure tests and report the results 1>Unknown compiler version - please run the configure tests and report the results 1>Unknown compiler version - please run the configure tests and report the results 1>lrn_layer.cpp 1>Unknown compiler version - please run the configure tests and report the results 1>memory_data_layer.cpp 1>multinomial_logistic_loss_layer.cpp 1>mvn_layer.cpp 1>neuron_layer.cpp 1>Unknown compiler version - please run the configure tests and report the results 1>parameter_layer.cpp 1>Unknown compiler version - please run the configure tests and report the results 1>Unknown compiler version - please run the configure tests and report the results 1>pooling_layer.cpp 1>Unknown compiler version - please run the configure tests and report the results 1>Unknown compiler version - please run the configure tests and report the results 1>Unknown compiler version - please run the configure tests and report the results 1>power_layer.cpp 1>Unknown compiler version - please run the configure tests and report the results 1>prelu_layer.cpp 1>psroi_pooling_layer.cpp 1>reduction_layer.cpp 1>relu_layer.cpp 1>reshape_layer.cpp 1>scale_layer.cpp 1>sigmoid_cross_entropy_loss_layer.cpp 1>Unknown compiler version - please run the configure tests and report the results 1>Unknown compiler version - please run the configure tests and report the results 1>Unknown compiler version - please run the configure tests and report the results 1>Unknown compiler version - please run the configure tests and report the results 1>Unknown compiler version - please run the configure tests and report the results 1>Unknown compiler version - please run the configure tests and report the results 1>Unknown compiler version - please run the configure tests and report the results 1>sigmoid_layer.cpp 1>Unknown compiler version - please run the configure tests and report the results 1>silence_layer.cpp 1>slice_layer.cpp 1>smooth_l1_loss_layer.cpp 1>smooth_L1_loss_ohem_layer.cpp 1>Unknown compiler version - please run the configure tests and report the results 1>softmax_layer.cpp 1>Unknown compiler version - please run the configure tests and report the results 1>Unknown compiler version - please run the configure tests and report the results 1>softmax_loss_layer.cpp 1>Unknown compiler version - please run the configure tests and report the results 1>softmax_loss_ohem_layer.cpp 1>Unknown compiler version - please run the configure tests and report the results 1>split_layer.cpp 1>Unknown compiler version - please run the configure tests and report the results 1>Unknown compiler version - please run the configure tests and report the results 1>Unknown compiler version - please run the configure tests and report the results 1>spp_layer.cpp 1>tanh_layer.cpp 1>threshold_layer.cpp 1>tile_layer.cpp 1>window_data_layer.cpp 1>Unknown compiler version - please run the configure tests and report the results 1>Unknown compiler version - please run the configure tests and report the results 1>Unknown compiler version - please run the configure tests and report the results 1>Unknown compiler version - please run the configure tests and report the results 1>layer_factory.cpp 1>net.cpp 1>parallel.cpp 1>Unknown compiler version - please run the configure tests and report the results 1>Unknown compiler version - please run the configure tests and report the results 1>Unknown compiler version - please run the configure tests and report the results 1>Unknown compiler version - please run the configure tests and report the results 1>caffe.pb.cc 1>solver.cpp 1>adadelta_solver.cpp 1>adagrad_solver.cpp 1>Unknown compiler version - please run the configure tests and report the results 1>Unknown compiler version - please run the configure tests and report the results 1>Unknown compiler version - please run the configure tests and report the results 1>adam_solver.cpp 1>Unknown compiler version - please run the configure tests and report the results 1>nesterov_solver.cpp 1>Unknown compiler version - please run the configure tests and report the results 1>rmsprop_solver.cpp 1>sgd_solver.cpp 1>syncedmem.cpp 1>Unknown compiler version - please run the configure tests and report the results 1>Unknown compiler version - please run the configure tests and report the results 1>benchmark.cpp 1>Unknown compiler version - please run the configure tests and report the results 1>Unknown compiler version - please run the configure tests and report the results 1>blocking_queue.cpp 1>Unknown compiler version - please run the configure tests and report the results 1>cudnn.cpp 1>db.cpp 1>db_leveldb.cpp 1>Unknown compiler version - please run the configure tests and report the results 1>db_lmdb.cpp 1>Unknown compiler version - please run the configure tests and report the results 1>Unknown compiler version - please run the configure tests and report the results 1>hdf5.cpp 1>Unknown compiler version - please run the configure tests and report the results 1>im2col.cpp 1>insert_splits.cpp 1>io.cpp 1>Unknown compiler version - please run the configure tests and report the results 1>math_functions.cpp 1>signal_handler.cpp 1>Unknown compiler version - please run the configure tests and report the results 1>Unknown compiler version - please run the configure tests and report the results 1>Unknown compiler version - please run the configure tests and report the results 1>upgrade_proto.cpp 1>Unknown compiler version - please run the configure tests and report the results 1>Unknown compiler version - please run the configure tests and report the results 1>libcaffe.vcxproj -> C:\Users\Kay Chow\Documents\caffe-master\windows\..\Build\x64\Debug\libcaffe.lib 1>BinplaceCudaDependencies : CPU only build, don't copy cuda dependencies. 2>------ 已启动全部重新生成: 项目: caffe, 配置: Debug x64 ------ 3>------ 已启动全部重新生成: 项目: caffe.managed, 配置: Debug x64 ------ 4>------ 已启动全部重新生成: 项目: convert_cifar_data, 配置: Debug x64 ------ 5>------ 已启动全部重新生成: 项目: classification, 配置: Debug x64 ------ 6>------ 已启动全部重新生成: 项目: convert_mnist_data, 配置: Debug x64 ------ 7>------ 已启动全部重新生成: 项目: convert_mnist_siamese_data, 配置: Debug x64 ------ 8>------ 已启动全部重新生成: 项目: upgrade_net_proto_binary, 配置: Debug x64 ------ 9>------ 已启动全部重新生成: 项目: upgrade_net_proto_text, 配置: Debug x64 ------ 2>caffe.cpp 9>upgrade_net_proto_text.cpp 2>Unknown compiler version - please run the configure tests and report the results 4>convert_cifar_data.cpp 3>Stdafx.cpp 9>Unknown compiler version - please run the configure tests and report the results 5>classification.cpp 6>convert_mnist_data.cpp 7>convert_mnist_siamese_data.cpp 4>Unknown compiler version - please run the configure tests and report the results 5>Unknown compiler version - please run the configure tests and report the results 8>upgrade_net_proto_binary.cpp 6>Unknown compiler version - please run the configure tests and report the results 8>Unknown compiler version - please run the configure tests and report the results 7>Unknown compiler version - please run the configure tests and report the results 3>AssemblyInfo.cpp 3>caffelib.cpp 3>caffelib.cpp(61): error C2976: “std::array”: 模板 参数太少 3>D:\VS2017\VC\Tools\MSVC\14.12.25827\include\utility(474): note: 参见“std::array”的声明 3>caffelib.cpp(62): error C3699: “^”: 不能在类型“std::array”上使用此间接寻址 3>caffelib.cpp(62): note: 编译器将“^”替换为“*”以继续进行分析 3>caffelib.cpp(68): error C2976: “std::array”: 模板 参数太少 3>D:\VS2017\VC\Tools\MSVC\14.12.25827\include\utility(474): note: 参见“std::array”的声明 3>caffelib.cpp(68): error C3699: “^”: 不能在类型“std::array”上使用此间接寻址 3>caffelib.cpp(68): note: 编译器将“^”替换为“*”以继续进行分析 3>caffelib.cpp(69): error C3699: “^”: 不能在类型“std::array”上使用此间接寻址 3>caffelib.cpp(69): note: 编译器将“^”替换为“*”以继续进行分析 3>caffelib.cpp(127): error C2976: “std::array”: 模板 参数太少 3>D:\VS2017\VC\Tools\MSVC\14.12.25827\include\utility(474): note: 参见“std::array”的声明 3>caffelib.cpp(128): error C3699: “^”: 不能在类型“std::array”上使用此间接寻址 3>caffelib.cpp(128): note: 编译器将“^”替换为“*”以继续进行分析 3>caffelib.cpp(136): error C2976: “std::array”: 模板 参数太少 3>D:\VS2017\VC\Tools\MSVC\14.12.25827\include\utility(474): note: 参见“std::array”的声明 3>caffelib.cpp(136): error C3699: “^”: 不能在类型“std::array”上使用此间接寻址 3>caffelib.cpp(136): note: 编译器将“^”替换为“*”以继续进行分析 3>caffelib.cpp(137): error C3699: “^”: 不能在类型“std::array”上使用此间接寻址 3>caffelib.cpp(137): note: 编译器将“^”替换为“*”以继续进行分析 3>caffelib.cpp(64): error C2976: “std::array”: 模板 参数太少 3>D:\VS2017\VC\Tools\MSVC\14.12.25827\include\utility(474): note: 参见“std::array”的声明 3>caffelib.cpp(64): error C2027: 使用了未定义类型“std::array” 3>D:\VS2017\VC\Tools\MSVC\14.12.25827\include\utility(474): note: 参见“std::array”的声明 3>caffelib.cpp(64): error C3536: “outputs”: 初始化之前无法使用 3>caffelib.cpp(64): error C2109: 下标要求数组或指针类型 3>caffelib.cpp(65): error C2440: “return”: 无法从“int”转换为“std::array *” 3>caffelib.cpp(65): note: 从整型转换为指针类型要求 reinterpret_cast、C 样式转换或函数样式转换 3>caffelib.cpp(71): error C3285: for each 语句不能在“std::array *”类型的变量上操作 3>caffelib.cpp(72): error C2065: “name”: 未声明的标识符 3>caffelib.cpp(74): error C2976: “std::array”: 模板 参数太少 3>D:\VS2017\VC\Tools\MSVC\14.12.25827\include\utility(474): note: 参见“std::array”的声明 3>caffelib.cpp(74): error C3699: “^”: 不能在类型“std::array”上使用此间接寻址 3>caffelib.cpp(74): note: 编译器将“^”替换为“*”以继续进行分析 3>caffelib.cpp(74): error C2027: 使用了未定义类型“std::array” 3>D:\VS2017\VC\Tools\MSVC\14.12.25827\include\utility(474): note: 参见“std::array”的声明 3>caffelib.cpp(78): error C2976: “std::array”: 模板 参数太少 3>D:\VS2017\VC\Tools\MSVC\14.12.25827\include\utility(474): note: 参见“std::array”的声明 3>caffelib.cpp(78): error C2027: 使用了未定义类型“std::array” 3>D:\VS2017\VC\Tools\MSVC\14.12.25827\include\utility(474): note: 参见“std::array”的声明 3>caffelib.cpp(78): error C3536: “values”: 初始化之前无法使用 3>caffelib.cpp(78): error C2109: 下标要求数组或指针类型 3>caffelib.cpp(79): error C3536: “outputs”: 初始化之前无法使用 3>caffelib.cpp(79): error C2109: 下标要求数组或指针类型 3>caffelib.cpp(81): error C2440: “return”: 无法从“int”转换为“std::array *” 3>caffelib.cpp(81): note: 从整型转换为指针类型要求 reinterpret_cast、C 样式转换或函数样式转换 3>caffelib.cpp(132): error C2976: “std::array”: 模板 参数太少 3>D:\VS2017\VC\Tools\MSVC\14.12.25827\include\utility(474): note: 参见“std::array”的声明 3>caffelib.cpp(132): error C2027: 使用了未定义类型“std::array” 3>D:\VS2017\VC\Tools\MSVC\14.12.25827\include\utility(474): note: 参见“std::array”的声明 3>caffelib.cpp(132): error C3536: “outputs”: 初始化之前无法使用 3>caffelib.cpp(132): error C2109: 下标要求数组或指针类型 3>caffelib.cpp(133): error C2440: “return”: 无法从“int”转换为“std::array *” 3>caffelib.cpp(133): note: 从整型转换为指针类型要求 reinterpret_cast、C 样式转换或函数样式转换 3>caffelib.cpp(141): error C3285: for each 语句不能在“std::array *”类型的变量上操作 3>caffelib.cpp(142): error C2065: “name”: 未声明的标识符 3>caffelib.cpp(144): error C2976: “std::array”: 模板 参数太少 3>D:\VS2017\VC\Tools\MSVC\14.12.25827\include\utility(474): note: 参见“std::array”的声明 3>caffelib.cpp(144): error C3699: “^”: 不能在类型“std::array”上使用此间接寻址 3>caffelib.cpp(144): note: 编译器将“^”替换为“*”以继续进行分析 3>caffelib.cpp(144): error C2027: 使用了未定义类型“std::array” 3>D:\VS2017\VC\Tools\MSVC\14.12.25827\include\utility(474): note: 参见“std::array”的声明 3>caffelib.cpp(148): error C2976: “std::array”: 模板 参数太少 3>D:\VS2017\VC\Tools\MSVC\14.12.25827\include\utility(474): note: 参见“std::array”的声明 3>caffelib.cpp(148): error C2027: 使用了未定义类型“std::array” 3>D:\VS2017\VC\Tools\MSVC\14.12.25827\include\utility(474): note: 参见“std::array”的声明 3>caffelib.cpp(148): error C3536: “values”: 初始化之前无法使用 3>caffelib.cpp(148): error C2109: 下标要求数组或指针类型 3>caffelib.cpp(149): error C3536: “outputs”: 初始化之前无法使用 3>caffelib.cpp(149): error C2109: 下标要求数组或指针类型 3>caffelib.cpp(151): error C2440: “return”: 无法从“int”转换为“std::array *” 3>caffelib.cpp(151): note: 从整型转换为指针类型要求 reinterpret_cast、C 样式转换或函数样式转换 3>已完成生成项目“caffe.managed.vcxproj”的操作 - 失败。 4>LINK : fatal error LNK1104: 无法打开文件“libboost_thread-vc140-mt-gd-1_59.lib” 10>------ 已启动全部重新生成: 项目: upgrade_solver_proto_text, 配置: Debug x64 ------ 4>已完成生成项目“convert_cifar_data.vcxproj”的操作 - 失败。 6>LINK : fatal error LNK1104: 无法打开文件“libboost_thread-vc140-mt-gd-1_59.lib” 6>已完成生成项目“convert_mnist_data.vcxproj”的操作 - 失败。 10>upgrade_solver_proto_text.cpp 7>LINK : fatal error LNK1104: 无法打开文件“libboost_thread-vc140-mt-gd-1_59.lib” 7>已完成生成项目“convert_mnist_siamese_data.vcxproj”的操作 - 失败。 10>Unknown compiler version - please run the configure tests and report the results 9>LINK : fatal error LNK1104: 无法打开文件“libboost_date_time-vc140-mt-gd-1_59.lib” 9>已完成生成项目“upgrade_net_proto_text.vcxproj”的操作 - 失败。 8>LINK : fatal error LNK1104: 无法打开文件“libboost_date_time-vc140-mt-gd-1_59.lib” 8>已完成生成项目“upgrade_net_proto_binary.vcxproj”的操作 - 失败。 5>LINK : fatal error LNK1104: 无法打开文件“libboost_date_time-vc140-mt-gd-1_59.lib” 5>已完成生成项目“classification.vcxproj”的操作 - 失败。 2>LINK : fatal error LNK1104: 无法打开文件“libboost_date_time-vc140-mt-gd-1_59.lib” 2>已完成生成项目“caffe.vcxproj”的操作 - 失败。 11>------ 已启动全部重新生成: 项目: compute_image_mean, 配置: Debug x64 ------ 12>------ 已启动全部重新生成: 项目: convert_imageset, 配置: Debug x64 ------ 13>------ 已启动全部重新生成: 项目: extract_features, 配置: Debug x64 ------ 14>------ 已启动全部重新生成: 项目: test_all, 配置: Debug x64 ------ 15>------ 已启动全部重新生成: 项目: pycaffe, 配置: Debug x64 ------ 16>------ 已启动全部重新生成: 项目: matcaffe, 配置: Debug x64 ------ 15>Skipping project pycaffe, Python support is not enabled in CommonSettings.props. 16>Skipping project matcaffe, Matlab support is not enabled in CommonSettings.props. 12>convert_imageset.cpp 11>compute_image_mean.cpp 13>extract_features.cpp 14>test_accuracy_layer.cpp 14>test_argmax_layer.cpp 14>test_batch_norm_layer.cpp 14>test_batch_reindex_layer.cpp 14>test_benchmark.cpp 14>test_bias_layer.cpp 14>test_blob.cpp 14>test_caffe_main.cpp 14>Unknown compiler version - please run the configure tests and report the results 13>Unknown compiler version - please run the configure tests and report the results 12>Unknown compiler version - please run the configure tests and report the results 11>Unknown compiler version - please run the configure tests and report the results 14>Unknown compiler version - please run the configure tests and report the results 10>LINK : fatal error LNK1104: 无法打开文件“libboost_date_time-vc140-mt-gd-1_59.lib” 10>已完成生成项目“upgrade_solver_proto_text.vcxproj”的操作 - 失败。 14>Unknown compiler version - please run the configure tests and report the results 14>Unknown compiler version - please run the configure tests and report the results 14>Unknown compiler version - please run the configure tests and report the results 14>Unknown compiler version - please run the configure tests and report the results 14>Unknown compiler version - please run the configure tests and report the results 14>Unknown compiler version - please run the configure tests and report the results 11>LINK : fatal error LNK1104: 无法打开文件“libboost_filesystem-vc140-mt-gd-1_59.lib” 11>已完成生成项目“compute_image_mean.vcxproj”的操作 - 失败。 12>LINK : fatal error LNK1104: 无法打开文件“libboost_filesystem-vc140-mt-gd-1_59.lib” 12>已完成生成项目“convert_imageset.vcxproj”的操作 - 失败。 13>LINK : fatal error LNK1104: 无法打开文件“libboost_filesystem-vc140-mt-gd-1_59.lib” 13>已完成生成项目“extract_features.vcxproj”的操作 - 失败。 14>test_common.cpp 14>test_concat_layer.cpp 14>test_contrastive_loss_layer.cpp 14>test_convolution_layer.cpp 14>test_crop_layer.cpp 14>test_data_layer.cpp 14>Unknown compiler version - please run the configure tests and report the results 14>Unknown compiler version - please run the configure tests and report the results 14>Unknown compiler version - please run the configure tests and report the results 14>Unknown compiler version - please run the configure tests and report the results 14>Unknown compiler version - please run the configure tests and report the results 14>Unknown compiler version - please run the configure tests and report the results 14>test_data_transformer.cpp 14>Unknown compiler version - please run the configure tests and report the results 14>test_db.cpp 14>test_deconvolution_layer.cpp 14>Unknown compiler version - please run the configure tests and report the results 14>test_dummy_data_layer.cpp 14>test_eltwise_layer.cpp 14>Unknown compiler version - please run the configure tests and report the results 14>test_embed_layer.cpp 14>test_euclidean_loss_layer.cpp 14>test_filler.cpp 14>Unknown compiler version - please run the configure tests and report the results 14>Unknown compiler version - please run the configure tests and report the results 14>Unknown compiler version - please run the configure tests and report the results 14>Unknown compiler version - please run the configure tests and report the results 14>Unknown compiler version - please run the configure tests and report the results 14>test_filter_layer.cpp 14>Unknown compiler version - please run the configure tests and report the results 14>test_flatten_layer.cpp 14>test_gradient_based_solver.cpp 14>Unknown compiler version - please run the configure tests and report the results 14>test_hdf5data_layer.cpp 14>test_hdf5_output_layer.cpp 14>test_hinge_loss_layer.cpp 14>Unknown compiler version - please run the configure tests and report the results 14>test_im2col_layer.cpp 14>test_image_data_layer.cpp 14>Unknown compiler version - please run the configure tests and report the results 14>Unknown compiler version - please run the configure tests and report the results 14>Unknown compiler version - please run the configure tests and report the results 14>Unknown compiler version - please run the configure tests and report the results 14>Unknown compiler version - please run the configure tests and report the results 14>test_infogain_loss_layer.cpp 14>Unknown compiler version - please run the configure tests and report the results 14>test_inner_product_layer.cpp 14>Unknown compiler version - please run the configure tests and report the results 14>test_internal_thread.cpp 14>test_io.cpp 14>test_layer_factory.cpp 14>test_lrn_layer.cpp 14>Unknown compiler version - please run the configure tests and report the results 14>test_math_functions.cpp 14>Unknown compiler version - please run the configure tests and report the results 14>Unknown compiler version - please run the configure tests and report the results 14>Unknown compiler version - please run the configure tests and report the results 14>Unknown compiler version - please run the configure tests and report the results 14>test_maxpool_dropout_layers.cpp 14>Unknown compiler version - please run the configure tests and report the results 14>test_memory_data_layer.cpp 14>test_multinomial_logistic_loss_layer.cpp 14>test_mvn_layer.cpp 14>Unknown compiler version - please run the configure tests and report the results 14>Unknown compiler version - please run the configure tests and report the results 14>Unknown compiler version - please run the configure tests and report the results 14>test_net.cpp 14>test_neuron_layer.cpp 14>test_platform.cpp 14>test_pooling_layer.cpp 14>test_power_layer.cpp 14>Unknown compiler version - please run the configure tests and report the results 14>Unknown compiler version - please run the configure tests and report the results 14>Unknown compiler version - please run the configure tests and report the results 14>Unknown compiler version - please run the configure tests and report the results 14>test_protobuf.cpp 14>test_random_number_generator.cpp 14>Unknown compiler version - please run the configure tests and report the results 14>test_reduction_layer.cpp 14>c:\users\kay chow\documents\caffe-master\src\caffe\test\test_net.cpp(1010): error C2220: 警告被视为错误 - 没有生成“object”文件 14>c:\users\kay chow\documents\caffe-master\src\caffe\test\test_net.cpp(992): note: 编译 类 模板 成员函数 "void caffe::NetTest_TestLossWeightMidNet_Test<T>::TestBody(void)" 时 14> with 14> [ 14> T=Type 14> ] 14>c:\users\kay chow\documents\caffe-master\src\gtest\gtest.h(7341): note: 参见对正在编译的 类 模板 实例化 "caffe::NetTest_TestLossWeightMidNet_Test<T>" 的引用 14> with 14> [ 14> T=Type 14> ] (编译源文件 ..\..\src\caffe\test\test_net.cpp) 14>c:\users\kay chow\documents\caffe-master\src\gtest\gtest.h(7327): note: 编译 类 模板 成员函数 "bool testing::internal::TypeParameterizedTest<caffe::NetTest,testing::internal::TemplateSel<caffe::NetTest_TestLossWeightMidNet_Test>,caffe::gtest_type_params_NetTest_>::Register(const char *,const char *,const char *,int)" 时 (编译源文件 ..\..\src\caffe\test\test_net.cpp) 14>c:\users\kay chow\documents\caffe-master\src\caffe\test\test_net.cpp(992): note: 参见对正在编译的函数 模板 实例化“bool testing::internal::TypeParameterizedTest<caffe::NetTest,testing::internal::TemplateSel<caffe::NetTest_TestLossWeightMidNet_Test>,caffe::gtest_type_params_NetTest_>::Register(const char *,const char *,const char *,int)”的引用 14>c:\users\kay chow\documents\caffe-master\src\caffe\test\test_net.cpp(992): note: 参见对正在编译的 类 模板 实例化 "testing::internal::TypeParameterizedTest<caffe::NetTest,testing::internal::TemplateSel<caffe::NetTest_TestLossWeightMidNet_Test>,caffe::gtest_type_params_NetTest_>" 的引用 14>c:\users\kay chow\documents\caffe-master\src\caffe\test\test_net.cpp(1010): warning C4838: 从“double”转换到“Dtype”需要收缩转换 14>c:\users\kay chow\documents\caffe-master\src\caffe\test\test_net.cpp(961): warning C4838: 从“double”转换到“Dtype”需要收缩转换 14>c:\users\kay chow\documents\caffe-master\src\caffe\test\test_net.cpp(941): note: 编译 类 模板 成员函数 "void caffe::NetTest_TestLossWeight_Test<T>::TestBody(void)" 时 14> with 14> [ 14> T=Type 14> ] 14>c:\users\kay chow\documents\caffe-master\src\gtest\gtest.h(7341): note: 参见对正在编译的 类 模板 实例化 "caffe::NetTest_TestLossWeight_Test<T>" 的引用 14> with 14> [ 14> T=Type 14> ] (编译源文件 ..\..\src\caffe\test\test_net.cpp) 14>c:\users\kay chow\documents\caffe-master\src\gtest\gtest.h(7327): note: 编译 类 模板 成员函数 "bool testing::internal::TypeParameterizedTest<caffe::NetTest,testing::internal::TemplateSel<caffe::NetTest_TestLossWeight_Test>,caffe::gtest_type_params_NetTest_>::Register(const char *,const char *,const char *,int)" 时 (编译源文件 ..\..\src\caffe\test\test_net.cpp) 14>c:\users\kay chow\documents\caffe-master\src\caffe\test\test_net.cpp(941): note: 参见对正在编译的函数 模板 实例化“bool testing::internal::TypeParameterizedTest<caffe::NetTest,testing::internal::TemplateSel<caffe::NetTest_TestLossWeight_Test>,caffe::gtest_type_params_NetTest_>::Register(const char *,const char *,const char *,int)”的引用 14>c:\users\kay chow\documents\caffe-master\src\caffe\test\test_net.cpp(941): note: 参见对正在编译的 类 模板 实例化 "testing::internal::TypeParameterizedTest<caffe::NetTest,testing::internal::TemplateSel<caffe::NetTest_TestLossWeight_Test>,caffe::gtest_type_params_NetTest_>" 的引用 14>test_reshape_layer.cpp 14>Unknown compiler version - please run the configure tests and report the results 14>Unknown compiler version - please run the configure tests and report the results 14>Unknown compiler version - please run the configure tests and report the results 14>test_scale_layer.cpp 14>test_sigmoid_cross_entropy_loss_layer.cpp 14>test_slice_layer.cpp 14>test_softmax_layer.cpp 14>Unknown compiler version - please run the configure tests and report the results 14>Unknown compiler version - please run the configure tests and report the results 14>test_softmax_with_loss_layer.cpp 14>Unknown compiler version - please run the configure tests and report the results 14>Unknown compiler version - please run the configure tests and report the results 14>Unknown compiler version - please run the configure tests and report the results 14>test_solver.cpp 14>Unknown compiler version - please run the configure tests and report the results 14>test_solver_factory.cpp 14>test_split_layer.cpp 14>Unknown compiler version - please run the configure tests and report the results 14>test_spp_layer.cpp 14>Unknown compiler version - please run the configure tests and report the results 14>test_stochastic_pooling.cpp 14>test_syncedmem.cpp 14>test_tanh_layer.cpp 14>Unknown compiler version - please run the configure tests and report the results 14>test_threshold_layer.cpp 14>Unknown compiler version - please run the configure tests and report the results 14>Unknown compiler version - please run the configure tests and report the results 14>Unknown compiler version - please run the configure tests and report the results 14>Unknown compiler version - please run the configure tests and report the results 14>test_tile_layer.cpp 14>Unknown compiler version - please run the configure tests and report the results 14>test_upgrade_proto.cpp 14>test_util_blas.cpp 14>gtest-all.cpp 14>Unknown compiler version - please run the configure tests and report the results 14>已完成生成项目“test_all.vcxproj”的操作 - 失败。 ========== 全部重新生成: 成功 3 个,失败 13 个,跳过 0 个 ==========
求帮忙分析下Tomcat崩溃日志
``` # # There is insufficient memory for the Java Runtime Environment to continue. # Native memory allocation (malloc) failed to allocate 572522496 bytes for committing reserved memory. # Possible reasons: # The system is out of physical RAM or swap space # In 32 bit mode, the process size limit was hit # Possible solutions: # Reduce memory load on the system # Increase physical memory or swap space # Check if swap backing store is full # Use 64 bit Java on a 64 bit OS # Decrease Java heap size (-Xmx/-Xms) # Decrease number of Java threads # Decrease Java thread stack sizes (-Xss) # Set larger code cache with -XX:ReservedCodeCacheSize= # This output file may be truncated or incomplete. # # Out of Memory Error (os_linux.cpp:2756), pid=25208, tid=140304851973888 # # JRE version: Java(TM) SE Runtime Environment (7.0_80-b15) (build 1.7.0_80-b15) # Java VM: Java HotSpot(TM) 64-Bit Server VM (24.80-b11 mixed mode linux-amd64 compressed oops) # Failed to write core dump. Core dumps have been disabled. To enable core dumping, try "ulimit -c unlimited" before starting Java again # --------------- T H R E A D --------------- Current thread (0x00007f9b4c06a000): VMThread [stack: 0x00007f9b44ccb000,0x00007f9b44dcc000] [id=25214] Stack: [0x00007f9b44ccb000,0x00007f9b44dcc000], sp=0x00007f9b44dca1a0, free space=1020k Native frames: (J=compiled Java code, j=interpreted, Vv=VM code, C=native code) V [libjvm.so+0x9a320a] VMError::report_and_die()+0x2ea V [libjvm.so+0x498d3b] report_vm_out_of_memory(char const*, int, unsigned long, char const*)+0x9b V [libjvm.so+0x82191e] os::Linux::commit_memory_impl(char*, unsigned long, bool)+0xfe V [libjvm.so+0x821e69] os::pd_commit_memory(char*, unsigned long, unsigned long, bool)+0x29 V [libjvm.so+0x81bb6a] os::commit_memory(char*, unsigned long, unsigned long, bool)+0x2a V [libjvm.so+0x88d623] PSVirtualSpace::expand_by(unsigned long)+0x53 V [libjvm.so+0x87ca80] PSOldGen::expand(unsigned long)+0x170 V [libjvm.so+0x87cc8b] PSOldGen::resize(unsigned long)+0x1cb V [libjvm.so+0x885951] PSParallelCompact::invoke_no_policy(bool)+0x9b1 V [libjvm.so+0x88b8cd] PSScavenge::invoke()+0x1ad V [libjvm.so+0x843f40] ParallelScavengeHeap::failed_mem_allocate(unsigned long)+0x70 V [libjvm.so+0x9a4a97] VM_ParallelGCFailedAllocation::doit()+0x97 V [libjvm.so+0x9abf35] VM_Operation::evaluate()+0x55 V [libjvm.so+0x9aa2fa] VMThread::evaluate_operation(VM_Operation*)+0xba V [libjvm.so+0x9aa67e] VMThread::loop()+0x1ce V [libjvm.so+0x9aaaf0] VMThread::run()+0x70 V [libjvm.so+0x8238c8] java_start(Thread*)+0x108 VM_Operation (0x00007f9b360f5340): ParallelGCFailedAllocation, mode: safepoint, requested by thread 0x00007f9af2e2b800 --------------- P R O C E S S --------------- Java Threads: ( => current thread ) 0x00007f9ab8053800 JavaThread "pool-2-thread-10937" [_thread_blocked, id=20834, stack(0x00007f9aa5b9c000,0x00007f9aa5c9d000)] 0x00007f9ab809d000 JavaThread "pool-2-thread-10936" [_thread_blocked, id=20833, stack(0x00007f9aa6bac000,0x00007f9aa6cad000)] 0x00007f9b4c7c4800 JavaThread "pool-8-thread-5804" [_thread_blocked, id=19335, stack(0x00007f9aa81ee000,0x00007f9aa82ef000)] 0x00007f9b4c3e0000 JavaThread "pool-8-thread-5803" [_thread_blocked, id=18507, stack(0x00007f9b342a0000,0x00007f9b343a1000)] 0x00007f9b4c2c4000 JavaThread "MQTT Ping: GID_EDO_NOTICE@@@admin" [_thread_blocked, id=28435, stack(0x00007f9aa9a06000,0x00007f9aa9b07000)] 0x00007f9b4c485800 JavaThread "MQTT Call: GID_EDO_NOTICE@@@admin" [_thread_blocked, id=28434, stack(0x00007f9b081c0000,0x00007f9b082c1000)] 0x00007f9b4c428800 JavaThread "MQTT Snd: GID_EDO_NOTICE@@@admin" [_thread_blocked, id=28433, stack(0x00007f9aaa915000,0x00007f9aaaa16000)] 0x00007f9b4c81f800 JavaThread "MQTT Rec: GID_EDO_NOTICE@@@admin" [_thread_in_native, id=28432, stack(0x00007f9aa5798000,0x00007f9aa5899000)] 0x00007f9ad0101000 JavaThread "http-bio-8080-exec-34" daemon [_thread_blocked, id=20845, stack(0x00007f9aa72b3000,0x00007f9aa73b4000)] 0x00007f9ad00ff800 JavaThread "http-bio-8080-exec-33" daemon [_thread_blocked, id=20844, stack(0x00007f9aab01c000,0x00007f9aab11d000)] 0x00007f9ad00fc000 JavaThread "http-bio-8080-exec-30" daemon [_thread_blocked, id=20838, stack(0x00007f9aa9703000,0x00007f9aa9804000)] 0x00007f9ad00fb000 JavaThread "http-bio-8080-exec-29" daemon [_thread_blocked, id=20837, stack(0x00007f9aa92ff000,0x00007f9aa9400000)] 0x00007f9ad0110800 JavaThread "http-bio-8080-exec-28" daemon [_thread_blocked, id=20836, stack(0x00007f9aa8cf9000,0x00007f9aa8dfa000)] 0x00007f9ad010f800 JavaThread "http-bio-8080-exec-27" daemon [_thread_blocked, id=20832, stack(0x00007f9aaa814000,0x00007f9aaa915000)] 0x00007f9ad010e000 JavaThread "http-bio-8080-exec-26" daemon [_thread_blocked, id=20826, stack(0x00007f9aa87f4000,0x00007f9aa88f5000)] 0x00007f9ad010d800 JavaThread "http-bio-8080-exec-25" daemon [_thread_blocked, id=20825, stack(0x00007f9aa85f2000,0x00007f9aa86f3000)] 0x00007f9ad0077800 JavaThread "http-bio-8080-exec-24" daemon [_thread_blocked, id=20822, stack(0x00007f9aaa00c000,0x00007f9aaa10d000)] 0x00007f9ad00f0000 JavaThread "http-bio-8080-exec-23" daemon [_thread_blocked, id=20821, stack(0x00007f9aa8ffc000,0x00007f9aa90fd000)] 0x00007f9ad0075800 JavaThread "http-bio-8080-exec-22" daemon [_thread_blocked, id=20820, stack(0x00007f9aaa10d000,0x00007f9aaa20e000)] 0x00007f9af423f800 JavaThread "Java2D Disposer" daemon [_thread_blocked, id=28691, stack(0x00007f9aab7f8000,0x00007f9aab8f9000)] 0x00007f9af1c93800 JavaThread "taskExecutor-5" [_thread_blocked, id=28196, stack(0x00007f9aa9d09000,0x00007f9aa9e0a000)] 0x00007f9af2cef000 JavaThread "taskExecutor-4" [_thread_blocked, id=28195, stack(0x00007f9aa89f6000,0x00007f9aa8af7000)] 0x00007f9af2cee800 JavaThread "taskExecutor-3" [_thread_blocked, id=28194, stack(0x00007f9aaac18000,0x00007f9aaad19000)] 0x00007f9af3870000 JavaThread "taskExecutor-2" [_thread_blocked, id=26218, stack(0x00007f9aa9501000,0x00007f9aa9602000)] 0x00007f9af10db000 JavaThread "taskExecutor-1" [_thread_blocked, id=26216, stack(0x00007f9aaaf1b000,0x00007f9aab01c000)] 0x00007f9b4c4b1000 JavaThread "idle_connection_reaper" daemon [_thread_blocked, id=25553, stack(0x00007f9b3759a000,0x00007f9b3769b000)] 0x00007f9af40df800 JavaThread "HSF-AddressProfiler" daemon [_thread_blocked, id=25354, stack(0x00007f9b37499000,0x00007f9b3759a000)] 0x00007f9ae82ff800 JavaThread "HSF-Worker-2-thread-8" daemon [_thread_blocked, id=25334, stack(0x00007f9aab8f9000,0x00007f9aab9fa000)] 0x00007f9ad80ab800 JavaThread "HSF-Worker-2-thread-7" daemon [_thread_blocked, id=25333, stack(0x00007f9aab9fa000,0x00007f9aabafb000)] 0x00007f9ac003b800 JavaThread "HSF-Worker-2-thread-6" daemon [_thread_blocked, id=25332, stack(0x00007f9aabafb000,0x00007f9aabbfc000)] 0x00007f9aec03c000 JavaThread "HSF-Worker-2-thread-1" daemon [_thread_blocked, id=25331, stack(0x00007f9aabbfc000,0x00007f9aabcfd000)] 0x00007f9ab4054800 JavaThread "HSF-Worker-2-thread-3" daemon [_thread_blocked, id=25330, stack(0x00007f9aabcfd000,0x00007f9aabdfe000)] 0x00007f9af8098800 JavaThread "HSF-Worker-2-thread-4" daemon [_thread_blocked, id=25329, stack(0x00007f9aabdfe000,0x00007f9aabeff000)] 0x00007f9ac00d9000 JavaThread "HSF-Worker-2-thread-5" daemon [_thread_blocked, id=25328, stack(0x00007f9aabeff000,0x00007f9aac000000)] 0x00007f9abc136800 JavaThread "HSF-Worker-2-thread-2" daemon [_thread_blocked, id=25327, stack(0x00007f9b08061000,0x00007f9b08162000)] 0x00007f9ad0073800 JavaThread "http-bio-8080-exec-21" daemon [_thread_blocked, id=25324, stack(0x00007f9b084c3000,0x00007f9b085c4000)] 0x00007f9ad0071000 JavaThread "http-bio-8080-exec-20" daemon [_thread_blocked, id=25323, stack(0x00007f9b085c4000,0x00007f9b086c5000)] 0x00007f9ad006f000 JavaThread "http-bio-8080-exec-19" daemon [_thread_blocked, id=25322, stack(0x00007f9b086c5000,0x00007f9b087c6000)] 0x00007f9ad006a800 JavaThread "http-bio-8080-exec-17" daemon [_thread_blocked, id=25320, stack(0x00007f9b088c7000,0x00007f9b089c8000)] 0x00007f9ad0068800 JavaThread "http-bio-8080-exec-16" daemon [_thread_blocked, id=25319, stack(0x00007f9b089c8000,0x00007f9b08ac9000)] 0x00007f9ad0066800 JavaThread "http-bio-8080-exec-15" daemon [_thread_blocked, id=25317, stack(0x00007f9b08ac9000,0x00007f9b08bca000)] 0x00007f9ad0064800 JavaThread "http-bio-8080-exec-14" daemon [_thread_blocked, id=25316, stack(0x00007f9b08bca000,0x00007f9b08ccb000)] 0x00007f9ad0062800 JavaThread "http-bio-8080-exec-13" daemon [_thread_blocked, id=25315, stack(0x00007f9b08ccb000,0x00007f9b08dcc000)] 0x00007f9ad000a800 JavaThread "http-bio-8080-exec-12" daemon [_thread_blocked, id=25314, stack(0x00007f9b08dcc000,0x00007f9b08ecd000)] 0x00007f9ad0008800 JavaThread "http-bio-8080-exec-11" daemon [_thread_blocked, id=25313, stack(0x00007f9b08ecd000,0x00007f9b08fce000)] 0x00007f9b4c0d9000 JavaThread "http-bio-8080-AsyncTimeout" daemon [_thread_blocked, id=25312, stack(0x00007f9b08fce000,0x00007f9b090cf000)] 0x00007f9b4c0d7800 JavaThread "http-bio-8080-Acceptor-0" daemon [_thread_blocked, id=25311, stack(0x00007f9b090cf000,0x00007f9b091d0000)] 0x00007f9b4c0d4800 JavaThread "http-bio-8080-exec-10" daemon [_thread_blocked, id=25310, stack(0x00007f9b091d0000,0x00007f9b092d1000)] 0x00007f9b4c43e800 JavaThread "http-bio-8080-exec-7" daemon [_thread_blocked, id=25307, stack(0x00007f9b094d3000,0x00007f9b095d4000)] 0x00007f9b4c43c800 JavaThread "http-bio-8080-exec-6" daemon [_thread_blocked, id=25306, stack(0x00007f9b095d4000,0x00007f9b096d5000)] 0x00007f9b4c43a800 JavaThread "http-bio-8080-exec-5" daemon [_thread_blocked, id=25305, stack(0x00007f9b096d5000,0x00007f9b097d6000)] 0x00007f9b4c168800 JavaThread "http-bio-8080-exec-4" daemon [_thread_blocked, id=25304, stack(0x00007f9b37095000,0x00007f9b37196000)] 0x00007f9b4c166800 JavaThread "http-bio-8080-exec-3" daemon [_thread_blocked, id=25303, stack(0x00007f9b37196000,0x00007f9b37297000)] 0x00007f9b4c165000 JavaThread "http-bio-8080-exec-2" daemon [_thread_blocked, id=25302, stack(0x00007f9b37297000,0x00007f9b37398000)] 0x00007f9b4c163000 JavaThread "http-bio-8080-exec-1" daemon [_thread_blocked, id=25301, stack(0x00007f9b37398000,0x00007f9b37499000)] 0x00007f9b4c162800 JavaThread "ContainerBackgroundProcessor[StandardEngine[Catalina]]" daemon [_thread_blocked, id=25300, stack(0x00007f9b097d6000,0x00007f9b098d7000)] 0x00007f9af1ae3000 JavaThread "pool-7-thread-1" [_thread_blocked, id=25298, stack(0x00007f9b098d7000,0x00007f9b099d8000)] 0x00007f9af1ae0000 JavaThread "redisMessageListenerContainer-1" [_thread_blocked, id=25297, stack(0x00007f9b354eb000,0x00007f9b355ec000)] 0x00007f9af1589800 JavaThread "commons-pool-EvictionTimer" daemon [_thread_blocked, id=25296, stack(0x00007f9b099d8000,0x00007f9b09ad9000)] 0x00007f9b006a9000 JavaThread "ConfigClientNotifier" daemon [_thread_blocked, id=25291, stack(0x00007f9b3409e000,0x00007f9b3419f000)] 0x00007f9b1c023800 JavaThread "SocketConnectorIoProcessor-0.0" daemon [_thread_blocked, id=25289, stack(0x00007f9b3419f000,0x00007f9b342a0000)] 0x00007f9b00221000 JavaThread "PooledByteBufferExpirer-0" daemon [_thread_blocked, id=25287, stack(0x00007f9b343a1000,0x00007f9b344a2000)] 0x00007f9b00180000 JavaThread "com.taobao.remoting.TimerThread" daemon [_thread_blocked, id=25286, stack(0x00007f9b344a2000,0x00007f9b345a3000)] 0x00007f9ae804c000 JavaThread "HSF-RuntimeInfo-Publisher-7-thread-1" daemon [_thread_blocked, id=25285, stack(0x00007f9b345a3000,0x00007f9b346a4000)] 0x00007f9af0676800 JavaThread "com.taobao.config.client.timer" daemon [_thread_blocked, id=25284, stack(0x00007f9b346a4000,0x00007f9b347a5000)] 0x00007f9af3291000 JavaThread "ConfigClientWorker-Thread" daemon [_thread_blocked, id=25283, stack(0x00007f9b347a5000,0x00007f9b348a6000)] 0x00007f9af3985800 JavaThread "pool-4-thread-1" [_thread_blocked, id=25282, stack(0x00007f9b348a6000,0x00007f9b349a7000)] 0x00007f9af3982800 JavaThread "com.taobao.config.client.timer" daemon [_thread_blocked, id=25281, stack(0x00007f9b349a7000,0x00007f9b34aa8000)] 0x00007f9ae81e1800 JavaThread "HSF-Remoting-Timer-3-thread-1" daemon [_thread_blocked, id=25280, stack(0x00007f9b34aa8000,0x00007f9b34ba9000)] 0x00007f9af0f67800 JavaThread "HSF-AddressPool-Default-1-thread-1" daemon [_thread_blocked, id=25277, stack(0x00007f9b34be2000,0x00007f9b34ce3000)] 0x00007f9ad0006000 JavaThread "NacosConfigListener-ThreadPool-4" daemon [_thread_blocked, id=25276, stack(0x00007f9b34ce3000,0x00007f9b34de4000)] 0x00007f9ad4001000 JavaThread "NacosConfigListener-ThreadPool-3" daemon [_thread_blocked, id=25275, stack(0x00007f9b34de4000,0x00007f9b34ee5000)] 0x00007f9ad0004800 JavaThread "com.alibaba.nacos.client.Worker.longPullingfixed-10.201.199.104:8848-product" daemon [_thread_in_native, id=25274, stack(0x00007f9b34ee5000,0x00007f9b34fe6000)] 0x00007f9ad0002800 JavaThread "NacosConfigListener-ThreadPool-2" daemon [_thread_blocked, id=25273, stack(0x00007f9b34fe6000,0x00007f9b350e7000)] 0x00007f9ad0001800 JavaThread "NacosConfigListener-ThreadPool-1" daemon [_thread_blocked, id=25272, stack(0x00007f9b350e7000,0x00007f9b351e8000)] 0x00007f9ac4001800 JavaThread "com.alibaba.nacos.client.Worker.longPullingfixed-10.201.199.104:8848-product" daemon [_thread_blocked, id=25271, stack(0x00007f9b351e8000,0x00007f9b352e9000)] 0x00007f9af38c4000 JavaThread "com.alibaba.nacos.client.Worker.fixed-10.201.199.104:8848-product" daemon [_thread_blocked, id=25270, stack(0x00007f9b352e9000,0x00007f9b353ea000)] 0x00007f9af2a5a800 JavaThread "Timer-1" daemon [_thread_blocked, id=25269, stack(0x00007f9b353ea000,0x00007f9b354eb000)] 0x00007f9acc00c800 JavaThread "EagleEye-StatLogController-writer-thread-1" daemon [_thread_blocked, id=25252, stack(0x00007f9b35af1000,0x00007f9b35bf2000)] 0x00000000044e4800 JavaThread "com.taobao.diamond.client.Worker.default" daemon [_thread_in_native, id=25251, stack(0x00007f9b355ec000,0x00007f9b356ed000)] 0x0000000003dfb000 JavaThread "com.taobao.diamond.client.Timer" daemon [_thread_blocked, id=25250, stack(0x00007f9b356ed000,0x00007f9b357ee000)] 0x0000000003c1f800 JavaThread "Thread-7" daemon [_thread_blocked, id=25249, stack(0x00007f9b357ee000,0x00007f9b358ef000)] 0x0000000003c1d800 JavaThread "server-timer1" daemon [_thread_blocked, id=25248, stack(0x00007f9b358ef000,0x00007f9b359f0000)] 0x0000000003bd3800 JavaThread "server-timer" daemon [_thread_blocked, id=25247, stack(0x00007f9b359f0000,0x00007f9b35af1000)] 0x00007f9af2d45000 JavaThread "Pandora pandora-qos-reporter Pool [Thread-1]" daemon [_thread_blocked, id=25245, stack(0x00007f9b35bf2000,0x00007f9b35cf3000)] 0x00007f9af2bc5000 JavaThread "qos-boss-1-1" daemon [_thread_blocked, id=25244, stack(0x00007f9b35cf3000,0x00007f9b35df4000)] 0x00007f9ad800d000 JavaThread "EagleEye-AsyncAppender-Thread-TraceLog-atp" daemon [_thread_blocked, id=25242, stack(0x00007f9b35df4000,0x00007f9b35ef5000)] 0x00007f9af2e2c000 JavaThread "metrics-LogDescriptionManager-thread-1" daemon [_thread_blocked, id=25241, stack(0x00007f9b35ef5000,0x00007f9b35ff6000)] 0x00007f9af2e2b800 JavaThread "metrics-bin-reporter-2-thread-1" daemon [_thread_blocked, id=25240, stack(0x00007f9b35ff6000,0x00007f9b360f7000)] 0x00007f9ae8a63800 JavaThread "metrics-BinAppender-thread-1" daemon [_thread_blocked, id=25239, stack(0x00007f9b360f7000,0x00007f9b361f8000)] 0x00007f9ae8554800 JavaThread "metrics-file-reporter-1-thread-1" daemon [_thread_blocked, id=25236, stack(0x00007f9b361f8000,0x00007f9b362f9000)] 0x00007f9ae84d8800 JavaThread "metrics-RollingFileAppender-thread-1" daemon [_thread_blocked, id=25235, stack(0x00007f9b362f9000,0x00007f9b363fa000)] 0x00007f9ae80ee800 JavaThread "EagleEye-ScheduleTaskController-worker-thread-1" daemon [_thread_blocked, id=25234, stack(0x00007f9b363fa000,0x00007f9b364fb000)] 0x00007f9ae80e1800 JavaThread "EagleEye-StatLogController-roller-thread-1" daemon [_thread_blocked, id=25233, stack(0x00007f9b364fb000,0x00007f9b365fc000)] 0x00007f9ae80a6800 JavaThread "EagleEye-LogDaemon-Thread" daemon [_thread_blocked, id=25232, stack(0x00007f9b365fc000,0x00007f9b366fd000)] 0x00007f9af3f8d800 JavaThread "EagleEye-AsyncAppender-Thread-BizLog" daemon [_thread_blocked, id=25231, stack(0x00007f9b366fd000,0x00007f9b367fe000)] 0x00007f9af3e1d800 JavaThread "EagleEye-AsyncAppender-Thread-RpcLog" daemon [_thread_blocked, id=25230, stack(0x00007f9b367fe000,0x00007f9b368ff000)] 0x00007f9af3cab800 JavaThread "EagleEye-AsyncAppender-Thread-SelfLog" daemon [_thread_blocked, id=25229, stack(0x00007f9b368ff000,0x00007f9b36a00000)] 0x00007f9af173f800 JavaThread "Timer-0" daemon [_thread_blocked, id=25228, stack(0x00007f9b36a00000,0x00007f9b36b01000)] 0x00007f9b4c556800 JavaThread "GC Daemon" daemon [_thread_blocked, id=25222, stack(0x00007f9b4403a000,0x00007f9b4413b000)] 0x00007f9b4c099800 JavaThread "Service Thread" daemon [_thread_blocked, id=25220, stack(0x00007f9b446c5000,0x00007f9b447c6000)] 0x00007f9b4c097000 JavaThread "C2 CompilerThread1" daemon [_thread_blocked, id=25219, stack(0x00007f9b447c6000,0x00007f9b448c7000)] 0x00007f9b4c094000 JavaThread "C2 CompilerThread0" daemon [_thread_blocked, id=25218, stack(0x00007f9b448c7000,0x00007f9b449c8000)] 0x00007f9b4c091800 JavaThread "Signal Dispatcher" daemon [_thread_blocked, id=25217, stack(0x00007f9b449c8000,0x00007f9b44ac9000)] 0x00007f9b4c070800 JavaThread "Finalizer" daemon [_thread_blocked, id=25216, stack(0x00007f9b44ac9000,0x00007f9b44bca000)] 0x00007f9b4c06e800 JavaThread "Reference Handler" daemon [_thread_blocked, id=25215, stack(0x00007f9b44bca000,0x00007f9b44ccb000)] 0x00007f9b4c00a000 JavaThread "main" [_thread_in_native, id=25209, stack(0x00007f9b5280b000,0x00007f9b5290c000)] Other Threads: =>0x00007f9b4c06a000 VMThread [stack: 0x00007f9b44ccb000,0x00007f9b44dcc000] [id=25214] 0x00007f9b4c0a4800 WatcherThread [stack: 0x00007f9b445c4000,0x00007f9b446c5000] [id=25221] VM state:at safepoint (normal execution) VM Mutex/Monitor currently owned by a thread: ([mutex/lock_event]) [0x00007f9b4c0073d0] ExpandHeap_lock - owner thread: 0x00007f9b4c06a000 [0x00007f9b4c007a50] Threads_lock - owner thread: 0x00007f9b4c06a000 [0x00007f9b4c007f50] Heap_lock - owner thread: 0x00007f9af2e2b800 Heap PSYoungGen total 1122816K, used 0K [0x0000000780000000, 0x00000007eef00000, 0x0000000800000000) eden space 423936K, 0% used [0x0000000780000000,0x0000000780000000,0x0000000799e00000) from space 698880K, 0% used [0x0000000799e00000,0x0000000799e00000,0x00000007c4880000) to space 690176K, 0% used [0x00000007c4d00000,0x00000007c4d00000,0x00000007eef00000) ParOldGen total 3225088K, used 3184634K [0x0000000680000000, 0x0000000744d80000, 0x0000000780000000) object space 3225088K, 98% used [0x0000000680000000,0x00000007425fea80,0x0000000744d80000) PSPermGen total 2097152K, used 111831K [0x0000000600000000, 0x0000000680000000, 0x0000000680000000) object space 2097152K, 5% used [0x0000000600000000,0x0000000606d35ff8,0x0000000680000000) Card table byte_map: [0x00007f9b47fff000,0x00007f9b49000000] byte_map_base: 0x00007f9b44fff000 Polling page: 0x00007f9b52917000 Code Cache [0x00007f9b49000000, 0x00007f9b4a2e0000, 0x00007f9b4c000000) total_blobs=5813 nmethods=5091 adapters=673 free_code_cache=30158Kb largest_free_block=30581696 Compilation events (10 events): Event: 1204524.007 Thread 0x00007f9b4c094000 6182 com.taobao.eagleeye.json.IdentityHashMap::get (52 bytes) Event: 1204524.007 Thread 0x00007f9b4c097000 6181 ! com.taobao.eagleeye.json.JSONSerializer::getObjectWriter (872 bytes) Event: 1204524.009 Thread 0x00007f9b4c094000 nmethod 6182 0x00007f9b49cc2750 code [0x00007f9b49cc28a0, 0x00007f9b49cc29e8] Event: 1204524.009 Thread 0x00007f9b4c094000 6183 com.taobao.eagleeye.json.SerializeWriter::writeFieldName (80 bytes) Event: 1204524.011 Thread 0x00007f9b4c094000 nmethod 6183 0x00007f9b4a280010 code [0x00007f9b4a280160, 0x00007f9b4a280288] Event: 1204524.040 Thread 0x00007f9b4c097000 nmethod 6181 0x00007f9b4a01e110 code [0x00007f9b4a01e600, 0x00007f9b4a0201d8] Event: 1204590.715 Thread 0x00007f9b4c094000 6184 java.util.TreeMap::rotateRight (96 bytes) Event: 1204590.715 Thread 0x00007f9b4c097000 6185 com.taobao.eagleeye.json.BigDecimalCodec::write (88 bytes) Event: 1204590.717 Thread 0x00007f9b4c094000 nmethod 6184 0x00007f9b49f7af90 code [0x00007f9b49f7b0e0, 0x00007f9b49f7b238] Event: 1204590.718 Thread 0x00007f9b4c097000 nmethod 6185 0x00007f9b4a05ddd0 code [0x00007f9b4a05df40, 0x00007f9b4a05e138] GC Heap History (10 events): Event: 1204590.670 GC heap after Heap after GC invocations=36180 (full 121): PSYoungGen total 1093632K, used 0K [0x0000000780000000, 0x00000007ef400000, 0x0000000800000000) eden space 394752K, 0% used [0x0000000780000000,0x0000000780000000,0x0000000798180000) from space 698880K, 0% used [0x0000000798180000,0x0000000798180000,0x00000007c2c00000) to space 698880K, 0% used [0x00000007c4980000,0x00000007c4980000,0x00000007ef400000) ParOldGen total 3225088K, used 2652104K [0x0000000680000000, 0x0000000744d80000, 0x0000000780000000) object space 3225088K, 82% used [0x0000000680000000,0x0000000721df21d8,0x0000000744d80000) PSPermGen total 2097152K, used 111831K [0x0000000600000000, 0x0000000680000000, 0x0000000680000000) object space 2097152K, 5% used [0x0000000600000000,0x0000000606d35e60,0x0000000680000000) } Event: 1204596.643 GC heap before {Heap before GC invocations=36181 (full 121): PSYoungGen total 1093632K, used 394752K [0x0000000780000000, 0x00000007ef400000, 0x0000000800000000) eden space 394752K, 100% used [0x0000000780000000,0x0000000798180000,0x0000000798180000) from space 698880K, 0% used [0x0000000798180000,0x0000000798180000,0x00000007c2c00000) to space 698880K, 0% used [0x00000007c4980000,0x00000007c4980000,0x00000007ef400000) ParOldGen total 3225088K, used 2652104K [0x0000000680000000, 0x0000000744d80000, 0x0000000780000000) object space 3225088K, 82% used [0x0000000680000000,0x0000000721df21d8,0x0000000744d80000) PSPermGen total 2097152K, used 111831K [0x0000000600000000, 0x0000000680000000, 0x0000000680000000) object space 2097152K, 5% used [0x0000000600000000,0x0000000606d35f38,0x0000000680000000) Event: 1204596.732 GC heap after Heap after GC invocations=36181 (full 121): PSYoungGen total 1095168K, used 123671K [0x0000000780000000, 0x00000007ee600000, 0x0000000800000000) eden space 410624K, 0% used [0x0000000780000000,0x0000000780000000,0x0000000799100000) from space 684544K, 18% used [0x00000007c4980000,0x00000007cc245f30,0x00000007ee600000) to space 698880K, 0% used [0x0000000799100000,0x0000000799100000,0x00000007c3b80000) ParOldGen total 3225088K, used 2652104K [0x0000000680000000, 0x0000000744d80000, 0x0000000780000000) object space 3225088K, 82% used [0x0000000680000000,0x0000000721df21d8,0x0000000744d80000) PSPermGen total 2097152K, used 111831K [0x0000000600000000, 0x0000000680000000, 0x0000000680000000) object space 2097152K, 5% used [0x0000000600000000,0x0000000606d35f38,0x0000000680000000) } Event: 1204602.842 GC heap before {Heap before GC invocations=36182 (full 121): PSYoungGen total 1095168K, used 534295K [0x0000000780000000, 0x00000007ee600000, 0x0000000800000000) eden space 410624K, 100% used [0x0000000780000000,0x0000000799100000,0x0000000799100000) from space 684544K, 18% used [0x00000007c4980000,0x00000007cc245f30,0x00000007ee600000) to space 698880K, 0% used [0x0000000799100000,0x0000000799100000,0x00000007c3b80000) ParOldGen total 3225088K, used 2652104K [0x0000000680000000, 0x0000000744d80000, 0x0000000780000000) object space 3225088K, 82% used [0x0000000680000000,0x0000000721df21d8,0x0000000744d80000) PSPermGen total 2097152K, used 111831K [0x0000000600000000, 0x0000000680000000, 0x0000000680000000) object space 2097152K, 5% used [0x0000000600000000,0x0000000606d35f38,0x0000000680000000) Event: 1204603.067 GC heap after Heap after GC invocations=36182 (full 121): PSYoungGen total 1109504K, used 116361K [0x0000000780000000, 0x00000007ef480000, 0x0000000800000000) eden space 410624K, 0% used [0x0000000780000000,0x0000000780000000,0x0000000799100000) from space 698880K, 16% used [0x0000000799100000,0x00000007a02a2558,0x00000007c3b80000) to space 698880K, 0% used [0x00000007c4a00000,0x00000007c4a00000,0x00000007ef480000) ParOldGen total 3225088K, used 2761705K [0x0000000680000000, 0x0000000744d80000, 0x0000000780000000) object space 3225088K, 85% used [0x0000000680000000,0x00000007288fa6c8,0x0000000744d80000) PSPermGen total 2097152K, used 111831K [0x0000000600000000, 0x0000000680000000, 0x0000000680000000) object space 2097152K, 5% used [0x0000000600000000,0x0000000606d35f38,0x0000000680000000) } Event: 1204611.632 GC heap before {Heap before GC invocations=36183 (full 121): PSYoungGen total 1109504K, used 526985K [0x0000000780000000, 0x00000007ef480000, 0x0000000800000000) eden space 410624K, 100% used [0x0000000780000000,0x0000000799100000,0x0000000799100000) from space 698880K, 16% used [0x0000000799100000,0x00000007a02a2558,0x00000007c3b80000) to space 698880K, 0% used [0x00000007c4a00000,0x00000007c4a00000,0x00000007ef480000) ParOldGen total 3225088K, used 2761705K [0x0000000680000000, 0x0000000744d80000, 0x0000000780000000) object space 3225088K, 85% used [0x0000000680000000,0x00000007288fa6c8,0x0000000744d80000) PSPermGen total 2097152K, used 111831K [0x0000000600000000, 0x0000000680000000, 0x0000000680000000) object space 2097152K, 5% used [0x0000000600000000,0x0000000606d35f38,0x0000000680000000) Event: 1204611.935 GC heap after Heap after GC invocations=36183 (full 121): PSYoungGen total 1121280K, used 159460K [0x0000000780000000, 0x00000007ef300000, 0x0000000800000000) eden space 423936K, 0% used [0x0000000780000000,0x0000000780000000,0x0000000799e00000) from space 697344K, 22% used [0x00000007c4a00000,0x00000007ce5b9330,0x00000007ef300000) to space 698880K, 0% used [0x0000000799e00000,0x0000000799e00000,0x00000007c4880000) ParOldGen total 3225088K, used 2873393K [0x0000000680000000, 0x0000000744d80000, 0x0000000780000000) object space 3225088K, 89% used [0x0000000680000000,0x000000072f60c6c8,0x0000000744d80000) PSPermGen total 2097152K, used 111831K [0x0000000600000000, 0x0000000680000000, 0x0000000680000000) object space 2097152K, 5% used [0x0000000600000000,0x0000000606d35f38,0x0000000680000000) } Event: 1204620.761 GC heap before {Heap before GC invocations=36184 (full 121): PSYoungGen total 1121280K, used 583396K [0x0000000780000000, 0x00000007ef300000, 0x0000000800000000) eden space 423936K, 100% used [0x0000000780000000,0x0000000799e00000,0x0000000799e00000) from space 697344K, 22% used [0x00000007c4a00000,0x00000007ce5b9330,0x00000007ef300000) to space 698880K, 0% used [0x0000000799e00000,0x0000000799e00000,0x00000007c4880000) ParOldGen total 3225088K, used 2873393K [0x0000000680000000, 0x0000000744d80000, 0x0000000780000000) object space 3225088K, 89% used [0x0000000680000000,0x000000072f60c6c8,0x0000000744d80000) PSPermGen total 2097152K, used 111831K [0x0000000600000000, 0x0000000680000000, 0x0000000680000000) object space 2097152K, 5% used [0x0000000600000000,0x0000000606d35ff8,0x0000000680000000) Event: 1204621.151 GC heap after Heap after GC invocations=36184 (full 121): PSYoungGen total 1122816K, used 169794K [0x0000000780000000, 0x00000007eef00000, 0x0000000800000000) eden space 423936K, 0% used [0x0000000780000000,0x0000000780000000,0x0000000799e00000) from space 698880K, 24% used [0x0000000799e00000,0x00000007a43d0868,0x00000007c4880000) to space 690176K, 0% used [0x00000007c4d00000,0x00000007c4d00000,0x00000007eef00000) ParOldGen total 3225088K, used 3027001K [0x0000000680000000, 0x0000000744d80000, 0x0000000780000000) object space 3225088K, 93% used [0x0000000680000000,0x0000000738c0e520,0x0000000744d80000) PSPermGen total 2097152K, used 111831K [0x0000000600000000, 0x0000000680000000, 0x0000000680000000) object space 2097152K, 5% used [0x0000000600000000,0x0000000606d35ff8,0x0000000680000000) } Event: 1204621.151 GC heap before {Heap before GC invocations=36185 (full 122): PSYoungGen total 1122816K, used 169794K [0x0000000780000000, 0x00000007eef00000, 0x0000000800000000) eden space 423936K, 0% used [0x0000000780000000,0x0000000780000000,0x0000000799e00000) from space 698880K, 24% used [0x0000000799e00000,0x00000007a43d0868,0x00000007c4880000) to space 690176K, 0% used [0x00000007c4d00000,0x00000007c4d00000,0x00000007eef00000) ParOldGen total 3225088K, used 3027001K [0x0000000680000000, 0x0000000744d80000, 0x0000000780000000) object space 3225088K, 93% used [0x0000000680000000,0x0000000738c0e520,0x0000000744d80000) PSPermGen total 2097152K, used 111831K [0x0000000600000000, 0x0000000680000000, 0x0000000680000000) object space 2097152K, 5% used [0x0000000600000000,0x0000000606d35ff8,0x0000000680000000) Deoptimization events (10 events): Event: 1204401.184 Thread 0x00007f9ad010d800 Uncommon trap: reason=class_check action=maybe_recompile pc=0x00007f9b49746a14 method=cn.hutool.core.convert.ConverterRegistry.getDefaultConverter(Ljava/lang/reflect/Type;)Lcn/hutool/core/convert/Converter; @ 22 Event: 1204401.471 Thread 0x00007f9ad010d800 Uncommon trap: reason=unreached action=reinterpret pc=0x00007f9b4a227214 method=com.qdport.controller.edo.EdoDynamicController.exportPayOrderData(Ljava/lang/String;Ljava/lang/String;Ljava/lang/String;Ljava/lang/String;Ljava/lang/String;Ljava/lang/String;L Event: 1204401.679 Thread 0x00007f9ad010d800 Uncommon trap: reason=null_check action=make_not_entrant pc=0x00007f9b4a119570 method=com.alibaba.fastjson.parser.ParserConfig.get(Ljava/lang/reflect/Type;)Lcom/alibaba/fastjson/parser/deserializer/ObjectDeserializer; @ 18 Event: 1204401.679 Thread 0x00007f9ad010d800 Uncommon trap: reason=null_check action=make_not_entrant pc=0x00007f9b4a11a0d0 method=com.alibaba.fastjson.parser.ParserConfig.get(Ljava/lang/reflect/Type;)Lcom/alibaba/fastjson/parser/deserializer/ObjectDeserializer; @ 18 Event: 1204402.306 Thread 0x00007f9ad010d800 Uncommon trap: reason=unstable_if action=reinterpret pc=0x00007f9b4a2acd48 method=com.qdport.controller.edo.EdoDynamicController.exportPayOrderData(Ljava/lang/String;Ljava/lang/String;Ljava/lang/String;Ljava/lang/String;Ljava/lang/String;Ljava/lang/String Event: 1204482.174 Thread 0x00007f9ac4001800 Uncommon trap: reason=class_check action=maybe_recompile pc=0x00007f9b4975a408 method=com.alibaba.nacos.client.config.impl.ClientWorker$LongPullingRunnable.run()V @ 130 Event: 1204482.222 Thread 0x00007f9ad0002800 Uncommon trap: reason=bimorphic action=maybe_recompile pc=0x00007f9b49ef0d6c method=org.springframework.context.event.AbstractApplicationEventMulticaster.getApplicationListeners(Lorg/springframework/context/ApplicationEvent;Lorg/springframework/core/Resol Event: 1204523.968 Thread 0x00007f9af40df800 Uncommon trap: reason=unstable_if action=reinterpret pc=0x00007f9b49e96204 method=com.taobao.hsf.address.AddressProfiler.run()V @ 24 Event: 1204523.969 Thread 0x00007f9af40df800 Uncommon trap: reason=unstable_if action=reinterpret pc=0x00007f9b4a118ef8 method=java.text.FieldPosition.matchesField(Ljava/text/Format$Field;I)Z @ 21 Event: 1204581.597 Thread 0x00007f9ad0068800 Uncommon trap: reason=unstable_if action=reinterpret pc=0x00007f9b49d12f7c method=cn.hutool.core.convert.AbstractConverter.convertToStr(Ljava/lang/Object;)Ljava/lang/String; @ 11 Internal exceptions (10 events): Event: 1204618.577 Thread 0x00007f9b4c166800 Threw 0x000000079141a848 at /HUDSON/workspace/7u-2-build-linux-amd64/jdk7u80/2329/hotspot/src/share/vm/prims/jvm.cpp:1319 Event: 1204619.542 Thread 0x00007f9b4c43a800 Threw 0x0000000792fa6bf8 at /HUDSON/workspace/7u-2-build-linux-amd64/jdk7u80/2329/hotspot/src/share/vm/prims/jvm.cpp:1319 Event: 1204619.542 Thread 0x00007f9b4c43a800 Threw 0x0000000792faeb00 at /HUDSON/workspace/7u-2-build-linux-amd64/jdk7u80/2329/hotspot/src/share/vm/prims/jvm.cpp:1319 Event: 1204619.610 Thread 0x00007f9ad010f800 Threw 0x0000000793b29018 at /HUDSON/workspace/7u-2-build-linux-amd64/jdk7u80/2329/hotspot/src/share/vm/prims/jvm.cpp:1319 Event: 1204619.611 Thread 0x00007f9ad010f800 Threw 0x0000000793b30a50 at /HUDSON/workspace/7u-2-build-linux-amd64/jdk7u80/2329/hotspot/src/share/vm/prims/jvm.cpp:1319 Event: 1204620.562 Thread 0x00007f9ad0008800 Threw 0x0000000797ff58c8 at /HUDSON/workspace/7u-2-build-linux-amd64/jdk7u80/2329/hotspot/src/share/vm/prims/jvm.cpp:1319 Event: 1204620.562 Thread 0x00007f9ad0008800 Threw 0x0000000797ffd6d0 at /HUDSON/workspace/7u-2-build-linux-amd64/jdk7u80/2329/hotspot/src/share/vm/prims/jvm.cpp:1319 Event: 1204620.743 Thread 0x00007f9af2e2b800 Threw 0x0000000798ee0120 at /HUDSON/workspace/7u-2-build-linux-amd64/jdk7u80/2329/hotspot/src/share/vm/prims/jni.cpp:717 Event: 1204620.743 Thread 0x00007f9af2e2b800 Threw 0x0000000798ee6c38 at /HUDSON/workspace/7u-2-build-linux-amd64/jdk7u80/2329/hotspot/src/share/vm/prims/jni.cpp:717 Event: 1204620.743 Thread 0x00007f9af2e2b800 Threw 0x0000000798eeb330 at /HUDSON/workspace/7u-2-build-linux-amd64/jdk7u80/2329/hotspot/src/share/vm/prims/jni.cpp:717 Events (10 events): Event: 1204619.610 loading class 0x00007f9ab400eee0 done Event: 1204619.731 Thread 0x00007f9abc15f000 Thread added: 0x00007f9abc15f000 Event: 1204619.731 Thread 0x00007f9abc15f000 Thread exited: 0x00007f9abc15f000 Event: 1204620.562 loading class 0x00007f9ab40101e0 Event: 1204620.562 loading class 0x00007f9ab40101e0 done Event: 1204620.562 loading class 0x00007f9ab400eee0 Event: 1204620.562 loading class 0x00007f9ab400eee0 done Event: 1204620.678 Executing VM operation: RevokeBias Event: 1204620.679 Executing VM operation: RevokeBias done Event: 1204620.761 Executing VM operation: ParallelGCFailedAllocation ```
如何解决训练词向量word2vec时出现的内存问题?
用13GB的语料进行词向量的训练的话,用16GB的电脑,怎样防止内存溢出 最近在学习自己训练词向量,整理了13GB的小说语料, 昨晚设置好从分词做到词向量训练,结果今天早上看了一下内存溢出。 仅仅只完成了130M的分词,连词向量的训练都没开始就宕机了。 下图为执行代码 分词工具使用的是北大的pkuseg 请问应该如何修改代码? 这是我第一次做实战性质的项目 完全没有经验 还请各位前辈帮忙修改代码 ``` #文本预处理 sentences = [] rules = u"[\u4e00-\u9fa5]+" pattern = re.compile(rules) f_writer = open("data/分词后的1s1lCN13G.txt", "w", encoding="utf-8") with open("data/1s1lCN13G.txt", "r" , encoding="utf-8") as f_reader: for line in f_reader: if line == "" or line is None: continue line = " ".join(seg.cut(line)) seg_list = pattern.findall(line) word_list = [] for word in seg_list: if word not in stop_words: word_list.append(word) if len(word_list) > 0: sentences.append(word_list) line = " ".join(word_list) f_writer.write(line + "\n") f_writer.flush() f_writer.close() ``` ``` #模型训练 model = word2vec.Word2Vec(sentences,sg=1,hs=1,window=10,min_count=20,iter=10,size=256,workers=16) model.save("data/13G") ```
ubantu16.04安装caffe,最后运行测试的时候出现问题,求高手解答
CXX src/caffe/layers/cudnn_pooling_layer.cpp CXX src/caffe/layers/spp_layer.cpp CXX src/caffe/layers/relu_layer.cpp CXX src/caffe/layers/input_layer.cpp CXX src/caffe/layers/scale_layer.cpp CXX src/caffe/layers/bias_layer.cpp CXX src/caffe/layers/cudnn_lcn_layer.cpp CXX src/caffe/layers/cudnn_tanh_layer.cpp CXX src/caffe/layers/cudnn_sigmoid_layer.cpp CXX src/caffe/layers/split_layer.cpp CXX src/caffe/layers/inner_product_layer.cpp CXX src/caffe/layers/reshape_layer.cpp CXX src/caffe/layers/threshold_layer.cpp CXX src/caffe/layers/concat_layer.cpp CXX src/caffe/layers/tanh_layer.cpp CXX src/caffe/layers/embed_layer.cpp CXX src/caffe/solver.cpp CXX src/caffe/internal_thread.cpp CXX src/caffe/solvers/nesterov_solver.cpp CXX src/caffe/solvers/adam_solver.cpp CXX src/caffe/solvers/adagrad_solver.cpp CXX src/caffe/solvers/adadelta_solver.cpp CXX src/caffe/solvers/rmsprop_solver.cpp CXX src/caffe/solvers/sgd_solver.cpp CXX src/caffe/data_transformer.cpp CXX src/caffe/blob.cpp NVCC src/caffe/util/math_functions.cu nvcc warning : The 'compute_20', 'sm_20', and 'sm_21' architectures are deprecated, and may be removed in a future release (Use -Wno-deprecated-gpu-targets to suppress warning). NVCC src/caffe/util/im2col.cu nvcc warning : The 'compute_20', 'sm_20', and 'sm_21' architectures are deprecated, and may be removed in a future release (Use -Wno-deprecated-gpu-targets to suppress warning). NVCC src/caffe/layers/split_layer.cu nvcc warning : The 'compute_20', 'sm_20', and 'sm_21' architectures are deprecated, and may be removed in a future release (Use -Wno-deprecated-gpu-targets to suppress warning). NVCC src/caffe/layers/cudnn_softmax_layer.cu nvcc warning : The 'compute_20', 'sm_20', and 'sm_21' architectures are deprecated, and may be removed in a future release (Use -Wno-deprecated-gpu-targets to suppress warning). NVCC src/caffe/layers/cudnn_lcn_layer.cu nvcc warning : The 'compute_20', 'sm_20', and 'sm_21' architectures are deprecated, and may be removed in a future release (Use -Wno-deprecated-gpu-targets to suppress warning). NVCC src/caffe/layers/bias_layer.cu nvcc warning : The 'compute_20', 'sm_20', and 'sm_21' architectures are deprecated, and may be removed in a future release (Use -Wno-deprecated-gpu-targets to suppress warning). nvcc warning : The 'compute_20', 'sm_20', and 'sm_21' architectures are deprecated, and may be removed in a future release (Use -Wno-deprecated-gpu-targets to suppress warning). NVCC src/caffe/layers/prelu_layer.cu nvcc warning : The 'compute_20', 'sm_20', and 'sm_21' architectures are deprecated, and may be removed in a future release (Use -Wno-deprecated-gpu-targets to suppress warning). nvcc warning : The 'compute_20', 'sm_20', and 'sm_21' architectures are deprecated, and may be removed in a future release (Use -Wno-deprecated-gpu-targets to suppress warning). NVCC src/caffe/layers/crop_layer.cu nvcc warning : The 'compute_20', 'sm_20', and 'sm_21' architectures are deprecated, and may be removed in a future release (Use -Wno-deprecated-gpu-targets to suppress warning). nvcc warning : The 'compute_20', 'sm_20', and 'sm_21' architectures are deprecated, and may be removed in a future release (Use -Wno-deprecated-gpu-targets to suppress warning). NVCC src/caffe/layers/contrastive_loss_layer.cu nvcc warning : The 'compute_20', 'sm_20', and 'sm_21' architectures are deprecated, and may be removed in a future release (Use -Wno-deprecated-gpu-targets to suppress warning). nvcc warning : The 'compute_20', 'sm_20', and 'sm_21' architectures are deprecated, and may be removed in a future release (Use -Wno-deprecated-gpu-targets to suppress warning). NVCC src/caffe/layers/log_layer.cu nvcc warning : The 'compute_20', 'sm_20', and 'sm_21' architectures are deprecated, and may be removed in a future release (Use -Wno-deprecated-gpu-targets to suppress warning). nvcc warning : The 'compute_20', 'sm_20', and 'sm_21' architectures are deprecated, and may be removed in a future release (Use -Wno-deprecated-gpu-targets to suppress warning). NVCC src/caffe/layers/hdf5_data_layer.cu nvcc warning : The 'compute_20', 'sm_20', and 'sm_21' architectures are deprecated, and may be removed in a future release (Use -Wno-deprecated-gpu-targets to suppress warning). nvcc warning : The 'compute_20', 'sm_20', and 'sm_21' architectures are deprecated, and may be removed in a future release (Use -Wno-deprecated-gpu-targets to suppress warning). NVCC src/caffe/layers/power_layer.cu nvcc warning : The 'compute_20', 'sm_20', and 'sm_21' architectures are deprecated, and may be removed in a future release (Use -Wno-deprecated-gpu-targets to suppress warning). nvcc warning : The 'compute_20', 'sm_20', and 'sm_21' architectures are deprecated, and may be removed in a future release (Use -Wno-deprecated-gpu-targets to suppress warning). NVCC src/caffe/layers/tanh_layer.cu nvcc warning : The 'compute_20', 'sm_20', and 'sm_21' architectures are deprecated, and may be removed in a future release (Use -Wno-deprecated-gpu-targets to suppress warning). nvcc warning : The 'compute_20', 'sm_20', and 'sm_21' architectures are deprecated, and may be removed in a future release (Use -Wno-deprecated-gpu-targets to suppress warning). NVCC src/caffe/layers/absval_layer.cu nvcc warning : The 'compute_20', 'sm_20', and 'sm_21' architectures are deprecated, and may be removed in a future release (Use -Wno-deprecated-gpu-targets to suppress warning). nvcc warning : The 'compute_20', 'sm_20', and 'sm_21' architectures are deprecated, and may be removed in a future release (Use -Wno-deprecated-gpu-targets to suppress warning). NVCC src/caffe/layers/softmax_layer.cu nvcc warning : The 'compute_20', 'sm_20', and 'sm_21' architectures are deprecated, and may be removed in a future release (Use -Wno-deprecated-gpu-targets to suppress warning). nvcc warning : The 'compute_20', 'sm_20', and 'sm_21' architectures are deprecated, and may be removed in a future release (Use -Wno-deprecated-gpu-targets to suppress warning). NVCC src/caffe/layers/elu_layer.cu nvcc warning : The 'compute_20', 'sm_20', and 'sm_21' architectures are deprecated, and may be removed in a future release (Use -Wno-deprecated-gpu-targets to suppress warning). nvcc warning : The 'compute_20', 'sm_20', and 'sm_21' architectures are deprecated, and may be removed in a future release (Use -Wno-deprecated-gpu-targets to suppress warning). NVCC src/caffe/layers/scale_layer.cu nvcc warning : The 'compute_20', 'sm_20', and 'sm_21' architectures are deprecated, and may be removed in a future release (Use -Wno-deprecated-gpu-targets to suppress warning). nvcc warning : The 'compute_20', 'sm_20', and 'sm_21' architectures are deprecated, and may be removed in a future release (Use -Wno-deprecated-gpu-targets to suppress warning). NVCC src/caffe/layers/slice_layer.cu nvcc warning : The 'compute_20', 'sm_20', and 'sm_21' architectures are deprecated, and may be removed in a future release (Use -Wno-deprecated-gpu-targets to suppress warning). nvcc warning : The 'compute_20', 'sm_20', and 'sm_21' architectures are deprecated, and may be removed in a future release (Use -Wno-deprecated-gpu-targets to suppress warning). NVCC src/caffe/layers/im2col_layer.cu nvcc warning : The 'compute_20', 'sm_20', and 'sm_21' architectures are deprecated, and may be removed in a future release (Use -Wno-deprecated-gpu-targets to suppress warning). nvcc warning : The 'compute_20', 'sm_20', and 'sm_21' architectures are deprecated, and may be removed in a future release (Use -Wno-deprecated-gpu-targets to suppress warning). NVCC src/caffe/layers/conv_layer.cu nvcc warning : The 'compute_20', 'sm_20', and 'sm_21' architectures are deprecated, and may be removed in a future release (Use -Wno-deprecated-gpu-targets to suppress warning). nvcc warning : The 'compute_20', 'sm_20', and 'sm_21' architectures are deprecated, and may be removed in a future release (Use -Wno-deprecated-gpu-targets to suppress warning). NVCC src/caffe/layers/cudnn_lrn_layer.cu nvcc warning : The 'compute_20', 'sm_20', and 'sm_21' architectures are deprecated, and may be removed in a future release (Use -Wno-deprecated-gpu-targets to suppress warning). nvcc warning : The 'compute_20', 'sm_20', and 'sm_21' architectures are deprecated, and may be removed in a future release (Use -Wno-deprecated-gpu-targets to suppress warning). NVCC src/caffe/solvers/nesterov_solver.cu nvcc warning : The 'compute_20', 'sm_20', and 'sm_21' architectures are deprecated, and may be removed in a future release (Use -Wno-deprecated-gpu-targets to suppress warning). nvcc warning : The 'compute_20', 'sm_20', and 'sm_21' architectures are deprecated, and may be removed in a future release (Use -Wno-deprecated-gpu-targets to suppress warning). nvcc warning : The 'compute_20', 'sm_20', and 'sm_21' architectures are deprecated, and may be removed in a future release (Use -Wno-deprecated-gpu-targets to suppress warning). nvcc warning : The 'compute_20', 'sm_20', and 'sm_21' architectures are deprecated, and may be removed in a future release (Use -Wno-deprecated-gpu-targets to suppress warning). LD -o .build_release/lib/libcaffe.so.1.0.0 CXX/LD -o .build_release/test/test_all.testbin src/caffe/test/test_caffe_main.cpp .build_release/tools/caffe make: .build_release/tools/caffe: Command not found Makefile:532: recipe for target 'runtest' failed make: *** [runtest] Error 127 minglei@minglei:~/caffe$
shareSDK运行报错,求解
Description Resource Path Location Type Conversion to Dalvik format failed: Unable to execute dex: Multiple dex files define Lcn/sharesdk/wechat/friends/Wechat$1; WisdomBeijing Unknown Android Packaging Problem
ie浏览器运行java中的打印预览出错?
basic: PluginMain.unregisterApplet: 1 from mananger sun.plugin2.applet.Applet2Manager@bab32d basic: 已添加进度监听程序: sun.plugin.util.ProgressMonitorAdapter@1a86e77 security: Expected Main URL: http://110.249.221.20:8082/report/runqianReport4Applet.jar basic: Plugin2ClassLoader.addURL parent called for http://110.249.221.20:8082/report/runqianReport4Applet.jar security: blacklist: check contains 9fKAOxlxGDnNQIzxDVQ6UjwsTU0=, state now IN_MEMORY security: blacklist: not found in cache security: 该 jar 文件不在黑名单上 security: 该 jar 文件没有签名, 所以将跳过黑名单检查 security: 找不到可信库列表文件 security: 警告: 以下资源已使用弱签名算法 MD5withRSA 进行签名, 并且被视为未签名: http://110.249.221.20:8082/report/runqianReport4Applet.jar 此算法现已通过安全属性禁用: jdk.jar.disabledAlgorithms=MD2, MD5, RSA keySize < 1024, DSA keySize < 1024 该文件已高速缓存为 C:\Users\凤凰购物\AppData\LocalLow\Sun\Java\Deployment\cache\6.0\55\6e30c6b7-28e0d833。请运行 'jarsigner -verify -verbose "C:\Users\凤凰购物\AppData\LocalLow\Sun\Java\Deployment\cache\6.0\55\6e30c6b7-28e0d833"' 以获取详细信息, 或者转到 http://www.java.com/jcpsecurity。 cache: Create from verifier: JarSigningData{hasOnlySignedEntries=false, hasSingleCodeSource=false, hasMissingSignedEntries=false} security: Grant connect perm for http://110.249.221.20:8082/report/runqianReport4Applet.jar : java.security.Permissions@38894d ( ("java.net.URLPermission" "http://110.249.221.20:8082/-" "*:*") ("java.net.URLPermission" "http://110.249.221.20:8082" "*:*") ) security: SSV validation: running: 1.8.0_191 requested: null range: null javaVersionParam: null Rule Set version: null network: Created version ID: 1.8.0.191 network: Created version ID: 1.8.0.191 security: continue with running version security: JUT Record: plugin2 http://110.249.221.20:8082/report/jsppage.do?url=app/report/showPreview&width=1920&height=1080&reportFile=syte/syte/khbmb.raq&param=grid=1000471008371&set=undefined: launchjnlp= srctype=file code=com.runqian.report4.view.applet.PrintReport.class columns=0 needselectprinter=no archive=http://110.249.221.20:8082/report/runqianReport4Applet.jar type=application/x-java-applet;version=1.6 saveprintsetup=yes filename=syte/syte/(0000)khbmb.raq reportparamsid=101437 approot=http://110.249.221.20:8082/report name=khbmb width=1824 scriptable=true height=951 app_model=eJyNU8tu1DAUvdPpY4DSRSs2IESFyiCxcJJhRKegEaqqIhUFadSWD3ATd+I2E7v2zTxYVGLLkgUSC/6A/2DPN7DlD5DgOsm0RYiBLJw4PvY5557rz99hwRq4E6kBs3nGYqFTNWFGHLNtrV+pWKRQPrU5uB5CI6JfR9wKhJXwhA+5lwn0Xu+Hz0K4EQsbGalRqgxhtVxOedb3DtDIrE+QVTFGkVkC7AurchMJi3CrROYoU2/bGD4JpUUCL59wcwE7g3OoE3+qIu4I3LwWwrUBl9lOym0BmKNNVkS5kThx2hEeheTMI2de6cwjZ97U2cbBFSwRLqDEVFQHzeNE0wH3Zx5wSBjauDgUWaxMsXOsqZ7LzhGj0jAqzYcHm09u//hm6rC0B42E22SHNu/BvFYGyQLPMVFOxpT5WF6qSJTF6ruhjUIVqbSa10lKRfmTHoB77xHWgsBnrfYWa7UC1vKfdvxOC6FBsh2bR7H9DkCiQNS6kL1WyHZBsIsgxm+/3v34hX+qQ40kW/lGjLXrh9G8G8dF3W+6/ih+1OiUhzOaaePlZaaXjTX3Z7BLQ2FsNXU1de+lf9lcn9o0eXYmOTWZm7WJPKUoqJ1m2B//H8W7KcWJ1Zr3BYvV89ykXa71dMUmatQzYijFqDmSMSbdYKvlNxMh+wl2A7/jN0vkC8q5aycovGI4TY4GR8zws6bmhg+6fSNjgvt+e5PGzuPNoEn3rptnsTiWmYj/bgYhcBlUVWAlW5s5RYyXxejRjcSyPixy90cjLBQKzg2sz0rQ9XwVHaxSBxhYKdrG3XS2m+WDq4t06uJ2rxfuHupfNX1d6Q== network: 找不到高速缓存条目 [url: http://110.249.221.20:8082/report/com/runqian/base4/resources/print.class, 版本: null] network: 正在使用代理 DIRECT 连接 http://110.249.221.20:8082/report/com/runqian/base4/resources/print.class network: 正在使用代理 DIRECT 连接 http://110.249.221.20:8082/ network: 正在连接 http://110.249.221.20:8082/report/com/runqian/base4/resources/print.class 与 cookie "JSESSIONID=E201D3F7A1D52EFCF2DF1197430711A8; Hm_lvt_cc83da0b81bd91768b35e064ce214fdf=1539762178,1539763430,1539764202; Hm_lpvt_cc83da0b81bd91768b35e064ce214fdf=1539764252" network: 找不到高速缓存条目 [url: http://110.249.221.20:8082/report/com/runqian/base4/resources/print.properties, 版本: null] network: 正在使用代理 DIRECT 连接 http://110.249.221.20:8082/report/com/runqian/base4/resources/print.properties network: 正在连接 http://110.249.221.20:8082/report/com/runqian/base4/resources/print.properties 与 cookie "JSESSIONID=E201D3F7A1D52EFCF2DF1197430711A8; Hm_lvt_cc83da0b81bd91768b35e064ce214fdf=1539762178,1539763430,1539764202; Hm_lpvt_cc83da0b81bd91768b35e064ce214fdf=1539764252" network: 找不到高速缓存条目 [url: http://110.249.221.20:8082/report/com/runqian/base4/resources/print.properties, 版本: null] network: 正在使用代理 DIRECT 连接 http://110.249.221.20:8082/report/com/runqian/base4/resources/print.properties network: 正在连接 http://110.249.221.20:8082/report/com/runqian/base4/resources/print.properties 与 cookie "JSESSIONID=E201D3F7A1D52EFCF2DF1197430711A8; Hm_lvt_cc83da0b81bd91768b35e064ce214fdf=1539762178,1539763430,1539764202; Hm_lpvt_cc83da0b81bd91768b35e064ce214fdf=1539764374" network: 找不到高速缓存条目 [url: http://110.249.221.20:8082/report/com/runqian/base4/resources/print_zh.class, 版本: null] network: 正在使用代理 DIRECT 连接 http://110.249.221.20:8082/report/com/runqian/base4/resources/print_zh.class network: 正在连接 http://110.249.221.20:8082/report/com/runqian/base4/resources/print_zh.class 与 cookie "JSESSIONID=E201D3F7A1D52EFCF2DF1197430711A8; Hm_lvt_cc83da0b81bd91768b35e064ce214fdf=1539762178,1539763430,1539764202; Hm_lpvt_cc83da0b81bd91768b35e064ce214fdf=1539764374" network: 找不到高速缓存条目 [url: http://110.249.221.20:8082/report/com/runqian/base4/resources/print_zh_CN.class, 版本: null] network: 正在使用代理 DIRECT 连接 http://110.249.221.20:8082/report/com/runqian/base4/resources/print_zh_CN.class network: 正在连接 http://110.249.221.20:8082/report/com/runqian/base4/resources/print_zh_CN.class 与 cookie "JSESSIONID=E201D3F7A1D52EFCF2DF1197430711A8; Hm_lvt_cc83da0b81bd91768b35e064ce214fdf=1539762178,1539763430,1539764202; Hm_lpvt_cc83da0b81bd91768b35e064ce214fdf=1539764374" network: 找不到高速缓存条目 [url: http://110.249.221.20:8082/report/com/runqian/base4/resources/print_zh_CN.properties, 版本: null] network: 正在使用代理 DIRECT 连接 http://110.249.221.20:8082/report/com/runqian/base4/resources/print_zh_CN.properties network: 正在连接 http://110.249.221.20:8082/report/com/runqian/base4/resources/print_zh_CN.properties 与 cookie "JSESSIONID=E201D3F7A1D52EFCF2DF1197430711A8; Hm_lvt_cc83da0b81bd91768b35e064ce214fdf=1539762178,1539763430,1539764202; Hm_lpvt_cc83da0b81bd91768b35e064ce214fdf=1539764374" network: 找不到高速缓存条目 [url: http://110.249.221.20:8082/report/com/runqian/base4/resources/print_zh_CN.properties, 版本: null] network: 正在使用代理 DIRECT 连接 http://110.249.221.20:8082/report/com/runqian/base4/resources/print_zh_CN.properties network: 正在连接 http://110.249.221.20:8082/report/com/runqian/base4/resources/print_zh_CN.properties 与 cookie "JSESSIONID=E201D3F7A1D52EFCF2DF1197430711A8; Hm_lvt_cc83da0b81bd91768b35e064ce214fdf=1539762178,1539763430,1539764202; Hm_lpvt_cc83da0b81bd91768b35e064ce214fdf=1539764374" network: 找不到高速缓存条目 [url: http://110.249.221.20:8082/report/com/runqian/base4/resources/print_zh_Hans.class, 版本: null] network: 正在使用代理 DIRECT 连接 http://110.249.221.20:8082/report/com/runqian/base4/resources/print_zh_Hans.class network: 正在连接 http://110.249.221.20:8082/report/com/runqian/base4/resources/print_zh_Hans.class 与 cookie "JSESSIONID=E201D3F7A1D52EFCF2DF1197430711A8; Hm_lvt_cc83da0b81bd91768b35e064ce214fdf=1539762178,1539763430,1539764202; Hm_lpvt_cc83da0b81bd91768b35e064ce214fdf=1539764374" network: 找不到高速缓存条目 [url: http://110.249.221.20:8082/report/com/runqian/base4/resources/print_zh_Hans.properties, 版本: null] network: 正在使用代理 DIRECT 连接 http://110.249.221.20:8082/report/com/runqian/base4/resources/print_zh_Hans.properties network: 正在连接 http://110.249.221.20:8082/report/com/runqian/base4/resources/print_zh_Hans.properties 与 cookie "JSESSIONID=E201D3F7A1D52EFCF2DF1197430711A8; Hm_lvt_cc83da0b81bd91768b35e064ce214fdf=1539762178,1539763430,1539764202; Hm_lpvt_cc83da0b81bd91768b35e064ce214fdf=1539764374" network: 找不到高速缓存条目 [url: http://110.249.221.20:8082/report/com/runqian/base4/resources/print_zh_Hans.properties, 版本: null] network: 正在使用代理 DIRECT 连接 http://110.249.221.20:8082/report/com/runqian/base4/resources/print_zh_Hans.properties network: 正在连接 http://110.249.221.20:8082/report/com/runqian/base4/resources/print_zh_Hans.properties 与 cookie "JSESSIONID=E201D3F7A1D52EFCF2DF1197430711A8; Hm_lvt_cc83da0b81bd91768b35e064ce214fdf=1539762178,1539763430,1539764202; Hm_lpvt_cc83da0b81bd91768b35e064ce214fdf=1539764374" network: 找不到高速缓存条目 [url: http://110.249.221.20:8082/report/com/runqian/base4/resources/print_zh_Hans_CN.class, 版本: null] network: 正在使用代理 DIRECT 连接 http://110.249.221.20:8082/report/com/runqian/base4/resources/print_zh_Hans_CN.class network: 正在连接 http://110.249.221.20:8082/report/com/runqian/base4/resources/print_zh_Hans_CN.class 与 cookie "JSESSIONID=E201D3F7A1D52EFCF2DF1197430711A8; Hm_lvt_cc83da0b81bd91768b35e064ce214fdf=1539762178,1539763430,1539764202; Hm_lpvt_cc83da0b81bd91768b35e064ce214fdf=1539764374" network: 找不到高速缓存条目 [url: http://110.249.221.20:8082/report/com/runqian/base4/resources/print_zh_Hans_CN.properties, 版本: null] network: 正在使用代理 DIRECT 连接 http://110.249.221.20:8082/report/com/runqian/base4/resources/print_zh_Hans_CN.properties network: 正在连接 http://110.249.221.20:8082/report/com/runqian/base4/resources/print_zh_Hans_CN.properties 与 cookie "JSESSIONID=E201D3F7A1D52EFCF2DF1197430711A8; Hm_lvt_cc83da0b81bd91768b35e064ce214fdf=1539762178,1539763430,1539764202; Hm_lpvt_cc83da0b81bd91768b35e064ce214fdf=1539764374" network: 找不到高速缓存条目 [url: http://110.249.221.20:8082/report/com/runqian/base4/resources/print_zh_Hans_CN.properties, 版本: null] network: 正在使用代理 DIRECT 连接 http://110.249.221.20:8082/report/com/runqian/base4/resources/print_zh_Hans_CN.properties network: 正在连接 http://110.249.221.20:8082/report/com/runqian/base4/resources/print_zh_Hans_CN.properties 与 cookie "JSESSIONID=E201D3F7A1D52EFCF2DF1197430711A8; Hm_lvt_cc83da0b81bd91768b35e064ce214fdf=1539762178,1539763430,1539764202; Hm_lpvt_cc83da0b81bd91768b35e064ce214fdf=1539764374" basic: 已加载小应用程序。 basic: 已调整小应用程序大小且已将其添加到父容器中 basic: PERF: AppletExecutionRunnable - applet.init() BEGIN ; jvmLaunch dt 551817 us, pluginInit dt 123005535 us, TotalTime: 123557352 us java.security.AccessControlException: access denied ("java.util.PropertyPermission" "java.awt.im.style" "write") at java.security.AccessControlContext.checkPermission(Unknown Source) at java.security.AccessController.checkPermission(Unknown Source) at java.lang.SecurityManager.checkPermission(Unknown Source) at sun.plugin2.applet.AWTAppletSecurityManager.checkPermission(Unknown Source) at java.lang.System.setProperty(Unknown Source) at com.runqian.report4.view.applet.PrintReport.init(PrintReport.java:78) at com.sun.deploy.uitoolkit.impl.awt.AWTAppletAdapter.init(Unknown Source) at sun.plugin2.applet.Plugin2Manager$AppletExecutionRunnable.run(Unknown Source) at java.lang.Thread.run(Unknown Source) security: 重置拒绝会话证书存储 basic: 已删除进度监听程序: sun.plugin.util.ProgressMonitorAdapter@1a86e77 security: 重置拒绝会话证书存储 basic: Dialog type is not candidate for embedding![图片说明](https://img-ask.csdn.net/upload/201810/17/1539765096_665392.png)
Java学习的正确打开方式
在博主认为,对于入门级学习java的最佳学习方法莫过于视频+博客+书籍+总结,前三者博主将淋漓尽致地挥毫于这篇博客文章中,至于总结在于个人,实际上越到后面你会发现学习的最好方式就是阅读参考官方文档其次就是国内的书籍,博客次之,这又是一个层次了,这里暂时不提后面再谈。博主将为各位入门java保驾护航,各位只管冲鸭!!!上天是公平的,只要不辜负时间,时间自然不会辜负你。 何谓学习?博主所理解的学习,它是一个过程,是一个不断累积、不断沉淀、不断总结、善于传达自己的个人见解以及乐于分享的过程。
程序员必须掌握的核心算法有哪些?
由于我之前一直强调数据结构以及算法学习的重要性,所以就有一些读者经常问我,数据结构与算法应该要学习到哪个程度呢?,说实话,这个问题我不知道要怎么回答你,主要取决于你想学习到哪些程度,不过针对这个问题,我稍微总结一下我学过的算法知识点,以及我觉得值得学习的算法。这些算法与数据结构的学习大多数是零散的,并没有一本把他们全部覆盖的书籍。下面是我觉得值得学习的一些算法以及数据结构,当然,我也会整理一些看过...
前端 | 2. 正则
转载请注明以下: 本文转自清自以敬的博客:https://blog.csdn.net/qq_45791147 文章目录1.转义2.正则表达式初步2.1.匹配字符2.1.1.组成元素2.1.2.基础正则的设计 1.转义 转义的作用: 当某个字符在表达式中具有特殊含义,例如字符串引号中出现了引号,为了可以使用这些字符本身,而不是使用其在表达式中的特殊含义,则需要通过转义符“\”来构建该字符转义...
有哪些让程序员受益终生的建议
从业五年多,辗转两个大厂,出过书,创过业,从技术小白成长为基层管理,联合几个业内大牛回答下这个问题,希望能帮到大家,记得帮我点赞哦。 敲黑板!!!读了这篇文章,你将知道如何才能进大厂,如何实现财务自由,如何在工作中游刃有余,这篇文章很长,但绝对是精品,记得帮我点赞哦!!!! 一腔肺腑之言,能看进去多少,就看你自己了!!! 目录: 在校生篇: 为什么要尽量进大厂? 如何选择语言及方...
大学四年自学走来,这些私藏的实用工具/学习网站我贡献出来了
大学四年,看课本是不可能一直看课本的了,对于学习,特别是自学,善于搜索网上的一些资源来辅助,还是非常有必要的,下面我就把这几年私藏的各种资源,网站贡献出来给你们。主要有:电子书搜索、实用工具、在线视频学习网站、非视频学习网站、软件下载、面试/求职必备网站。 注意:文中提到的所有资源,文末我都给你整理好了,你们只管拿去,如果觉得不错,转发、分享就是最大的支持了。 一、电子书搜索 对于大部分程序员...
linux系列之常用运维命令整理笔录
本博客记录工作中需要的linux运维命令,大学时候开始接触linux,会一些基本操作,可是都没有整理起来,加上是做开发,不做运维,有些命令忘记了,所以现在整理成博客,当然vi,文件操作等就不介绍了,慢慢积累一些其它拓展的命令,博客不定时更新 free -m 其中:m表示兆,也可以用g,注意都要小写 Men:表示物理内存统计 total:表示物理内存总数(total=used+free) use...
比特币原理详解
一、什么是比特币 比特币是一种电子货币,是一种基于密码学的货币,在2008年11月1日由中本聪发表比特币白皮书,文中提出了一种去中心化的电子记账系统,我们平时的电子现金是银行来记账,因为银行的背后是国家信用。去中心化电子记账系统是参与者共同记账。比特币可以防止主权危机、信用风险。其好处不多做赘述,这一层面介绍的文章很多,本文主要从更深层的技术原理角度进行介绍。 二、问题引入 假设现有4个人...
程序员接私活怎样防止做完了不给钱?
首先跟大家说明一点,我们做 IT 类的外包开发,是非标品开发,所以很有可能在开发过程中会有这样那样的需求修改,而这种需求修改很容易造成扯皮,进而影响到费用支付,甚至出现做完了项目收不到钱的情况。 那么,怎么保证自己的薪酬安全呢? 我们在开工前,一定要做好一些证据方面的准备(也就是“讨薪”的理论依据),这其中最重要的就是需求文档和验收标准。一定要让需求方提供这两个文档资料作为开发的基础。之后开发...
网页实现一个简单的音乐播放器(大佬别看。(⊙﹏⊙))
今天闲着无事,就想写点东西。然后听了下歌,就打算写个播放器。 于是乎用h5 audio的加上js简单的播放器完工了。 演示地点演示 html代码如下` music 这个年纪 七月的风 音乐 ` 然后就是css`*{ margin: 0; padding: 0; text-decoration: none; list-...
Python十大装B语法
Python 是一种代表简单思想的语言,其语法相对简单,很容易上手。不过,如果就此小视 Python 语法的精妙和深邃,那就大错特错了。本文精心筛选了最能展现 Python 语法之精妙的十个知识点,并附上详细的实例代码。如能在实战中融会贯通、灵活使用,必将使代码更为精炼、高效,同时也会极大提升代码B格,使之看上去更老练,读起来更优雅。
数据库优化 - SQL优化
以实际SQL入手,带你一步一步走上SQL优化之路!
2019年11月中国大陆编程语言排行榜
2019年11月2日,我统计了某招聘网站,获得有效程序员招聘数据9万条。针对招聘信息,提取编程语言关键字,并统计如下: 编程语言比例 rank pl_ percentage 1 java 33.62% 2 cpp 16.42% 3 c_sharp 12.82% 4 javascript 12.31% 5 python 7.93% 6 go 7.25% 7 p...
通俗易懂地给女朋友讲:线程池的内部原理
餐盘在灯光的照耀下格外晶莹洁白,女朋友拿起红酒杯轻轻地抿了一小口,对我说:“经常听你说线程池,到底线程池到底是个什么原理?”
《奇巧淫技》系列-python!!每天早上八点自动发送天气预报邮件到QQ邮箱
将代码部署服务器,每日早上定时获取到天气数据,并发送到邮箱。 也可以说是一个小型人工智障。 知识可以运用在不同地方,不一定非是天气预报。
经典算法(5)杨辉三角
杨辉三角 是经典算法,这篇博客对它的算法思想进行了讲解,并有完整的代码实现。
腾讯算法面试题:64匹马8个跑道需要多少轮才能选出最快的四匹?
昨天,有网友私信我,说去阿里面试,彻底的被打击到了。问了为什么网上大量使用ThreadLocal的源码都会加上private static?他被难住了,因为他从来都没有考虑过这个问题。无独有偶,今天笔者又发现有网友吐槽了一道腾讯的面试题,我们一起来看看。 腾讯算法面试题:64匹马8个跑道需要多少轮才能选出最快的四匹? 在互联网职场论坛,一名程序员发帖求助到。二面腾讯,其中一个算法题:64匹...
面试官:你连RESTful都不知道我怎么敢要你?
干货,2019 RESTful最贱实践
Docker 从入门到掉坑
Docker 介绍 简单的对docker进行介绍,可以把它理解为一个应用程序执行的容器。但是docker本身和虚拟机还是有较为明显的出入的。我大致归纳了一下,可以总结为以下几点: docker自身也有着很多的优点,关于它的优点,可以总结为以下几项: 安装docker 从 2017 年 3 月开始 docker 在原来的基础上分为两个分支版本: Docker CE 和 Doc...
为啥国人偏爱Mybatis,而老外喜欢Hibernate/JPA呢?
关于SQL和ORM的争论,永远都不会终止,我也一直在思考这个问题。昨天又跟群里的小伙伴进行了一番讨论,感触还是有一些,于是就有了今天这篇文。 声明:本文不会下关于Mybatis和JPA两个持久层框架哪个更好这样的结论。只是摆事实,讲道理,所以,请各位看官勿喷。 一、事件起因 关于Mybatis和JPA孰优孰劣的问题,争论已经很多年了。一直也没有结论,毕竟每个人的喜好和习惯是大不相同的。我也看...
白话阿里巴巴Java开发手册高级篇
不久前,阿里巴巴发布了《阿里巴巴Java开发手册》,总结了阿里巴巴内部实际项目开发过程中开发人员应该遵守的研发流程规范,这些流程规范在一定程度上能够保证最终的项目交付质量,通过在时间中总结模式,并推广给广大开发人员,来避免研发人员在实践中容易犯的错误,确保最终在大规模协作的项目中达成既定目标。 无独有偶,笔者去年在公司里负责升级和制定研发流程、设计模板、设计标准、代码标准等规范,并在实际工作中进行...
SQL-小白最佳入门sql查询一
不要偷偷的查询我的个人资料,即使你再喜欢我,也不要这样,真的不好;
项目中的if else太多了,该怎么重构?
介绍 最近跟着公司的大佬开发了一款IM系统,类似QQ和微信哈,就是聊天软件。我们有一部分业务逻辑是这样的 if (msgType = "文本") { // dosomething } else if(msgType = "图片") { // doshomething } else if(msgType = "视频") { // doshomething } else { // doshom...
Nginx 原理和架构
Nginx 是一个免费的,开源的,高性能的 HTTP 服务器和反向代理,以及 IMAP / POP3 代理服务器。Nginx 以其高性能,稳定性,丰富的功能,简单的配置和低资源消耗而闻名。 Nginx 的整体架构 Nginx 里有一个 master 进程和多个 worker 进程。master 进程并不处理网络请求,主要负责调度工作进程:加载配置、启动工作进程及非停升级。worker 进程负责处...
Python 编程开发 实用经验和技巧
Python是一门很灵活的语言,也有很多实用的方法,有时候实现一个功能可以用多种方法实现,我这里总结了一些常用的方法和技巧,包括小数保留指定位小数、判断变量的数据类型、类方法@classmethod、制表符中文对齐、遍历字典、datetime.timedelta的使用等,会持续更新......
YouTube排名第一的励志英文演讲《Dream(梦想)》
Idon’t know what that dream is that you have, I don't care how disappointing it might have been as you've been working toward that dream,but that dream that you’re holding in your mind, that it’s po...
“狗屁不通文章生成器”登顶GitHub热榜,分分钟写出万字形式主义大作
一、垃圾文字生成器介绍 最近在浏览GitHub的时候,发现了这样一个骨骼清奇的雷人项目,而且热度还特别高。 项目中文名:狗屁不通文章生成器 项目英文名:BullshitGenerator 根据作者的介绍,他是偶尔需要一些中文文字用于GUI开发时测试文本渲染,因此开发了这个废话生成器。但由于生成的废话实在是太过富于哲理,所以最近已经被小伙伴们给玩坏了。 他的文风可能是这样的: 你发现,...
程序员:我终于知道post和get的区别
是一个老生常谈的话题,然而随着不断的学习,对于以前的认识有很多误区,所以还是需要不断地总结的,学而时习之,不亦说乎
《程序人生》系列-这个程序员只用了20行代码就拿了冠军
你知道的越多,你不知道的越多 点赞再看,养成习惯GitHub上已经开源https://github.com/JavaFamily,有一线大厂面试点脑图,欢迎Star和完善 前言 这一期不算《吊打面试官》系列的,所有没前言我直接开始。 絮叨 本来应该是没有这期的,看过我上期的小伙伴应该是知道的嘛,双十一比较忙嘛,要值班又要去帮忙拍摄年会的视频素材,还得搞个程序员一天的Vlog,还要写BU...
程序员把地府后台管理系统做出来了,还有3.0版本!12月7号最新消息:已在开发中有github地址
第一幕:缘起 听说阎王爷要做个生死簿后台管理系统,我们派去了一个程序员…… 996程序员做的梦: 第一场:团队招募 为了应对地府管理危机,阎王打算找“人”开发一套地府后台管理系统,于是就在地府总经办群中发了项目需求。 话说还是中国电信的信号好,地府都是满格,哈哈!!! 经常会有外行朋友问:看某网站做的不错,功能也简单,你帮忙做一下? 而这次,面对这样的需求,这个程序员...
网易云6亿用户音乐推荐算法
网易云音乐是音乐爱好者的集聚地,云音乐推荐系统致力于通过 AI 算法的落地,实现用户千人千面的个性化推荐,为用户带来不一样的听歌体验。 本次分享重点介绍 AI 算法在音乐推荐中的应用实践,以及在算法落地过程中遇到的挑战和解决方案。 将从如下两个部分展开: AI算法在音乐推荐中的应用 音乐场景下的 AI 思考 从 2013 年 4 月正式上线至今,网易云音乐平台持续提供着:乐屏社区、UGC...
为什么要学数据结构?
一、前言 在可视化化程序设计的今天,借助于集成开发环境可以很快地生成程序,程序设计不再是计算机专业人员的专利。很多人认为,只要掌握几种开发工具就可以成为编程高手,其实,这是一种误解。要想成为一个专业的开发人员,至少需要以下三个条件: 1) 能够熟练地选择和设计各种数据结构和算法 2) 至少要能够熟练地掌握一门程序设计语言 3) 熟知所涉及的相关应用领域的知识 其中,后两个条件比较容易实现,而第一个...
金山办公上市,雷军心愿了却!
作者 | 胡巍巍 出品 | CSDN(ID:CSDNnews) 11月17日,大周末的,雷军微博发了个重磅消息: “明天将是里程碑式的一天,金山办公终于成功在科创板挂牌上市了! 从1988年金山创办到今天,WPS走了整整31年。 从1999年以金山办公为主体准备上市算起,这一天,我们等了20年。 WPS和金山的历程,这是一个坚持梦想并最终取得胜利的励志故事。期待大家的祝福!”...
8年经验面试官详解 Java 面试秘诀
作者 |胡书敏 责编 | 刘静 出品 | CSDN(ID:CSDNnews) 本人目前在一家知名外企担任架构师,而且最近八年来,在多家外企和互联网公司担任Java技术面试官,前后累计面试了有两三百位候选人。在本文里,就将结合本人的面试经验,针对Java初学者、Java初级开发和Java开发,给出若干准备简历和准备面试的建议。 Java程序员准备和投递简历的实...
面试官如何考察你的思维方式?
1.两种思维方式在求职面试中,经常会考察这种问题:北京有多少量特斯拉汽车?某胡同口的煎饼摊一年能卖出多少个煎饼?深圳有多少个产品经理?一辆公交车里能装下多少个乒乓球?一个正常成年人有多少根头发?这类估算问题,被称为费米问题,是以科学家费米命名的。为什么面试会问这种问题呢?这类问题能把两类人清楚地区分出来。一类是具有文科思维的人,擅长赞叹和模糊想象,它主要依靠的是人的第一反应和直觉,比如小孩...
17张图带你解析红黑树的原理!保证你能看懂!
二叉查找树 由于红黑树本质上就是一棵二叉查找树,所以在了解红黑树之前,咱们先来看下二叉查找树。 二叉查找树(Binary Search Tree),也称有序二叉树(ordered binary tree),排序二叉树(sorted binary tree),是指一棵空树或者具有下列性质的二叉树: 若任意结点的左子树不空,则左子树上所有结点的值均小于它的根结点的值; 若任意结点的...
腾讯“疯狂”开源!
作者 | 马超 责编 | 胡巍巍 出品 | CSDN(ID:CSDNnews) 近日,腾讯自研的万亿级分布式消息中间件TubeMQ正式开源,并捐赠给Apache基金会,成为基金会官方认可的Incubator项目。 我们知道与TubeMQ功能类似的kafka是领英公司在早在10年前捐赠给Apache基金会的金牌项目,而那时的腾讯还在忙于3Q大战,公司文化也相对封闭,甚至连目前社交领...
so easy! 10行代码写个"狗屁不通"文章生成器
前几天,GitHub 有个开源项目特别火,只要输入标题就可以生成一篇长长的文章。 背后实现代码一定很复杂吧,里面一定有很多高深莫测的机器学习等复杂算法 不过,当我看了源代码之后 这程序不到50行 尽管我有多年的Python经验,但我竟然一时也没有看懂 当然啦,原作者也说了,这个代码也是在无聊中诞生的,平时撸码是不写中文变量名的, 中文...
知乎高赞:中国有什么拿得出手的开源软件产品?(整理自本人原创回答)
知乎高赞:中国有什么拿得出手的开源软件产品? 在知乎上,有个问题问“中国有什么拿得出手的开源软件产品(在 GitHub 等社区受欢迎度较好的)?” 事实上,还不少呢~ 本人于2019.7.6进行了较为全面的回答,对这些受欢迎的 Github 开源项目分类整理如下: 分布式计算、云平台相关工具类 1.SkyWalking,作者吴晟、刘浩杨 等等 仓库地址: apache/skywalking 更...
MySQL数据库总结
一、数据库简介 数据库(Database,DB)是按照数据结构来组织,存储和管理数据的仓库。 典型特征:数据的结构化、数据间的共享、减少数据的冗余度,数据的独立性。 关系型数据库:使用关系模型把数据组织到数据表(table)中。现实世界可以用数据来描述。 主流的关系型数据库产品:Oracle(Oracle)、DB2(IBM)、SQL Server(MS)、MySQL(Oracle)。 数据表:数...
记一次腾讯面试:进程之间究竟有哪些通信方式?如何通信? ---- 告别死记硬背
有一次面试的时候,被问到进程之间有哪些通信方式,不过由于之前没深入思考且整理过,说的并不好。想必大家也都知道进程有哪些通信方式,可是我猜很多人都是靠着”背“来记忆的,所以今天的这篇文章,讲给大家详细着讲解他们是如何通信的,让大家尽量能够理解他们之间的区别、优缺点等,这样的话,以后面试官让你举例子,你也能够顺手拈来。 1、管道 我们来看一条 Linux 的语句 netstat -tulnp | gr...
20行Python代码爬取王者荣耀全英雄皮肤
引言 王者荣耀大家都玩过吧,没玩过的也应该听说过,作为时下最火的手机MOBA游戏,咳咳,好像跑题了。我们今天的重点是爬取王者荣耀所有英雄的所有皮肤,而且仅仅使用20行Python代码即可完成。 准备工作 爬取皮肤本身并不难,难点在于分析,我们首先得得到皮肤图片的url地址,话不多说,我们马上来到王者荣耀的官网: 我们点击英雄资料,然后随意地选择一位英雄,接着F12打开调试台,找到英雄原皮肤的图片...
相关热词 c# clr dll c# 如何orm c# 固定大小的字符数组 c#框架设计 c# 删除数据库 c# 中文文字 图片转 c# 成员属性 接口 c#如何将程序封装 16进制负数转换 c# c#练手项目
立即提问