tx-lcn分布式事务客户端无法启动 5C

18:14:00.235 [main] DEBUG org.springframework.boot.devtools.settings.DevToolsSettings - Included patterns for restart : []
18:14:00.238 [main] DEBUG org.springframework.boot.devtools.settings.DevToolsSettings - Excluded patterns for restart : [/spring-boot-actuator/target/classes/, /spring-boot-devtools/target/classes/, /spring-boot/target/classes/, /spring-boot-starter-[\w-]+/, /spring-boot-autoconfigure/target/classes/, /spring-boot-starter/target/classes/]
18:14:00.238 [main] DEBUG org.springframework.boot.devtools.restart.ChangeableUrls - Matching URLs for reloading : [file:/D:/ocean-workspace/ocean-vehicle-service/target/classes/]
2019-06-25 18:14:00.722 INFO 13504 --- [ restartedMain] s.c.a.AnnotationConfigApplicationContext : Refreshing org.springframework.context.annotation.AnnotationConfigApplicationContext@5442519c: startup date [Tue Jun 25 18:14:00 CST 2019]; root of context hierarchy
2019-06-25 18:14:00.995 INFO 13504 --- [ restartedMain] f.a.AutowiredAnnotationBeanPostProcessor : JSR-330 'javax.inject.Inject' annotation found and supported for autowiring
2019-06-25 18:14:01.018 INFO 13504 --- [ restartedMain] trationDelegate$BeanPostProcessorChecker : Bean 'configurationPropertiesRebinderAutoConfiguration' of type [org.springframework.cloud.autoconfigure.ConfigurationPropertiesRebinderAutoConfiguration$$EnhancerBySpringCGLIB$$3b66cedb] is not eligible for getting processed by all BeanPostProcessors (for example: not eligible for auto-proxying)
2019-06-25 18:14:01.173 INFO 13504 --- [ restartedMain] o.s.c.n.eureka.InstanceInfoFactory : Setting initial instance status as: STARTING
2019-06-25 18:14:01.227 INFO 13504 --- [ restartedMain] com.netflix.discovery.DiscoveryClient : Initializing Eureka in region us-east-1
2019-06-25 18:14:01.458 INFO 13504 --- [ restartedMain] c.n.d.provider.DiscoveryJerseyProvider : Using JSON encoding codec LegacyJacksonJson
2019-06-25 18:14:01.458 INFO 13504 --- [ restartedMain] c.n.d.provider.DiscoveryJerseyProvider : Using JSON decoding codec LegacyJacksonJson
2019-06-25 18:14:01.560 INFO 13504 --- [ restartedMain] c.n.d.provider.DiscoveryJerseyProvider : Using XML encoding codec XStreamXml
2019-06-25 18:14:01.560 INFO 13504 --- [ restartedMain] c.n.d.provider.DiscoveryJerseyProvider : Using XML decoding codec XStreamXml
2019-06-25 18:14:01.688 INFO 13504 --- [ restartedMain] c.n.d.s.r.aws.ConfigClusterResolver : Resolving eureka endpoints via configuration
2019-06-25 18:14:01.727 INFO 13504 --- [ restartedMain] com.netflix.discovery.DiscoveryClient : Disable delta property : false
2019-06-25 18:14:01.728 INFO 13504 --- [ restartedMain] com.netflix.discovery.DiscoveryClient : Single vip registry refresh property : null
2019-06-25 18:14:01.728 INFO 13504 --- [ restartedMain] com.netflix.discovery.DiscoveryClient : Force full registry fetch : false
2019-06-25 18:14:01.728 INFO 13504 --- [ restartedMain] com.netflix.discovery.DiscoveryClient : Application is null : false
2019-06-25 18:14:01.728 INFO 13504 --- [ restartedMain] com.netflix.discovery.DiscoveryClient : Registered Applications size is zero : true
2019-06-25 18:14:01.728 INFO 13504 --- [ restartedMain] com.netflix.discovery.DiscoveryClient : Application version is -1: true
2019-06-25 18:14:01.728 INFO 13504 --- [ restartedMain] com.netflix.discovery.DiscoveryClient : Getting all instance registry info from the eureka server
2019-06-25 18:14:01.947 INFO 13504 --- [ restartedMain] com.netflix.discovery.DiscoveryClient : The response status is 200
2019-06-25 18:14:01.949 INFO 13504 --- [ restartedMain] com.netflix.discovery.DiscoveryClient : Not registering with Eureka server per configuration
2019-06-25 18:14:01.951 INFO 13504 --- [ restartedMain] com.netflix.discovery.DiscoveryClient : Discovery Client initialized at timestamp 1561457641950 with initial instances count: 20

    _______   __      _     _____  _   _
   |_   _\ \ / /     | |   /  __ \| \ | |
     | |  \ V /______| |   | /  \/|  \| |
     | |  /   \______| |   | |    | . ` |
     | | / /^\ \     | |___| \__/\| |\  |
     \_/ \/   \/     \_____/\____/\_| \_/

           TC  version:5.0.2.RELEASE

2019-06-25 18:14:02.100 INFO 13504 --- [ restartedMain] c.c.c.ConfigServicePropertySourceLocator : Fetching config from server at : http://10.115.132.40:9000/
2019-06-25 18:14:02.220 INFO 13504 --- [ restartedMain] c.c.c.ConfigServicePropertySourceLocator : Located environment: name=ocean-vehicle-service, profiles=[dev], label=master, version=null, state=null
2019-06-25 18:14:02.220 INFO 13504 --- [ restartedMain] b.c.PropertySourceBootstrapConfiguration : Located property source: CompositePropertySource {name='configService', propertySources=[MapPropertySource {name='file:/home/ocean/conf/ocean-vehicle-service-dev.yml'}]}
2019-06-25 18:14:02,250 -[INFO ] restartedMain com.ocean.vehicle.OceanVehicleServiceApplication:SpringApplication.java:658- The following profiles are active: dev
2019-06-25 18:14:02,250 [INFO ] restartedMain com.ocean.vehicle.OceanVehicleServiceApplication:SpringApplication.java:658- The following profiles are active: dev
2019-06-25 18:14:05,558 [WARN ] localhost-startStop-1 com.netflix.config.sources.URLConfigurationSource:URLConfigurationSource.java:121- No URLs will be polled as dynamic configuration sources.
2019-06-25 18:14:06,606 [ERROR ] localhost-startStop-1 org.springframework.boot.web.embedded.tomcat.TomcatStarter:TomcatStarter.java:62- Error starting Tomcat context. Exception: org.springframework.beans.factory.BeanCreationException. Message: Error creating bean with name 'servletEndpointRegistrar' defined in class path resource [org/springframework/boot/actuate/autoconfigure/endpoint/web/ServletEndpointManagementContextConfiguration$WebMvcServletEndpointManagementContextConfiguration.class]: Bean instantiation via factory method failed; nested exception is org.springframework.beans.BeanInstantiationException: Failed to instantiate [org.springframework.boot.actuate.endpoint.web.ServletEndpointRegistrar]: Factory method 'servletEndpointRegistrar' threw exception; nested exception is org.springframework.beans.factory.BeanCreationException: Error creating bean with name 'healthEndpoint' defined in class path resource [org/springframework/boot/actuate/autoconfigure/health/HealthEndpointConfiguration.class]: Bean instantiation via factory method failed; nested exception is org.springframework.beans.BeanInstantiationException: Failed to instantiate [org.springframework.boot.actuate.health.HealthEndpoint]: Factory method 'healthEndpoint' threw exception; nested exception is org.springframework.beans.factory.BeanCreationException: Error creating bean with name 'org.springframework.boot.actuate.autoconfigure.jdbc.DataSourceHealthIndicatorAutoConfiguration': Bean instantiation via constructor failed; nested exception is org.springframework.beans.BeanInstantiationException: Failed to instantiate [org.springframework.boot.actuate.autoconfigure.jdbc.DataSourceHealthIndicatorAutoConfiguration$$EnhancerBySpringCGLIB$$8e311d64]: Constructor threw exception; nested exception is org.springframework.beans.factory.BeanCreationException: Error creating bean with name 'dataSource' defined in class path resource [com/alibaba/druid/spring/boot/autoconfigure/DruidDataSourceAutoConfigure.class]: Initialization of bean failed; nested exception is org.springframework.aop.framework.AopConfigException: Could not generate CGLIB subclass of class com.alibaba.druid.spring.boot.autoconfigure.DruidDataSourceWrapper: Common causes of this problem include using a final class or a non-visible class; nested exception is org.springframework.cglib.core.CodeGenerationException: java.lang.reflect.InvocationTargetException-->null
2019-06-25 18:14:06,631 [WARN ] localhost-startStop-1 org.apache.catalina.loader.WebappClassLoaderBase:DirectJDKLog.java:180- The web application [ROOT] appears to have started a thread named [Druid-ConnectionPool-Create-1457476048] but has failed to stop it. This is very likely to create a memory leak. Stack trace of thread:
sun.misc.Unsafe.park(Native Method)
java.util.concurrent.locks.LockSupport.park(LockSupport.java:175)
java.util.concurrent.locks.AbstractQueuedSynchronizer$ConditionObject.await(AbstractQueuedSynchronizer.java:2039)
com.alibaba.druid.pool.DruidDataSource$CreateConnectionThread.run(DruidDataSource.java:2441)
2019-06-25 18:14:06,631 [WARN ] localhost-startStop-1 org.apache.catalina.loader.WebappClassLoaderBase:DirectJDKLog.java:180- The web application [ROOT] appears to have started a thread named [Druid-ConnectionPool-Destroy-1457476048] but has failed to stop it. This is very likely to create a memory leak. Stack trace of thread:
java.lang.Thread.sleep(Native Method)
com.alibaba.druid.pool.DruidDataSource$DestroyConnectionThread.run(DruidDataSource.java:2538)
2019-06-25 18:14:06,634 [WARN ] restartedMain org.springframework.boot.web.servlet.context.AnnotationConfigServletWebServerApplicationContext:AbstractApplicationContext.java:556- Exception encountered during context initialization - cancelling refresh attempt: org.springframework.context.ApplicationContextException: Unable to start web server; nested exception is org.springframework.boot.web.server.WebServerException: Unable to start embedded Tomcat
2019-06-25 18:14:06,648 [ERROR ] restartedMain org.springframework.boot.SpringApplication:SpringApplication.java:837- Application run failed
org.springframework.context.ApplicationContextException: Unable to start web server; nested exception is org.springframework.boot.web.server.WebServerException: Unable to start embedded Tomcat
at org.springframework.boot.web.servlet.context.ServletWebServerApplicationContext.onRefresh(ServletWebServerApplicationContext.java:155)
at org.springframework.context.support.AbstractApplicationContext.refresh(AbstractApplicationContext.java:542)
at org.springframework.boot.web.servlet.context.ServletWebServerApplicationContext.refresh(ServletWebServerApplicationContext.java:140)
at org.springframework.boot.SpringApplication.refresh(SpringApplication.java:754)
at org.springframework.boot.SpringApplication.refreshContext(SpringApplication.java:386)
at org.springframework.boot.SpringApplication.run(SpringApplication.java:307)
at org.springframework.boot.SpringApplication.run(SpringApplication.java:1242)
at org.springframework.boot.SpringApplication.run(SpringApplication.java:1230)
at com.ocean.vehicle.OceanVehicleServiceApplication.main(OceanVehicleServiceApplication.java:28)
at sun.reflect.NativeMethodAccessorImpl.invoke0(Native Method)
at sun.reflect.NativeMethodAccessorImpl.invoke(NativeMethodAccessorImpl.java:62)
at sun.reflect.DelegatingMethodAccessorImpl.invoke(DelegatingMethodAccessorImpl.java:43)
at java.lang.reflect.Method.invoke(Method.java:498)
at org.springframework.boot.devtools.restart.RestartLauncher.run(RestartLauncher.java:49)
Caused by: org.springframework.boot.web.server.WebServerException: Unable to start embedded Tomcat
at org.springframework.boot.web.embedded.tomcat.TomcatWebServer.initialize(TomcatWebServer.java:126)
at org.springframework.boot.web.embedded.tomcat.TomcatWebServer.(TomcatWebServer.java:86)
at org.springframework.boot.web.embedded.tomcat.TomcatServletWebServerFactory.getTomcatWebServer(TomcatServletWebServerFactory.java:413)
at org.springframework.boot.web.embedded.tomcat.TomcatServletWebServerFactory.getWebServer(TomcatServletWebServerFactory.java:174)
at org.springframework.boot.web.servlet.context.ServletWebServerApplicationContext.createWebServer(ServletWebServerApplicationContext.java:179)
at org.springframework.boot.web.servlet.context.ServletWebServerApplicationContext.onRefresh(ServletWebServerApplicationContext.java:152)
... 13 common frames omitted
Caused by: org.springframework.beans.factory.BeanCreationException: Error creating bean with name 'servletEndpointRegistrar' defined in class path resource [org/springframework/boot/actuate/autoconfigure/endpoint/web/ServletEndpointManagementContextConfiguration$WebMvcServletEndpointManagementContextConfiguration.class]: Bean instantiation via factory method failed; nested exception is org.springframework.beans.BeanInstantiationException: Failed to instantiate [org.springframework.boot.actuate.endpoint.web.ServletEndpointRegistrar]: Factory method 'servletEndpointRegistrar' threw exception; nested exception is org.springframework.beans.factory.BeanCreationException: Error creating bean with name 'healthEndpoint' defined in class path resource [org/springframework/boot/actuate/autoconfigure/health/HealthEndpointConfiguration.class]: Bean instantiation via factory method failed; nested exception is org.springframework.beans.BeanInstantiationException: Failed to instantiate [org.springframework.boot.actuate.health.HealthEndpoint]: Factory method 'healthEndpoint' threw exception; nested exception is org.springframework.beans.factory.BeanCreationException: Error creating bean with name 'org.springframework.boot.actuate.autoconfigure.jdbc.DataSourceHealthIndicatorAutoConfiguration': Bean instantiation via constructor failed; nested exception is org.springframework.beans.BeanInstantiationException: Failed to instantiate [org.springframework.boot.actuate.autoconfigure.jdbc.DataSourceHealthIndicatorAutoConfiguration$$EnhancerBySpringCGLIB$$8e311d64]: Constructor threw exception; nested exception is org.springframework.beans.factory.BeanCreationException: Error creating bean with name 'dataSource' defined in class path resource [com/alibaba/druid/spring/boot/autoconfigure/DruidDataSourceAutoConfigure.class]: Initialization of bean failed; nested exception is org.springframework.aop.framework.AopConfigException: Could not generate CGLIB subclass of class com.alibaba.druid.spring.boot.autoconfigure.DruidDataSourceWrapper: Common causes of this problem include using a final class or a non-visible class; nested exception is org.springframework.cglib.core.CodeGenerationException: java.lang.reflect.InvocationTargetException-->null
at org.springframework.beans.factory.support.ConstructorResolver.instantiateUsingFactoryMethod(ConstructorResolver.java:591)
at org.springframework.beans.factory.support.AbstractAutowireCapableBeanFactory.instantiateUsingFactoryMethod(AbstractAutowireCapableBeanFactory.java:1246)
at org.springframework.beans.factory.support.AbstractAutowireCapableBeanFactory.createBeanInstance(AbstractAutowireCapableBeanFactory.java:1096)
at org.springframework.beans.factory.support.AbstractAutowireCapableBeanFactory.doCreateBean(AbstractAutowireCapableBeanFactory.java:535)
at org.springframework.beans.factory.support.AbstractAutowireCapableBeanFactory.createBean(AbstractAutowireCapableBeanFactory.java:495)
at org.springframework.beans.factory.support.AbstractBeanFactory.lambda$doGetBean$0(AbstractBeanFactory.java:317)
at org.springframework.beans.factory.support.DefaultSingletonBeanRegistry.getSingleton(DefaultSingletonBeanRegistry.java:222)
at org.springframework.beans.factory.support.AbstractBeanFactory.doGetBean(AbstractBeanFactory.java:315)
at org.springframework.beans.factory.support.AbstractBeanFactory.getBean(AbstractBeanFactory.java:204)
at org.springframework.boot.web.servlet.ServletContextInitializerBeans.getOrderedBeansOfType(ServletContextInitializerBeans.java:226)
at org.springframework.boot.web.servlet.ServletContextInitializerBeans.getOrderedBeansOfType(ServletContextInitializerBeans.java:214)
at org.springframework.boot.web.servlet.ServletContextInitializerBeans.addServletContextInitializerBeans(ServletContextInitializerBeans.java:91)
at org.springframework.boot.web.servlet.ServletContextInitializerBeans.(ServletContextInitializerBeans.java:80)
at org.springframework.boot.web.servlet.context.ServletWebServerApplicationContext.getServletContextInitializerBeans(ServletWebServerApplicationContext.java:250)
at org.springframework.boot.web.servlet.context.ServletWebServerApplicationContext.selfInitialize(ServletWebServerApplicationContext.java:237)
at org.springframework.boot.web.embedded.tomcat.TomcatStarter.onStartup(TomcatStarter.java:54)
at org.apache.catalina.core.StandardContext.startInternal(StandardContext.java:5245)
at org.apache.catalina.util.LifecycleBase.start(LifecycleBase.java:150)
at org.apache.catalina.core.ContainerBase$StartChild.call(ContainerBase.java:1420)
at org.apache.catalina.core.ContainerBase$StartChild.call(ContainerBase.java:1410)
at java.util.concurrent.FutureTask.run(FutureTask.java:266)
at java.util.concurrent.ThreadPoolExecutor.runWorker(ThreadPoolExecutor.java:1149)
at java.util.concurrent.ThreadPoolExecutor$Worker.run(ThreadPoolExecutor.java:624)
at java.lang.Thread.run(Thread.java:748)
Caused by: org.springframework.beans.BeanInstantiationException: Failed to instantiate [org.springframework.boot.actuate.endpoint.web.ServletEndpointRegistrar]: Factory method 'servletEndpointRegistrar' threw exception; nested exception is org.springframework.beans.factory.BeanCreationException: Error creating bean with name 'healthEndpoint' defined in class path resource [org/springframework/boot/actuate/autoconfigure/health/HealthEndpointConfiguration.class]: Bean instantiation via factory method failed; nested exception is org.springframework.beans.BeanInstantiationException: Failed to instantiate [org.springframework.boot.actuate.health.HealthEndpoint]: Factory method 'healthEndpoint' threw exception; nested exception is org.springframework.beans.factory.BeanCreationException: Error creating bean with name 'org.springframework.boot.actuate.autoconfigure.jdbc.DataSourceHealthIndicatorAutoConfiguration': Bean instantiation via constructor failed; nested exception is org.springframework.beans.BeanInstantiationException: Failed to instantiate [org.springframework.boot.actuate.autoconfigure.jdbc.DataSourceHealthIndicatorAutoConfiguration$$EnhancerBySpringCGLIB$$8e311d64]: Constructor threw exception; nested exception is org.springframework.beans.factory.BeanCreationException: Error creating bean with name 'dataSource' defined in class path resource [com/alibaba/druid/spring/boot/autoconfigure/DruidDataSourceAutoConfigure.class]: Initialization of bean failed; nested exception is org.springframework.aop.framework.AopConfigException: Could not generate CGLIB subclass of class com.alibaba.druid.spring.boot.autoconfigure.DruidDataSourceWrapper: Common causes of this problem include using a final class or a non-visible class; nested exception is org.springframework.cglib.core.CodeGenerationException: java.lang.reflect.InvocationTargetException-->null
at org.springframework.beans.factory.support.SimpleInstantiationStrategy.instantiate(SimpleInstantiationStrategy.java:185)
at org.springframework.beans.factory.support.ConstructorResolver.instantiateUsingFactoryMethod(ConstructorResolver.java:583)
... 23 common frames omitted
Caused by: org.springframework.beans.factory.BeanCreationException: Error creating bean with name 'healthEndpoint' defined in class path resource [org/springframework/boot/actuate/autoconfigure/health/HealthEndpointConfiguration.class]: Bean instantiation via factory method failed; nested exception is org.springframework.beans.BeanInstantiationException: Failed to instantiate [org.springframework.boot.actuate.health.HealthEndpoint]: Factory method 'healthEndpoint' threw exception; nested exception is org.springframework.beans.factory.BeanCreationException: Error creating bean with name 'org.springframework.boot.actuate.autoconfigure.jdbc.DataSourceHealthIndicatorAutoConfiguration': Bean instantiation via constructor failed; nested exception is org.springframework.beans.BeanInstantiationException: Failed to instantiate [org.springframework.boot.actuate.autoconfigure.jdbc.DataSourceHealthIndicatorAutoConfiguration$$EnhancerBySpringCGLIB$$8e311d64]: Constructor threw exception; nested exception is org.springframework.beans.factory.BeanCreationException: Error creating bean with name 'dataSource' defined in class path resource [com/alibaba/druid/spring/boot/autoconfigure/DruidDataSourceAutoConfigure.class]: Initialization of bean failed; nested exception is org.springframework.aop.framework.AopConfigException: Could not generate CGLIB subclass of class com.alibaba.druid.spring.boot.autoconfigure.DruidDataSourceWrapper: Common causes of this problem include using a final class or a non-visible class; nested exception is org.springframework.cglib.core.CodeGenerationException: java.lang.reflect.InvocationTargetException-->null
at org.springframework.beans.factory.support.ConstructorResolver.instantiateUsingFactoryMethod(ConstructorResolver.java:591)
at org.springframework.beans.factory.support.AbstractAutowireCapableBeanFactory.instantiateUsingFactoryMethod(AbstractAutowireCapableBeanFactory.java:1246)
at org.springframework.beans.factory.support.AbstractAutowireCapableBeanFactory.createBeanInstance(AbstractAutowireCapableBeanFactory.java:1096)
at org.springframework.beans.factory.support.AbstractAutowireCapableBeanFactory.doCreateBean(AbstractAutowireCapableBeanFactory.java:535)
at org.springframework.beans.factory.support.AbstractAutowireCapableBeanFactory.createBean(AbstractAutowireCapableBeanFactory.java:495)
at org.springframework.beans.factory.support.AbstractBeanFactory.lambda$doGetBean$0(AbstractBeanFactory.java:317)
at org.springframework.beans.factory.support.DefaultSingletonBeanRegistry.getSingleton(DefaultSingletonBeanRegistry.java:222)
at org.springframework.beans.factory.support.AbstractBeanFactory.doGetBean(AbstractBeanFactory.java:315)
at org.springframework.beans.factory.support.AbstractBeanFactory.getBean(AbstractBeanFactory.java:199)
at org.springframework.context.support.AbstractApplicationContext.getBean(AbstractApplicationContext.java:1087)
at org.springframework.boot.actuate.endpoint.annotation.EndpointDiscoverer.createEndpointBean(EndpointDiscoverer.java:144)
at org.springframework.boot.actuate.endpoint.annotation.EndpointDiscoverer.createEndpointBeans(EndpointDiscoverer.java:133)
at org.springframework.boot.actuate.endpoint.annotation.EndpointDiscoverer.discoverEndpoints(EndpointDiscoverer.java:123)
at org.springframework.boot.actuate.endpoint.annotation.EndpointDiscoverer.getEndpoints(EndpointDiscoverer.java:117)
at org.springframework.boot.actuate.autoconfigure.endpoint.web.ServletEndpointManagementContextConfiguration$WebMvcServletEndpointManagementContextConfiguration.servletEndpointRegistrar(ServletEndpointManagementContextConfiguration.java:75)
at org.springframework.boot.actuate.autoconfigure.endpoint.web.ServletEndpointManagementContextConfiguration$WebMvcServletEndpointManagementContextConfiguration$$EnhancerBySpringCGLIB$$d58123b9.CGLIB$servletEndpointRegistrar$0()
at org.springframework.boot.actuate.autoconfigure.endpoint.web.ServletEndpointManagementContextConfiguration$WebMvcServletEndpointManagementContextConfiguration$$EnhancerBySpringCGLIB$$d58123b9$$FastClassBySpringCGLIB$$e40ba365.invoke()
at org.springframework.cglib.proxy.MethodProxy.invokeSuper(MethodProxy.java:228)
at org.springframework.context.annotation.ConfigurationClassEnhancer$BeanMethodInterceptor.intercept(ConfigurationClassEnhancer.java:365)
at org.springframework.boot.actuate.autoconfigure.endpoint.web.ServletEndpointManagementContextConfiguration$WebMvcServletEndpointManagementContextConfiguration$$EnhancerBySpringCGLIB$$d58123b9.servletEndpointRegistrar()
at sun.reflect.NativeMethodAccessorImpl.invoke0(Native Method)
at sun.reflect.NativeMethodAccessorImpl.invoke(NativeMethodAccessorImpl.java:62)
at sun.reflect.DelegatingMethodAccessorImpl.invoke(DelegatingMethodAccessorImpl.java:43)
at java.lang.reflect.Method.invoke(Method.java:498)
at org.springframework.beans.factory.support.SimpleInstantiationStrategy.instantiate(SimpleInstantiationStrategy.java:154)
... 24 common frames omitted
Caused by: org.springframework.beans.BeanInstantiationException: Failed to instantiate [org.springframework.boot.actuate.health.HealthEndpoint]: Factory method 'healthEndpoint' threw exception; nested exception is org.springframework.beans.factory.BeanCreationException: Error creating bean with name 'org.springframework.boot.actuate.autoconfigure.jdbc.DataSourceHealthIndicatorAutoConfiguration': Bean instantiation via constructor failed; nested exception is org.springframework.beans.BeanInstantiationException: Failed to instantiate [org.springframework.boot.actuate.autoconfigure.jdbc.DataSourceHealthIndicatorAutoConfiguration$$EnhancerBySpringCGLIB$$8e311d64]: Constructor threw exception; nested exception is org.springframework.beans.factory.BeanCreationException: Error creating bean with name 'dataSource' defined in class path resource [com/alibaba/druid/spring/boot/autoconfigure/DruidDataSourceAutoConfigure.class]: Initialization of bean failed; nested exception is org.springframework.aop.framework.AopConfigException: Could not generate CGLIB subclass of class com.alibaba.druid.spring.boot.autoconfigure.DruidDataSourceWrapper: Common causes of this problem include using a final class or a non-visible class; nested exception is org.springframework.cglib.core.CodeGenerationException: java.lang.reflect.InvocationTargetException-->null
at org.springframework.beans.factory.support.SimpleInstantiationStrategy.instantiate(SimpleInstantiationStrategy.java:185)
at org.springframework.beans.factory.support.ConstructorResolver.instantiateUsingFactoryMethod(ConstructorResolver.java:583)
... 48 common frames omitted
Caused by: org.springframework.beans.factory.BeanCreationException: Error creating bean with name 'org.springframework.boot.actuate.autoconfigure.jdbc.DataSourceHealthIndicatorAutoConfiguration': Bean instantiation via constructor failed; nested exception is org.springframework.beans.BeanInstantiationException: Failed to instantiate [org.springframework.boot.actuate.autoconfigure.jdbc.DataSourceHealthIndicatorAutoConfiguration$$EnhancerBySpringCGLIB$$8e311d64]: Constructor threw exception; nested exception is org.springframework.beans.factory.BeanCreationException: Error creating bean with name 'dataSource' defined in class path resource [com/alibaba/druid/spring/boot/autoconfigure/DruidDataSourceAutoConfigure.class]: Initialization of bean failed; nested exception is org.springframework.aop.framework.AopConfigException: Could not generate CGLIB subclass of class com.alibaba.druid.spring.boot.autoconfigure.DruidDataSourceWrapper: Common causes of this problem include using a final class or a non-visible class; nested exception is org.springframework.cglib.core.CodeGenerationException: java.lang.reflect.InvocationTargetException-->null
at org.springframework.beans.factory.support.ConstructorResolver.autowireConstructor(ConstructorResolver.java:283)
at org.springframework.beans.factory.support.AbstractAutowireCapableBeanFactory.autowireConstructor(AbstractAutowireCapableBeanFactory.java:1266)
at org.springframework.beans.factory.support.AbstractAutowireCapableBeanFactory.createBeanInstance(AbstractAutowireCapableBeanFactory.java:1123)
at org.springframework.beans.factory.support.AbstractAutowireCapableBeanFactory.doCreateBean(AbstractAutowireCapableBeanFactory.java:535)
at org.springframework.beans.factory.support.AbstractAutowireCapableBeanFactory.createBean(AbstractAutowireCapableBeanFactory.java:495)
at org.springframework.beans.factory.support.AbstractBeanFactory.lambda$doGetBean$0(AbstractBeanFactory.java:317)
at org.springframework.beans.factory.support.DefaultSingletonBeanRegistry.getSingleton(DefaultSingletonBeanRegistry.java:222)
at org.springframework.beans.factory.support.AbstractBeanFactory.doGetBean(AbstractBeanFactory.java:315)
at org.springframework.beans.factory.support.AbstractBeanFactory.getBean(AbstractBeanFactory.java:199)
at org.springframework.beans.factory.support.ConstructorResolver.instantiateUsingFactoryMethod(ConstructorResolver.java:373)
at org.springframework.beans.factory.support.AbstractAutowireCapableBeanFactory.instantiateUsingFactoryMethod(AbstractAutowireCapableBeanFactory.java:1246)
at org.springframework.beans.factory.support.AbstractAutowireCapableBeanFactory.createBeanInstance(AbstractAutowireCapableBeanFactory.java:1096)
at org.springframework.beans.factory.support.AbstractAutowireCapableBeanFactory.doCreateBean(AbstractAutowireCapableBeanFactory.java:535)
at org.springframework.beans.factory.support.AbstractAutowireCapableBeanFactory.createBean(AbstractAutowireCapableBeanFactory.java:495)
at org.springframework.beans.factory.support.AbstractBeanFactory.lambda$doGetBean$0(AbstractBeanFactory.java:317)
at org.springframework.beans.factory.support.DefaultSingletonBeanRegistry.getSingleton(DefaultSingletonBeanRegistry.java:222)
at org.springframework.beans.factory.support.AbstractBeanFactory.doGetBean(AbstractBeanFactory.java:315)
at org.springframework.beans.factory.support.AbstractBeanFactory.getBean(AbstractBeanFactory.java:199)
at org.springframework.beans.factory.support.DefaultListableBeanFactory.getBeansOfType(DefaultListableBeanFactory.java:514)
at org.springframework.beans.factory.support.DefaultListableBeanFactory.getBeansOfType(DefaultListableBeanFactory.java:502)
at org.springframework.context.support.AbstractApplicationContext.getBeansOfType(AbstractApplicationContext.java:1196)
at org.springframework.boot.actuate.autoconfigure.health.HealthIndicatorBeansComposite.get(HealthIndicatorBeansComposite.java:46)
at org.springframework.boot.actuate.autoconfigure.health.HealthEndpointConfiguration.healthEndpoint(HealthEndpointConfiguration.java:38)
at org.springframework.boot.actuate.autoconfigure.health.HealthEndpointConfiguration$$EnhancerBySpringCGLIB$$3bed81c1.CGLIB$healthEndpoint$0()
at org.springframework.boot.actuate.autoconfigure.health.HealthEndpointConfiguration$$EnhancerBySpringCGLIB$$3bed81c1$$FastClassBySpringCGLIB$$9f90890.invoke()
at org.springframework.cglib.proxy.MethodProxy.invokeSuper(MethodProxy.java:228)
at org.springframework.context.annotation.ConfigurationClassEnhancer$BeanMethodInterceptor.intercept(ConfigurationClassEnhancer.java:365)
at org.springframework.boot.actuate.autoconfigure.health.HealthEndpointConfiguration$$EnhancerBySpringCGLIB$$3bed81c1.healthEndpoint()
at sun.reflect.NativeMethodAccessorImpl.invoke0(Native Method)
at sun.reflect.NativeMethodAccessorImpl.invoke(NativeMethodAccessorImpl.java:62)
at sun.reflect.DelegatingMethodAccessorImpl.invoke(DelegatingMethodAccessorImpl.java:43)
at java.lang.reflect.Method.invoke(Method.java:498)
at org.springframework.beans.factory.support.SimpleInstantiationStrategy.instantiate(SimpleInstantiationStrategy.java:154)
... 49 common frames omitted
Caused by: org.springframework.beans.BeanInstantiationException: Failed to instantiate [org.springframework.boot.actuate.autoconfigure.jdbc.DataSourceHealthIndicatorAutoConfiguration$$EnhancerBySpringCGLIB$$8e311d64]: Constructor threw exception; nested exception is org.springframework.beans.factory.BeanCreationException: Error creating bean with name 'dataSource' defined in class path resource [com/alibaba/druid/spring/boot/autoconfigure/DruidDataSourceAutoConfigure.class]: Initialization of bean failed; nested exception is org.springframework.aop.framework.AopConfigException: Could not generate CGLIB subclass of class com.alibaba.druid.spring.boot.autoconfigure.DruidDataSourceWrapper: Common causes of this problem include using a final class or a non-visible class; nested exception is org.springframework.cglib.core.CodeGenerationException: java.lang.reflect.InvocationTargetException-->null
at org.springframework.beans.BeanUtils.instantiateClass(BeanUtils.java:182)
at org.springframework.beans.factory.support.SimpleInstantiationStrategy.instantiate(SimpleInstantiationStrategy.java:117)
at org.springframework.beans.factory.support.ConstructorResolver.autowireConstructor(ConstructorResolver.java:276)
... 81 common frames omitted
Caused by: org.springframework.beans.factory.BeanCreationException: Error creating bean with name 'dataSource' defined in class path resource [com/alibaba/druid/spring/boot/autoconfigure/DruidDataSourceAutoConfigure.class]: Initialization of bean failed; nested exception is org.springframework.aop.framework.AopConfigException: Could not generate CGLIB subclass of class com.alibaba.druid.spring.boot.autoconfigure.DruidDataSourceWrapper: Common causes of this problem include using a final class or a non-visible class; nested exception is org.springframework.cglib.core.CodeGenerationException: java.lang.reflect.InvocationTargetException-->null
at org.springframework.beans.factory.support.AbstractAutowireCapableBeanFactory.doCreateBean(AbstractAutowireCapableBeanFactory.java:581)
at org.springframework.beans.factory.support.AbstractAutowireCapableBeanFactory.createBean(AbstractAutowireCapableBeanFactory.java:495)
at org.springframework.beans.factory.support.AbstractBeanFactory.lambda$doGetBean$0(AbstractBeanFactory.java:317)
at org.springframework.beans.factory.support.DefaultSingletonBeanRegistry.getSingleton(DefaultSingletonBeanRegistry.java:222)
at org.springframework.beans.factory.support.AbstractBeanFactory.doGetBean(AbstractBeanFactory.java:315)
at org.springframework.beans.factory.support.AbstractBeanFactory.getBean(AbstractBeanFactory.java:199)
at org.springframework.beans.factory.config.DependencyDescriptor.resolveCandidate(DependencyDescriptor.java:251)
at org.springframework.beans.factory.support.DefaultListableBeanFactory.addCandidateEntry(DefaultListableBeanFactory.java:1322)
at org.springframework.beans.factory.support.DefaultListableBeanFactory.findAutowireCandidates(DefaultListableBeanFactory.java:1288)
at org.springframework.beans.factory.support.DefaultListableBeanFactory.resolveMultipleBeans(DefaultListableBeanFactory.java:1215)
at org.springframework.beans.factory.support.DefaultListableBeanFactory.doResolveDependency(DefaultListableBeanFactory.java:1093)
at org.springframework.beans.factory.support.DefaultListableBeanFactory$DependencyObjectProvider.getIfAvailable(DefaultListableBeanFactory.java:1706)
at org.springframework.boot.actuate.autoconfigure.jdbc.DataSourceHealthIndicatorAutoConfiguration.(DataSourceHealthIndicatorAutoConfiguration.java:77)
at org.springframework.boot.actuate.autoconfigure.jdbc.DataSourceHealthIndicatorAutoConfiguration$$EnhancerBySpringCGLIB$$8e311d64.()
at sun.reflect.NativeConstructorAccessorImpl.newInstance0(Native Method)
at sun.reflect.NativeConstructorAccessorImpl.newInstance(NativeConstructorAccessorImpl.java:62)
at sun.reflect.DelegatingConstructorAccessorImpl.newInstance(DelegatingConstructorAccessorImpl.java:45)
at java.lang.reflect.Constructor.newInstance(Constructor.java:423)
at org.springframework.beans.BeanUtils.instantiateClass(BeanUtils.java:170)
... 83 common frames omitted
Caused by: org.springframework.aop.framework.AopConfigException: Could not generate CGLIB subclass of class com.alibaba.druid.spring.boot.autoconfigure.DruidDataSourceWrapper: Common causes of this problem include using a final class or a non-visible class; nested exception is org.springframework.cglib.core.CodeGenerationException: java.lang.reflect.InvocationTargetException-->null
at org.springframework.aop.framework.CglibAopProxy.getProxy(CglibAopProxy.java:208)
at org.springframework.aop.framework.ProxyFactory.getProxy(ProxyFactory.java:110)
at org.springframework.aop.framework.autoproxy.AbstractAutoProxyCreator.createProxy(AbstractAutoProxyCreator.java:473)
at org.springframework.aop.framework.autoproxy.AbstractAutoProxyCreator.wrapIfNecessary(AbstractAutoProxyCreator.java:355)
at org.springframework.aop.framework.autoproxy.AbstractAutoProxyCreator.postProcessAfterInitialization(AbstractAutoProxyCreator.java:304)
at org.springframework.beans.factory.support.AbstractAutowireCapableBeanFactory.applyBeanPostProcessorsAfterInitialization(AbstractAutowireCapableBeanFactory.java:431)
at org.springframework.beans.factory.support.AbstractAutowireCapableBeanFactory.initializeBean(AbstractAutowireCapableBeanFactory.java:1698)
at org.springframework.beans.factory.support.AbstractAutowireCapableBeanFactory.doCreateBean(AbstractAutowireCapableBeanFactory.java:573)
... 101 common frames omitted
Caused by: org.springframework.cglib.core.CodeGenerationException: java.lang.reflect.InvocationTargetException-->null
at org.springframework.cglib.core.AbstractClassGenerator.generate(AbstractClassGenerator.java:345)
at org.springframework.cglib.proxy.Enhancer.generate(Enhancer.java:492)
at org.springframework.cglib.core.AbstractClassGenerator$ClassLoaderData$3.apply(AbstractClassGenerator.java:93)
at org.springframework.cglib.core.AbstractClassGenerator$ClassLoaderData$3.apply(AbstractClassGenerator.java:91)
at org.springframework.cglib.core.internal.LoadingCache$2.call(LoadingCache.java:54)
at java.util.concurrent.FutureTask.run(FutureTask.java:266)
at org.springframework.cglib.core.internal.LoadingCache.createEntry(LoadingCache.java:61)
at org.springframework.cglib.core.internal.LoadingCache.get(LoadingCache.java:34)
at org.springframework.cglib.core.AbstractClassGenerator$ClassLoaderData.get(AbstractClassGenerator.java:116)
at org.springframework.cglib.core.AbstractClassGenerator.create(AbstractClassGenerator.java:291)
at org.springframework.cglib.proxy.Enhancer.createHelper(Enhancer.java:480)
at org.springframework.cglib.proxy.Enhancer.createClass(Enhancer.java:337)
at org.springframework.aop.framework.ObjenesisCglibAopProxy.createProxyClassAndInstance(ObjenesisCglibAopProxy.java:58)
at org.springframework.aop.framework.CglibAopProxy.getProxy(CglibAopProxy.java:205)
... 108 common frames omitted
Caused by: java.lang.reflect.InvocationTargetException: null
at sun.reflect.GeneratedMethodAccessor44.invoke(Unknown Source)
at sun.reflect.DelegatingMethodAccessorImpl.invoke(DelegatingMethodAccessorImpl.java:43)
at java.lang.reflect.Method.invoke(Method.java:498)
at org.springframework.cglib.core.ReflectUtils.defineClass(ReflectUtils.java:459)
at org.springframework.cglib.core.AbstractClassGenerator.generate(AbstractClassGenerator.java:336)
... 121 common frames omitted
Caused by: java.lang.IllegalAccessError: class com.alibaba.druid.spring.boot.autoconfigure.DruidDataSourceWrapper$$EnhancerBySpringCGLIB$$244f293f cannot access its superclass com.alibaba.druid.spring.boot.autoconfigure.DruidDataSourceWrapper
at java.lang.ClassLoader.defineClass1(Native Method)
at java.lang.ClassLoader.defineClass(ClassLoader.java:763)
... 126 common frames omitted


1个回答

Csdn user default icon
上传中...
上传图片
插入图片
抄袭、复制答案,以达到刷声望分或其他目的的行为,在CSDN问答是严格禁止的,一经发现立刻封号。是时候展现真正的技术了!
其他相关推荐
分布式tx-lcn5.0.2版本,测试遇到的问题
首先是debug 断点调试 5.0.2 tm和tc,tm正在创建事务组的时候,tc会进入到这个函数里面,并且会进入到 log.warn("Non lcn connection when clear transaction."); @Override public void clear(String groupId, int state, String unitId, String unitType) throws TransactionClearException { try { LcnConnectionProxy connectionProxy = globalContext.getLcnConnection(groupId); connectionProxy.notify(state); // todo notify exception } catch (TCGlobalContextException e) { log.warn("Non lcn connection when clear transaction."); } } 不知道这个过程是如何调用的,是否是超时。 tm里面可以设置dtxTime,tc不能设置?tc会读取tc的这个文件,但是这得修改tc的源码,然后打jar包修改。按着官网上说的,tm里面设置的时间会传到tc这边来,但是没看到。修改tm的配置文件并没有影响到tc。求解答。 public class TxClientConfig { public TxClientConfig() { this.dtxAspectOrder = 0; this.dtxTime = 30 * 1000; this.managerAddress = Collections.singletonList("127.0.0.1:8070"); } 。。。。。 }
lcn的Socket对外服务IP是内网ip,socket连接失败,怎么解决!!!!!
各位大神,大牛们,急求!!!!!!!!!! lcn的Socket对外服务IP是内网ip,socket连接失败,怎么解决!!!!!
caffe生成解决方案时出错
编译环境:win10 vs2017 15.5.6 boost_1_70_0 主要报错: Unknown compiler version - please run the configure tests and report the results 再次点生成解决方案时的主要报错: for each 语句不能在“std::array *”类型的变量上操作 ; “std::array”: 模板 参数太少 ; 无法打开文件“libboost_date_time-vc140-mt-gd-1_59.lib” 等等; 因为只能一条条复制,所以如有需要,可提供详细错误; 下面是重新生成解决方案的具体报错,有大佬来救救我吗,感激不尽!需要更详细信息可以直说。 报错:1>------ 已启动全部重新生成: 项目: libcaffe, 配置: Debug x64 ------ 1>ProtoCompile.cmd : Create proto temp directory "C:\Users\Kay Chow\Documents\caffe-master\windows\..\src\caffe\proto\temp" 1>ProtoCompile.cmd : Generating "C:\Users\Kay Chow\Documents\caffe-master\windows\..\src\caffe\proto\temp\caffe.pb.h" and "C:\Users\Kay Chow\Documents\caffe-master\windows\..\src\caffe\proto\temp\caffe.pb.cc" 1>ProtoCompile.cmd : Create proto include directory 1>子目录或文件 C:\Users\Kay Chow\Documents\caffe-master\windows\..\include\caffe\proto 已经存在。 1>ProtoCompile.cmd : Compare newly compiled caffe.pb.h with existing one 1>blob.cpp 1>common.cpp 1>data_reader.cpp 1>data_transformer.cpp 1>internal_thread.cpp 1>layer.cpp 1>absval_layer.cpp 1>accuracy_layer.cpp 1>Unknown compiler version - please run the configure tests and report the results 1>Unknown compiler version - please run the configure tests and report the results 1>Unknown compiler version - please run the configure tests and report the results 1>Unknown compiler version - please run the configure tests and report the results 1>Unknown compiler version - please run the configure tests and report the results 1>Unknown compiler version - please run the configure tests and report the results 1>Unknown compiler version - please run the configure tests and report the results 1>Unknown compiler version - please run the configure tests and report the results 1>argmax_layer.cpp 1>base_conv_layer.cpp 1>base_data_layer.cpp 1>Unknown compiler version - please run the configure tests and report the results 1>Unknown compiler version - please run the configure tests and report the results 1>Unknown compiler version - please run the configure tests and report the results 1>batch_norm_layer.cpp 1>Unknown compiler version - please run the configure tests and report the results 1>batch_reindex_layer.cpp 1>bias_layer.cpp 1>Unknown compiler version - please run the configure tests and report the results 1>Unknown compiler version - please run the configure tests and report the results 1>bnll_layer.cpp 1>box_annotator_ohem_layer.cpp 1>Unknown compiler version - please run the configure tests and report the results 1>concat_layer.cpp 1>contrastive_loss_layer.cpp 1>Unknown compiler version - please run the configure tests and report the results 1>Unknown compiler version - please run the configure tests and report the results 1>Unknown compiler version - please run the configure tests and report the results 1>conv_layer.cpp 1>Unknown compiler version - please run the configure tests and report the results 1>crop_layer.cpp 1>cudnn_conv_layer.cpp 1>cudnn_lcn_layer.cpp 1>cudnn_lrn_layer.cpp 1>cudnn_pooling_layer.cpp 1>Unknown compiler version - please run the configure tests and report the results 1>cudnn_relu_layer.cpp 1>cudnn_sigmoid_layer.cpp 1>cudnn_softmax_layer.cpp 1>cudnn_tanh_layer.cpp 1>data_layer.cpp 1>deconv_layer.cpp 1>dropout_layer.cpp 1>dummy_data_layer.cpp 1>eltwise_layer.cpp 1>elu_layer.cpp 1>Unknown compiler version - please run the configure tests and report the results 1>Unknown compiler version - please run the configure tests and report the results 1>Unknown compiler version - please run the configure tests and report the results 1>Unknown compiler version - please run the configure tests and report the results 1>Unknown compiler version - please run the configure tests and report the results 1>Unknown compiler version - please run the configure tests and report the results 1>embed_layer.cpp 1>Unknown compiler version - please run the configure tests and report the results 1>euclidean_loss_layer.cpp 1>Unknown compiler version - please run the configure tests and report the results 1>exp_layer.cpp 1>filter_layer.cpp 1>flatten_layer.cpp 1>hdf5_data_layer.cpp 1>Unknown compiler version - please run the configure tests and report the results 1>Unknown compiler version - please run the configure tests and report the results 1>hdf5_output_layer.cpp 1>Unknown compiler version - please run the configure tests and report the results 1>Unknown compiler version - please run the configure tests and report the results 1>Unknown compiler version - please run the configure tests and report the results 1>hinge_loss_layer.cpp 1>Unknown compiler version - please run the configure tests and report the results 1>im2col_layer.cpp 1>image_data_layer.cpp 1>infogain_loss_layer.cpp 1>inner_product_layer.cpp 1>Unknown compiler version - please run the configure tests and report the results 1>input_layer.cpp 1>Unknown compiler version - please run the configure tests and report the results 1>log_layer.cpp 1>loss_layer.cpp 1>Unknown compiler version - please run the configure tests and report the results 1>Unknown compiler version - please run the configure tests and report the results 1>Unknown compiler version - please run the configure tests and report the results 1>Unknown compiler version - please run the configure tests and report the results 1>Unknown compiler version - please run the configure tests and report the results 1>lrn_layer.cpp 1>Unknown compiler version - please run the configure tests and report the results 1>memory_data_layer.cpp 1>multinomial_logistic_loss_layer.cpp 1>mvn_layer.cpp 1>neuron_layer.cpp 1>Unknown compiler version - please run the configure tests and report the results 1>parameter_layer.cpp 1>Unknown compiler version - please run the configure tests and report the results 1>Unknown compiler version - please run the configure tests and report the results 1>pooling_layer.cpp 1>Unknown compiler version - please run the configure tests and report the results 1>Unknown compiler version - please run the configure tests and report the results 1>Unknown compiler version - please run the configure tests and report the results 1>power_layer.cpp 1>Unknown compiler version - please run the configure tests and report the results 1>prelu_layer.cpp 1>psroi_pooling_layer.cpp 1>reduction_layer.cpp 1>relu_layer.cpp 1>reshape_layer.cpp 1>scale_layer.cpp 1>sigmoid_cross_entropy_loss_layer.cpp 1>Unknown compiler version - please run the configure tests and report the results 1>Unknown compiler version - please run the configure tests and report the results 1>Unknown compiler version - please run the configure tests and report the results 1>Unknown compiler version - please run the configure tests and report the results 1>Unknown compiler version - please run the configure tests and report the results 1>Unknown compiler version - please run the configure tests and report the results 1>Unknown compiler version - please run the configure tests and report the results 1>sigmoid_layer.cpp 1>Unknown compiler version - please run the configure tests and report the results 1>silence_layer.cpp 1>slice_layer.cpp 1>smooth_l1_loss_layer.cpp 1>smooth_L1_loss_ohem_layer.cpp 1>Unknown compiler version - please run the configure tests and report the results 1>softmax_layer.cpp 1>Unknown compiler version - please run the configure tests and report the results 1>Unknown compiler version - please run the configure tests and report the results 1>softmax_loss_layer.cpp 1>Unknown compiler version - please run the configure tests and report the results 1>softmax_loss_ohem_layer.cpp 1>Unknown compiler version - please run the configure tests and report the results 1>split_layer.cpp 1>Unknown compiler version - please run the configure tests and report the results 1>Unknown compiler version - please run the configure tests and report the results 1>Unknown compiler version - please run the configure tests and report the results 1>spp_layer.cpp 1>tanh_layer.cpp 1>threshold_layer.cpp 1>tile_layer.cpp 1>window_data_layer.cpp 1>Unknown compiler version - please run the configure tests and report the results 1>Unknown compiler version - please run the configure tests and report the results 1>Unknown compiler version - please run the configure tests and report the results 1>Unknown compiler version - please run the configure tests and report the results 1>layer_factory.cpp 1>net.cpp 1>parallel.cpp 1>Unknown compiler version - please run the configure tests and report the results 1>Unknown compiler version - please run the configure tests and report the results 1>Unknown compiler version - please run the configure tests and report the results 1>Unknown compiler version - please run the configure tests and report the results 1>caffe.pb.cc 1>solver.cpp 1>adadelta_solver.cpp 1>adagrad_solver.cpp 1>Unknown compiler version - please run the configure tests and report the results 1>Unknown compiler version - please run the configure tests and report the results 1>Unknown compiler version - please run the configure tests and report the results 1>adam_solver.cpp 1>Unknown compiler version - please run the configure tests and report the results 1>nesterov_solver.cpp 1>Unknown compiler version - please run the configure tests and report the results 1>rmsprop_solver.cpp 1>sgd_solver.cpp 1>syncedmem.cpp 1>Unknown compiler version - please run the configure tests and report the results 1>Unknown compiler version - please run the configure tests and report the results 1>benchmark.cpp 1>Unknown compiler version - please run the configure tests and report the results 1>Unknown compiler version - please run the configure tests and report the results 1>blocking_queue.cpp 1>Unknown compiler version - please run the configure tests and report the results 1>cudnn.cpp 1>db.cpp 1>db_leveldb.cpp 1>Unknown compiler version - please run the configure tests and report the results 1>db_lmdb.cpp 1>Unknown compiler version - please run the configure tests and report the results 1>Unknown compiler version - please run the configure tests and report the results 1>hdf5.cpp 1>Unknown compiler version - please run the configure tests and report the results 1>im2col.cpp 1>insert_splits.cpp 1>io.cpp 1>Unknown compiler version - please run the configure tests and report the results 1>math_functions.cpp 1>signal_handler.cpp 1>Unknown compiler version - please run the configure tests and report the results 1>Unknown compiler version - please run the configure tests and report the results 1>Unknown compiler version - please run the configure tests and report the results 1>upgrade_proto.cpp 1>Unknown compiler version - please run the configure tests and report the results 1>Unknown compiler version - please run the configure tests and report the results 1>libcaffe.vcxproj -> C:\Users\Kay Chow\Documents\caffe-master\windows\..\Build\x64\Debug\libcaffe.lib 1>BinplaceCudaDependencies : CPU only build, don't copy cuda dependencies. 2>------ 已启动全部重新生成: 项目: caffe, 配置: Debug x64 ------ 3>------ 已启动全部重新生成: 项目: caffe.managed, 配置: Debug x64 ------ 4>------ 已启动全部重新生成: 项目: convert_cifar_data, 配置: Debug x64 ------ 5>------ 已启动全部重新生成: 项目: classification, 配置: Debug x64 ------ 6>------ 已启动全部重新生成: 项目: convert_mnist_data, 配置: Debug x64 ------ 7>------ 已启动全部重新生成: 项目: convert_mnist_siamese_data, 配置: Debug x64 ------ 8>------ 已启动全部重新生成: 项目: upgrade_net_proto_binary, 配置: Debug x64 ------ 9>------ 已启动全部重新生成: 项目: upgrade_net_proto_text, 配置: Debug x64 ------ 2>caffe.cpp 9>upgrade_net_proto_text.cpp 2>Unknown compiler version - please run the configure tests and report the results 4>convert_cifar_data.cpp 3>Stdafx.cpp 9>Unknown compiler version - please run the configure tests and report the results 5>classification.cpp 6>convert_mnist_data.cpp 7>convert_mnist_siamese_data.cpp 4>Unknown compiler version - please run the configure tests and report the results 5>Unknown compiler version - please run the configure tests and report the results 8>upgrade_net_proto_binary.cpp 6>Unknown compiler version - please run the configure tests and report the results 8>Unknown compiler version - please run the configure tests and report the results 7>Unknown compiler version - please run the configure tests and report the results 3>AssemblyInfo.cpp 3>caffelib.cpp 3>caffelib.cpp(61): error C2976: “std::array”: 模板 参数太少 3>D:\VS2017\VC\Tools\MSVC\14.12.25827\include\utility(474): note: 参见“std::array”的声明 3>caffelib.cpp(62): error C3699: “^”: 不能在类型“std::array”上使用此间接寻址 3>caffelib.cpp(62): note: 编译器将“^”替换为“*”以继续进行分析 3>caffelib.cpp(68): error C2976: “std::array”: 模板 参数太少 3>D:\VS2017\VC\Tools\MSVC\14.12.25827\include\utility(474): note: 参见“std::array”的声明 3>caffelib.cpp(68): error C3699: “^”: 不能在类型“std::array”上使用此间接寻址 3>caffelib.cpp(68): note: 编译器将“^”替换为“*”以继续进行分析 3>caffelib.cpp(69): error C3699: “^”: 不能在类型“std::array”上使用此间接寻址 3>caffelib.cpp(69): note: 编译器将“^”替换为“*”以继续进行分析 3>caffelib.cpp(127): error C2976: “std::array”: 模板 参数太少 3>D:\VS2017\VC\Tools\MSVC\14.12.25827\include\utility(474): note: 参见“std::array”的声明 3>caffelib.cpp(128): error C3699: “^”: 不能在类型“std::array”上使用此间接寻址 3>caffelib.cpp(128): note: 编译器将“^”替换为“*”以继续进行分析 3>caffelib.cpp(136): error C2976: “std::array”: 模板 参数太少 3>D:\VS2017\VC\Tools\MSVC\14.12.25827\include\utility(474): note: 参见“std::array”的声明 3>caffelib.cpp(136): error C3699: “^”: 不能在类型“std::array”上使用此间接寻址 3>caffelib.cpp(136): note: 编译器将“^”替换为“*”以继续进行分析 3>caffelib.cpp(137): error C3699: “^”: 不能在类型“std::array”上使用此间接寻址 3>caffelib.cpp(137): note: 编译器将“^”替换为“*”以继续进行分析 3>caffelib.cpp(64): error C2976: “std::array”: 模板 参数太少 3>D:\VS2017\VC\Tools\MSVC\14.12.25827\include\utility(474): note: 参见“std::array”的声明 3>caffelib.cpp(64): error C2027: 使用了未定义类型“std::array” 3>D:\VS2017\VC\Tools\MSVC\14.12.25827\include\utility(474): note: 参见“std::array”的声明 3>caffelib.cpp(64): error C3536: “outputs”: 初始化之前无法使用 3>caffelib.cpp(64): error C2109: 下标要求数组或指针类型 3>caffelib.cpp(65): error C2440: “return”: 无法从“int”转换为“std::array *” 3>caffelib.cpp(65): note: 从整型转换为指针类型要求 reinterpret_cast、C 样式转换或函数样式转换 3>caffelib.cpp(71): error C3285: for each 语句不能在“std::array *”类型的变量上操作 3>caffelib.cpp(72): error C2065: “name”: 未声明的标识符 3>caffelib.cpp(74): error C2976: “std::array”: 模板 参数太少 3>D:\VS2017\VC\Tools\MSVC\14.12.25827\include\utility(474): note: 参见“std::array”的声明 3>caffelib.cpp(74): error C3699: “^”: 不能在类型“std::array”上使用此间接寻址 3>caffelib.cpp(74): note: 编译器将“^”替换为“*”以继续进行分析 3>caffelib.cpp(74): error C2027: 使用了未定义类型“std::array” 3>D:\VS2017\VC\Tools\MSVC\14.12.25827\include\utility(474): note: 参见“std::array”的声明 3>caffelib.cpp(78): error C2976: “std::array”: 模板 参数太少 3>D:\VS2017\VC\Tools\MSVC\14.12.25827\include\utility(474): note: 参见“std::array”的声明 3>caffelib.cpp(78): error C2027: 使用了未定义类型“std::array” 3>D:\VS2017\VC\Tools\MSVC\14.12.25827\include\utility(474): note: 参见“std::array”的声明 3>caffelib.cpp(78): error C3536: “values”: 初始化之前无法使用 3>caffelib.cpp(78): error C2109: 下标要求数组或指针类型 3>caffelib.cpp(79): error C3536: “outputs”: 初始化之前无法使用 3>caffelib.cpp(79): error C2109: 下标要求数组或指针类型 3>caffelib.cpp(81): error C2440: “return”: 无法从“int”转换为“std::array *” 3>caffelib.cpp(81): note: 从整型转换为指针类型要求 reinterpret_cast、C 样式转换或函数样式转换 3>caffelib.cpp(132): error C2976: “std::array”: 模板 参数太少 3>D:\VS2017\VC\Tools\MSVC\14.12.25827\include\utility(474): note: 参见“std::array”的声明 3>caffelib.cpp(132): error C2027: 使用了未定义类型“std::array” 3>D:\VS2017\VC\Tools\MSVC\14.12.25827\include\utility(474): note: 参见“std::array”的声明 3>caffelib.cpp(132): error C3536: “outputs”: 初始化之前无法使用 3>caffelib.cpp(132): error C2109: 下标要求数组或指针类型 3>caffelib.cpp(133): error C2440: “return”: 无法从“int”转换为“std::array *” 3>caffelib.cpp(133): note: 从整型转换为指针类型要求 reinterpret_cast、C 样式转换或函数样式转换 3>caffelib.cpp(141): error C3285: for each 语句不能在“std::array *”类型的变量上操作 3>caffelib.cpp(142): error C2065: “name”: 未声明的标识符 3>caffelib.cpp(144): error C2976: “std::array”: 模板 参数太少 3>D:\VS2017\VC\Tools\MSVC\14.12.25827\include\utility(474): note: 参见“std::array”的声明 3>caffelib.cpp(144): error C3699: “^”: 不能在类型“std::array”上使用此间接寻址 3>caffelib.cpp(144): note: 编译器将“^”替换为“*”以继续进行分析 3>caffelib.cpp(144): error C2027: 使用了未定义类型“std::array” 3>D:\VS2017\VC\Tools\MSVC\14.12.25827\include\utility(474): note: 参见“std::array”的声明 3>caffelib.cpp(148): error C2976: “std::array”: 模板 参数太少 3>D:\VS2017\VC\Tools\MSVC\14.12.25827\include\utility(474): note: 参见“std::array”的声明 3>caffelib.cpp(148): error C2027: 使用了未定义类型“std::array” 3>D:\VS2017\VC\Tools\MSVC\14.12.25827\include\utility(474): note: 参见“std::array”的声明 3>caffelib.cpp(148): error C3536: “values”: 初始化之前无法使用 3>caffelib.cpp(148): error C2109: 下标要求数组或指针类型 3>caffelib.cpp(149): error C3536: “outputs”: 初始化之前无法使用 3>caffelib.cpp(149): error C2109: 下标要求数组或指针类型 3>caffelib.cpp(151): error C2440: “return”: 无法从“int”转换为“std::array *” 3>caffelib.cpp(151): note: 从整型转换为指针类型要求 reinterpret_cast、C 样式转换或函数样式转换 3>已完成生成项目“caffe.managed.vcxproj”的操作 - 失败。 4>LINK : fatal error LNK1104: 无法打开文件“libboost_thread-vc140-mt-gd-1_59.lib” 10>------ 已启动全部重新生成: 项目: upgrade_solver_proto_text, 配置: Debug x64 ------ 4>已完成生成项目“convert_cifar_data.vcxproj”的操作 - 失败。 6>LINK : fatal error LNK1104: 无法打开文件“libboost_thread-vc140-mt-gd-1_59.lib” 6>已完成生成项目“convert_mnist_data.vcxproj”的操作 - 失败。 10>upgrade_solver_proto_text.cpp 7>LINK : fatal error LNK1104: 无法打开文件“libboost_thread-vc140-mt-gd-1_59.lib” 7>已完成生成项目“convert_mnist_siamese_data.vcxproj”的操作 - 失败。 10>Unknown compiler version - please run the configure tests and report the results 9>LINK : fatal error LNK1104: 无法打开文件“libboost_date_time-vc140-mt-gd-1_59.lib” 9>已完成生成项目“upgrade_net_proto_text.vcxproj”的操作 - 失败。 8>LINK : fatal error LNK1104: 无法打开文件“libboost_date_time-vc140-mt-gd-1_59.lib” 8>已完成生成项目“upgrade_net_proto_binary.vcxproj”的操作 - 失败。 5>LINK : fatal error LNK1104: 无法打开文件“libboost_date_time-vc140-mt-gd-1_59.lib” 5>已完成生成项目“classification.vcxproj”的操作 - 失败。 2>LINK : fatal error LNK1104: 无法打开文件“libboost_date_time-vc140-mt-gd-1_59.lib” 2>已完成生成项目“caffe.vcxproj”的操作 - 失败。 11>------ 已启动全部重新生成: 项目: compute_image_mean, 配置: Debug x64 ------ 12>------ 已启动全部重新生成: 项目: convert_imageset, 配置: Debug x64 ------ 13>------ 已启动全部重新生成: 项目: extract_features, 配置: Debug x64 ------ 14>------ 已启动全部重新生成: 项目: test_all, 配置: Debug x64 ------ 15>------ 已启动全部重新生成: 项目: pycaffe, 配置: Debug x64 ------ 16>------ 已启动全部重新生成: 项目: matcaffe, 配置: Debug x64 ------ 15>Skipping project pycaffe, Python support is not enabled in CommonSettings.props. 16>Skipping project matcaffe, Matlab support is not enabled in CommonSettings.props. 12>convert_imageset.cpp 11>compute_image_mean.cpp 13>extract_features.cpp 14>test_accuracy_layer.cpp 14>test_argmax_layer.cpp 14>test_batch_norm_layer.cpp 14>test_batch_reindex_layer.cpp 14>test_benchmark.cpp 14>test_bias_layer.cpp 14>test_blob.cpp 14>test_caffe_main.cpp 14>Unknown compiler version - please run the configure tests and report the results 13>Unknown compiler version - please run the configure tests and report the results 12>Unknown compiler version - please run the configure tests and report the results 11>Unknown compiler version - please run the configure tests and report the results 14>Unknown compiler version - please run the configure tests and report the results 10>LINK : fatal error LNK1104: 无法打开文件“libboost_date_time-vc140-mt-gd-1_59.lib” 10>已完成生成项目“upgrade_solver_proto_text.vcxproj”的操作 - 失败。 14>Unknown compiler version - please run the configure tests and report the results 14>Unknown compiler version - please run the configure tests and report the results 14>Unknown compiler version - please run the configure tests and report the results 14>Unknown compiler version - please run the configure tests and report the results 14>Unknown compiler version - please run the configure tests and report the results 14>Unknown compiler version - please run the configure tests and report the results 11>LINK : fatal error LNK1104: 无法打开文件“libboost_filesystem-vc140-mt-gd-1_59.lib” 11>已完成生成项目“compute_image_mean.vcxproj”的操作 - 失败。 12>LINK : fatal error LNK1104: 无法打开文件“libboost_filesystem-vc140-mt-gd-1_59.lib” 12>已完成生成项目“convert_imageset.vcxproj”的操作 - 失败。 13>LINK : fatal error LNK1104: 无法打开文件“libboost_filesystem-vc140-mt-gd-1_59.lib” 13>已完成生成项目“extract_features.vcxproj”的操作 - 失败。 14>test_common.cpp 14>test_concat_layer.cpp 14>test_contrastive_loss_layer.cpp 14>test_convolution_layer.cpp 14>test_crop_layer.cpp 14>test_data_layer.cpp 14>Unknown compiler version - please run the configure tests and report the results 14>Unknown compiler version - please run the configure tests and report the results 14>Unknown compiler version - please run the configure tests and report the results 14>Unknown compiler version - please run the configure tests and report the results 14>Unknown compiler version - please run the configure tests and report the results 14>Unknown compiler version - please run the configure tests and report the results 14>test_data_transformer.cpp 14>Unknown compiler version - please run the configure tests and report the results 14>test_db.cpp 14>test_deconvolution_layer.cpp 14>Unknown compiler version - please run the configure tests and report the results 14>test_dummy_data_layer.cpp 14>test_eltwise_layer.cpp 14>Unknown compiler version - please run the configure tests and report the results 14>test_embed_layer.cpp 14>test_euclidean_loss_layer.cpp 14>test_filler.cpp 14>Unknown compiler version - please run the configure tests and report the results 14>Unknown compiler version - please run the configure tests and report the results 14>Unknown compiler version - please run the configure tests and report the results 14>Unknown compiler version - please run the configure tests and report the results 14>Unknown compiler version - please run the configure tests and report the results 14>test_filter_layer.cpp 14>Unknown compiler version - please run the configure tests and report the results 14>test_flatten_layer.cpp 14>test_gradient_based_solver.cpp 14>Unknown compiler version - please run the configure tests and report the results 14>test_hdf5data_layer.cpp 14>test_hdf5_output_layer.cpp 14>test_hinge_loss_layer.cpp 14>Unknown compiler version - please run the configure tests and report the results 14>test_im2col_layer.cpp 14>test_image_data_layer.cpp 14>Unknown compiler version - please run the configure tests and report the results 14>Unknown compiler version - please run the configure tests and report the results 14>Unknown compiler version - please run the configure tests and report the results 14>Unknown compiler version - please run the configure tests and report the results 14>Unknown compiler version - please run the configure tests and report the results 14>test_infogain_loss_layer.cpp 14>Unknown compiler version - please run the configure tests and report the results 14>test_inner_product_layer.cpp 14>Unknown compiler version - please run the configure tests and report the results 14>test_internal_thread.cpp 14>test_io.cpp 14>test_layer_factory.cpp 14>test_lrn_layer.cpp 14>Unknown compiler version - please run the configure tests and report the results 14>test_math_functions.cpp 14>Unknown compiler version - please run the configure tests and report the results 14>Unknown compiler version - please run the configure tests and report the results 14>Unknown compiler version - please run the configure tests and report the results 14>Unknown compiler version - please run the configure tests and report the results 14>test_maxpool_dropout_layers.cpp 14>Unknown compiler version - please run the configure tests and report the results 14>test_memory_data_layer.cpp 14>test_multinomial_logistic_loss_layer.cpp 14>test_mvn_layer.cpp 14>Unknown compiler version - please run the configure tests and report the results 14>Unknown compiler version - please run the configure tests and report the results 14>Unknown compiler version - please run the configure tests and report the results 14>test_net.cpp 14>test_neuron_layer.cpp 14>test_platform.cpp 14>test_pooling_layer.cpp 14>test_power_layer.cpp 14>Unknown compiler version - please run the configure tests and report the results 14>Unknown compiler version - please run the configure tests and report the results 14>Unknown compiler version - please run the configure tests and report the results 14>Unknown compiler version - please run the configure tests and report the results 14>test_protobuf.cpp 14>test_random_number_generator.cpp 14>Unknown compiler version - please run the configure tests and report the results 14>test_reduction_layer.cpp 14>c:\users\kay chow\documents\caffe-master\src\caffe\test\test_net.cpp(1010): error C2220: 警告被视为错误 - 没有生成“object”文件 14>c:\users\kay chow\documents\caffe-master\src\caffe\test\test_net.cpp(992): note: 编译 类 模板 成员函数 "void caffe::NetTest_TestLossWeightMidNet_Test<T>::TestBody(void)" 时 14> with 14> [ 14> T=Type 14> ] 14>c:\users\kay chow\documents\caffe-master\src\gtest\gtest.h(7341): note: 参见对正在编译的 类 模板 实例化 "caffe::NetTest_TestLossWeightMidNet_Test<T>" 的引用 14> with 14> [ 14> T=Type 14> ] (编译源文件 ..\..\src\caffe\test\test_net.cpp) 14>c:\users\kay chow\documents\caffe-master\src\gtest\gtest.h(7327): note: 编译 类 模板 成员函数 "bool testing::internal::TypeParameterizedTest<caffe::NetTest,testing::internal::TemplateSel<caffe::NetTest_TestLossWeightMidNet_Test>,caffe::gtest_type_params_NetTest_>::Register(const char *,const char *,const char *,int)" 时 (编译源文件 ..\..\src\caffe\test\test_net.cpp) 14>c:\users\kay chow\documents\caffe-master\src\caffe\test\test_net.cpp(992): note: 参见对正在编译的函数 模板 实例化“bool testing::internal::TypeParameterizedTest<caffe::NetTest,testing::internal::TemplateSel<caffe::NetTest_TestLossWeightMidNet_Test>,caffe::gtest_type_params_NetTest_>::Register(const char *,const char *,const char *,int)”的引用 14>c:\users\kay chow\documents\caffe-master\src\caffe\test\test_net.cpp(992): note: 参见对正在编译的 类 模板 实例化 "testing::internal::TypeParameterizedTest<caffe::NetTest,testing::internal::TemplateSel<caffe::NetTest_TestLossWeightMidNet_Test>,caffe::gtest_type_params_NetTest_>" 的引用 14>c:\users\kay chow\documents\caffe-master\src\caffe\test\test_net.cpp(1010): warning C4838: 从“double”转换到“Dtype”需要收缩转换 14>c:\users\kay chow\documents\caffe-master\src\caffe\test\test_net.cpp(961): warning C4838: 从“double”转换到“Dtype”需要收缩转换 14>c:\users\kay chow\documents\caffe-master\src\caffe\test\test_net.cpp(941): note: 编译 类 模板 成员函数 "void caffe::NetTest_TestLossWeight_Test<T>::TestBody(void)" 时 14> with 14> [ 14> T=Type 14> ] 14>c:\users\kay chow\documents\caffe-master\src\gtest\gtest.h(7341): note: 参见对正在编译的 类 模板 实例化 "caffe::NetTest_TestLossWeight_Test<T>" 的引用 14> with 14> [ 14> T=Type 14> ] (编译源文件 ..\..\src\caffe\test\test_net.cpp) 14>c:\users\kay chow\documents\caffe-master\src\gtest\gtest.h(7327): note: 编译 类 模板 成员函数 "bool testing::internal::TypeParameterizedTest<caffe::NetTest,testing::internal::TemplateSel<caffe::NetTest_TestLossWeight_Test>,caffe::gtest_type_params_NetTest_>::Register(const char *,const char *,const char *,int)" 时 (编译源文件 ..\..\src\caffe\test\test_net.cpp) 14>c:\users\kay chow\documents\caffe-master\src\caffe\test\test_net.cpp(941): note: 参见对正在编译的函数 模板 实例化“bool testing::internal::TypeParameterizedTest<caffe::NetTest,testing::internal::TemplateSel<caffe::NetTest_TestLossWeight_Test>,caffe::gtest_type_params_NetTest_>::Register(const char *,const char *,const char *,int)”的引用 14>c:\users\kay chow\documents\caffe-master\src\caffe\test\test_net.cpp(941): note: 参见对正在编译的 类 模板 实例化 "testing::internal::TypeParameterizedTest<caffe::NetTest,testing::internal::TemplateSel<caffe::NetTest_TestLossWeight_Test>,caffe::gtest_type_params_NetTest_>" 的引用 14>test_reshape_layer.cpp 14>Unknown compiler version - please run the configure tests and report the results 14>Unknown compiler version - please run the configure tests and report the results 14>Unknown compiler version - please run the configure tests and report the results 14>test_scale_layer.cpp 14>test_sigmoid_cross_entropy_loss_layer.cpp 14>test_slice_layer.cpp 14>test_softmax_layer.cpp 14>Unknown compiler version - please run the configure tests and report the results 14>Unknown compiler version - please run the configure tests and report the results 14>test_softmax_with_loss_layer.cpp 14>Unknown compiler version - please run the configure tests and report the results 14>Unknown compiler version - please run the configure tests and report the results 14>Unknown compiler version - please run the configure tests and report the results 14>test_solver.cpp 14>Unknown compiler version - please run the configure tests and report the results 14>test_solver_factory.cpp 14>test_split_layer.cpp 14>Unknown compiler version - please run the configure tests and report the results 14>test_spp_layer.cpp 14>Unknown compiler version - please run the configure tests and report the results 14>test_stochastic_pooling.cpp 14>test_syncedmem.cpp 14>test_tanh_layer.cpp 14>Unknown compiler version - please run the configure tests and report the results 14>test_threshold_layer.cpp 14>Unknown compiler version - please run the configure tests and report the results 14>Unknown compiler version - please run the configure tests and report the results 14>Unknown compiler version - please run the configure tests and report the results 14>Unknown compiler version - please run the configure tests and report the results 14>test_tile_layer.cpp 14>Unknown compiler version - please run the configure tests and report the results 14>test_upgrade_proto.cpp 14>test_util_blas.cpp 14>gtest-all.cpp 14>Unknown compiler version - please run the configure tests and report the results 14>已完成生成项目“test_all.vcxproj”的操作 - 失败。 ========== 全部重新生成: 成功 3 个,失败 13 个,跳过 0 个 ==========
求帮忙分析下Tomcat崩溃日志
``` # # There is insufficient memory for the Java Runtime Environment to continue. # Native memory allocation (malloc) failed to allocate 572522496 bytes for committing reserved memory. # Possible reasons: # The system is out of physical RAM or swap space # In 32 bit mode, the process size limit was hit # Possible solutions: # Reduce memory load on the system # Increase physical memory or swap space # Check if swap backing store is full # Use 64 bit Java on a 64 bit OS # Decrease Java heap size (-Xmx/-Xms) # Decrease number of Java threads # Decrease Java thread stack sizes (-Xss) # Set larger code cache with -XX:ReservedCodeCacheSize= # This output file may be truncated or incomplete. # # Out of Memory Error (os_linux.cpp:2756), pid=25208, tid=140304851973888 # # JRE version: Java(TM) SE Runtime Environment (7.0_80-b15) (build 1.7.0_80-b15) # Java VM: Java HotSpot(TM) 64-Bit Server VM (24.80-b11 mixed mode linux-amd64 compressed oops) # Failed to write core dump. Core dumps have been disabled. To enable core dumping, try "ulimit -c unlimited" before starting Java again # --------------- T H R E A D --------------- Current thread (0x00007f9b4c06a000): VMThread [stack: 0x00007f9b44ccb000,0x00007f9b44dcc000] [id=25214] Stack: [0x00007f9b44ccb000,0x00007f9b44dcc000], sp=0x00007f9b44dca1a0, free space=1020k Native frames: (J=compiled Java code, j=interpreted, Vv=VM code, C=native code) V [libjvm.so+0x9a320a] VMError::report_and_die()+0x2ea V [libjvm.so+0x498d3b] report_vm_out_of_memory(char const*, int, unsigned long, char const*)+0x9b V [libjvm.so+0x82191e] os::Linux::commit_memory_impl(char*, unsigned long, bool)+0xfe V [libjvm.so+0x821e69] os::pd_commit_memory(char*, unsigned long, unsigned long, bool)+0x29 V [libjvm.so+0x81bb6a] os::commit_memory(char*, unsigned long, unsigned long, bool)+0x2a V [libjvm.so+0x88d623] PSVirtualSpace::expand_by(unsigned long)+0x53 V [libjvm.so+0x87ca80] PSOldGen::expand(unsigned long)+0x170 V [libjvm.so+0x87cc8b] PSOldGen::resize(unsigned long)+0x1cb V [libjvm.so+0x885951] PSParallelCompact::invoke_no_policy(bool)+0x9b1 V [libjvm.so+0x88b8cd] PSScavenge::invoke()+0x1ad V [libjvm.so+0x843f40] ParallelScavengeHeap::failed_mem_allocate(unsigned long)+0x70 V [libjvm.so+0x9a4a97] VM_ParallelGCFailedAllocation::doit()+0x97 V [libjvm.so+0x9abf35] VM_Operation::evaluate()+0x55 V [libjvm.so+0x9aa2fa] VMThread::evaluate_operation(VM_Operation*)+0xba V [libjvm.so+0x9aa67e] VMThread::loop()+0x1ce V [libjvm.so+0x9aaaf0] VMThread::run()+0x70 V [libjvm.so+0x8238c8] java_start(Thread*)+0x108 VM_Operation (0x00007f9b360f5340): ParallelGCFailedAllocation, mode: safepoint, requested by thread 0x00007f9af2e2b800 --------------- P R O C E S S --------------- Java Threads: ( => current thread ) 0x00007f9ab8053800 JavaThread "pool-2-thread-10937" [_thread_blocked, id=20834, stack(0x00007f9aa5b9c000,0x00007f9aa5c9d000)] 0x00007f9ab809d000 JavaThread "pool-2-thread-10936" [_thread_blocked, id=20833, stack(0x00007f9aa6bac000,0x00007f9aa6cad000)] 0x00007f9b4c7c4800 JavaThread "pool-8-thread-5804" [_thread_blocked, id=19335, stack(0x00007f9aa81ee000,0x00007f9aa82ef000)] 0x00007f9b4c3e0000 JavaThread "pool-8-thread-5803" [_thread_blocked, id=18507, stack(0x00007f9b342a0000,0x00007f9b343a1000)] 0x00007f9b4c2c4000 JavaThread "MQTT Ping: GID_EDO_NOTICE@@@admin" [_thread_blocked, id=28435, stack(0x00007f9aa9a06000,0x00007f9aa9b07000)] 0x00007f9b4c485800 JavaThread "MQTT Call: GID_EDO_NOTICE@@@admin" [_thread_blocked, id=28434, stack(0x00007f9b081c0000,0x00007f9b082c1000)] 0x00007f9b4c428800 JavaThread "MQTT Snd: GID_EDO_NOTICE@@@admin" [_thread_blocked, id=28433, stack(0x00007f9aaa915000,0x00007f9aaaa16000)] 0x00007f9b4c81f800 JavaThread "MQTT Rec: GID_EDO_NOTICE@@@admin" [_thread_in_native, id=28432, stack(0x00007f9aa5798000,0x00007f9aa5899000)] 0x00007f9ad0101000 JavaThread "http-bio-8080-exec-34" daemon [_thread_blocked, id=20845, stack(0x00007f9aa72b3000,0x00007f9aa73b4000)] 0x00007f9ad00ff800 JavaThread "http-bio-8080-exec-33" daemon [_thread_blocked, id=20844, stack(0x00007f9aab01c000,0x00007f9aab11d000)] 0x00007f9ad00fc000 JavaThread "http-bio-8080-exec-30" daemon [_thread_blocked, id=20838, stack(0x00007f9aa9703000,0x00007f9aa9804000)] 0x00007f9ad00fb000 JavaThread "http-bio-8080-exec-29" daemon [_thread_blocked, id=20837, stack(0x00007f9aa92ff000,0x00007f9aa9400000)] 0x00007f9ad0110800 JavaThread "http-bio-8080-exec-28" daemon [_thread_blocked, id=20836, stack(0x00007f9aa8cf9000,0x00007f9aa8dfa000)] 0x00007f9ad010f800 JavaThread "http-bio-8080-exec-27" daemon [_thread_blocked, id=20832, stack(0x00007f9aaa814000,0x00007f9aaa915000)] 0x00007f9ad010e000 JavaThread "http-bio-8080-exec-26" daemon [_thread_blocked, id=20826, stack(0x00007f9aa87f4000,0x00007f9aa88f5000)] 0x00007f9ad010d800 JavaThread "http-bio-8080-exec-25" daemon [_thread_blocked, id=20825, stack(0x00007f9aa85f2000,0x00007f9aa86f3000)] 0x00007f9ad0077800 JavaThread "http-bio-8080-exec-24" daemon [_thread_blocked, id=20822, stack(0x00007f9aaa00c000,0x00007f9aaa10d000)] 0x00007f9ad00f0000 JavaThread "http-bio-8080-exec-23" daemon [_thread_blocked, id=20821, stack(0x00007f9aa8ffc000,0x00007f9aa90fd000)] 0x00007f9ad0075800 JavaThread "http-bio-8080-exec-22" daemon [_thread_blocked, id=20820, stack(0x00007f9aaa10d000,0x00007f9aaa20e000)] 0x00007f9af423f800 JavaThread "Java2D Disposer" daemon [_thread_blocked, id=28691, stack(0x00007f9aab7f8000,0x00007f9aab8f9000)] 0x00007f9af1c93800 JavaThread "taskExecutor-5" [_thread_blocked, id=28196, stack(0x00007f9aa9d09000,0x00007f9aa9e0a000)] 0x00007f9af2cef000 JavaThread "taskExecutor-4" [_thread_blocked, id=28195, stack(0x00007f9aa89f6000,0x00007f9aa8af7000)] 0x00007f9af2cee800 JavaThread "taskExecutor-3" [_thread_blocked, id=28194, stack(0x00007f9aaac18000,0x00007f9aaad19000)] 0x00007f9af3870000 JavaThread "taskExecutor-2" [_thread_blocked, id=26218, stack(0x00007f9aa9501000,0x00007f9aa9602000)] 0x00007f9af10db000 JavaThread "taskExecutor-1" [_thread_blocked, id=26216, stack(0x00007f9aaaf1b000,0x00007f9aab01c000)] 0x00007f9b4c4b1000 JavaThread "idle_connection_reaper" daemon [_thread_blocked, id=25553, stack(0x00007f9b3759a000,0x00007f9b3769b000)] 0x00007f9af40df800 JavaThread "HSF-AddressProfiler" daemon [_thread_blocked, id=25354, stack(0x00007f9b37499000,0x00007f9b3759a000)] 0x00007f9ae82ff800 JavaThread "HSF-Worker-2-thread-8" daemon [_thread_blocked, id=25334, stack(0x00007f9aab8f9000,0x00007f9aab9fa000)] 0x00007f9ad80ab800 JavaThread "HSF-Worker-2-thread-7" daemon [_thread_blocked, id=25333, stack(0x00007f9aab9fa000,0x00007f9aabafb000)] 0x00007f9ac003b800 JavaThread "HSF-Worker-2-thread-6" daemon [_thread_blocked, id=25332, stack(0x00007f9aabafb000,0x00007f9aabbfc000)] 0x00007f9aec03c000 JavaThread "HSF-Worker-2-thread-1" daemon [_thread_blocked, id=25331, stack(0x00007f9aabbfc000,0x00007f9aabcfd000)] 0x00007f9ab4054800 JavaThread "HSF-Worker-2-thread-3" daemon [_thread_blocked, id=25330, stack(0x00007f9aabcfd000,0x00007f9aabdfe000)] 0x00007f9af8098800 JavaThread "HSF-Worker-2-thread-4" daemon [_thread_blocked, id=25329, stack(0x00007f9aabdfe000,0x00007f9aabeff000)] 0x00007f9ac00d9000 JavaThread "HSF-Worker-2-thread-5" daemon [_thread_blocked, id=25328, stack(0x00007f9aabeff000,0x00007f9aac000000)] 0x00007f9abc136800 JavaThread "HSF-Worker-2-thread-2" daemon [_thread_blocked, id=25327, stack(0x00007f9b08061000,0x00007f9b08162000)] 0x00007f9ad0073800 JavaThread "http-bio-8080-exec-21" daemon [_thread_blocked, id=25324, stack(0x00007f9b084c3000,0x00007f9b085c4000)] 0x00007f9ad0071000 JavaThread "http-bio-8080-exec-20" daemon [_thread_blocked, id=25323, stack(0x00007f9b085c4000,0x00007f9b086c5000)] 0x00007f9ad006f000 JavaThread "http-bio-8080-exec-19" daemon [_thread_blocked, id=25322, stack(0x00007f9b086c5000,0x00007f9b087c6000)] 0x00007f9ad006a800 JavaThread "http-bio-8080-exec-17" daemon [_thread_blocked, id=25320, stack(0x00007f9b088c7000,0x00007f9b089c8000)] 0x00007f9ad0068800 JavaThread "http-bio-8080-exec-16" daemon [_thread_blocked, id=25319, stack(0x00007f9b089c8000,0x00007f9b08ac9000)] 0x00007f9ad0066800 JavaThread "http-bio-8080-exec-15" daemon [_thread_blocked, id=25317, stack(0x00007f9b08ac9000,0x00007f9b08bca000)] 0x00007f9ad0064800 JavaThread "http-bio-8080-exec-14" daemon [_thread_blocked, id=25316, stack(0x00007f9b08bca000,0x00007f9b08ccb000)] 0x00007f9ad0062800 JavaThread "http-bio-8080-exec-13" daemon [_thread_blocked, id=25315, stack(0x00007f9b08ccb000,0x00007f9b08dcc000)] 0x00007f9ad000a800 JavaThread "http-bio-8080-exec-12" daemon [_thread_blocked, id=25314, stack(0x00007f9b08dcc000,0x00007f9b08ecd000)] 0x00007f9ad0008800 JavaThread "http-bio-8080-exec-11" daemon [_thread_blocked, id=25313, stack(0x00007f9b08ecd000,0x00007f9b08fce000)] 0x00007f9b4c0d9000 JavaThread "http-bio-8080-AsyncTimeout" daemon [_thread_blocked, id=25312, stack(0x00007f9b08fce000,0x00007f9b090cf000)] 0x00007f9b4c0d7800 JavaThread "http-bio-8080-Acceptor-0" daemon [_thread_blocked, id=25311, stack(0x00007f9b090cf000,0x00007f9b091d0000)] 0x00007f9b4c0d4800 JavaThread "http-bio-8080-exec-10" daemon [_thread_blocked, id=25310, stack(0x00007f9b091d0000,0x00007f9b092d1000)] 0x00007f9b4c43e800 JavaThread "http-bio-8080-exec-7" daemon [_thread_blocked, id=25307, stack(0x00007f9b094d3000,0x00007f9b095d4000)] 0x00007f9b4c43c800 JavaThread "http-bio-8080-exec-6" daemon [_thread_blocked, id=25306, stack(0x00007f9b095d4000,0x00007f9b096d5000)] 0x00007f9b4c43a800 JavaThread "http-bio-8080-exec-5" daemon [_thread_blocked, id=25305, stack(0x00007f9b096d5000,0x00007f9b097d6000)] 0x00007f9b4c168800 JavaThread "http-bio-8080-exec-4" daemon [_thread_blocked, id=25304, stack(0x00007f9b37095000,0x00007f9b37196000)] 0x00007f9b4c166800 JavaThread "http-bio-8080-exec-3" daemon [_thread_blocked, id=25303, stack(0x00007f9b37196000,0x00007f9b37297000)] 0x00007f9b4c165000 JavaThread "http-bio-8080-exec-2" daemon [_thread_blocked, id=25302, stack(0x00007f9b37297000,0x00007f9b37398000)] 0x00007f9b4c163000 JavaThread "http-bio-8080-exec-1" daemon [_thread_blocked, id=25301, stack(0x00007f9b37398000,0x00007f9b37499000)] 0x00007f9b4c162800 JavaThread "ContainerBackgroundProcessor[StandardEngine[Catalina]]" daemon [_thread_blocked, id=25300, stack(0x00007f9b097d6000,0x00007f9b098d7000)] 0x00007f9af1ae3000 JavaThread "pool-7-thread-1" [_thread_blocked, id=25298, stack(0x00007f9b098d7000,0x00007f9b099d8000)] 0x00007f9af1ae0000 JavaThread "redisMessageListenerContainer-1" [_thread_blocked, id=25297, stack(0x00007f9b354eb000,0x00007f9b355ec000)] 0x00007f9af1589800 JavaThread "commons-pool-EvictionTimer" daemon [_thread_blocked, id=25296, stack(0x00007f9b099d8000,0x00007f9b09ad9000)] 0x00007f9b006a9000 JavaThread "ConfigClientNotifier" daemon [_thread_blocked, id=25291, stack(0x00007f9b3409e000,0x00007f9b3419f000)] 0x00007f9b1c023800 JavaThread "SocketConnectorIoProcessor-0.0" daemon [_thread_blocked, id=25289, stack(0x00007f9b3419f000,0x00007f9b342a0000)] 0x00007f9b00221000 JavaThread "PooledByteBufferExpirer-0" daemon [_thread_blocked, id=25287, stack(0x00007f9b343a1000,0x00007f9b344a2000)] 0x00007f9b00180000 JavaThread "com.taobao.remoting.TimerThread" daemon [_thread_blocked, id=25286, stack(0x00007f9b344a2000,0x00007f9b345a3000)] 0x00007f9ae804c000 JavaThread "HSF-RuntimeInfo-Publisher-7-thread-1" daemon [_thread_blocked, id=25285, stack(0x00007f9b345a3000,0x00007f9b346a4000)] 0x00007f9af0676800 JavaThread "com.taobao.config.client.timer" daemon [_thread_blocked, id=25284, stack(0x00007f9b346a4000,0x00007f9b347a5000)] 0x00007f9af3291000 JavaThread "ConfigClientWorker-Thread" daemon [_thread_blocked, id=25283, stack(0x00007f9b347a5000,0x00007f9b348a6000)] 0x00007f9af3985800 JavaThread "pool-4-thread-1" [_thread_blocked, id=25282, stack(0x00007f9b348a6000,0x00007f9b349a7000)] 0x00007f9af3982800 JavaThread "com.taobao.config.client.timer" daemon [_thread_blocked, id=25281, stack(0x00007f9b349a7000,0x00007f9b34aa8000)] 0x00007f9ae81e1800 JavaThread "HSF-Remoting-Timer-3-thread-1" daemon [_thread_blocked, id=25280, stack(0x00007f9b34aa8000,0x00007f9b34ba9000)] 0x00007f9af0f67800 JavaThread "HSF-AddressPool-Default-1-thread-1" daemon [_thread_blocked, id=25277, stack(0x00007f9b34be2000,0x00007f9b34ce3000)] 0x00007f9ad0006000 JavaThread "NacosConfigListener-ThreadPool-4" daemon [_thread_blocked, id=25276, stack(0x00007f9b34ce3000,0x00007f9b34de4000)] 0x00007f9ad4001000 JavaThread "NacosConfigListener-ThreadPool-3" daemon [_thread_blocked, id=25275, stack(0x00007f9b34de4000,0x00007f9b34ee5000)] 0x00007f9ad0004800 JavaThread "com.alibaba.nacos.client.Worker.longPullingfixed-10.201.199.104:8848-product" daemon [_thread_in_native, id=25274, stack(0x00007f9b34ee5000,0x00007f9b34fe6000)] 0x00007f9ad0002800 JavaThread "NacosConfigListener-ThreadPool-2" daemon [_thread_blocked, id=25273, stack(0x00007f9b34fe6000,0x00007f9b350e7000)] 0x00007f9ad0001800 JavaThread "NacosConfigListener-ThreadPool-1" daemon [_thread_blocked, id=25272, stack(0x00007f9b350e7000,0x00007f9b351e8000)] 0x00007f9ac4001800 JavaThread "com.alibaba.nacos.client.Worker.longPullingfixed-10.201.199.104:8848-product" daemon [_thread_blocked, id=25271, stack(0x00007f9b351e8000,0x00007f9b352e9000)] 0x00007f9af38c4000 JavaThread "com.alibaba.nacos.client.Worker.fixed-10.201.199.104:8848-product" daemon [_thread_blocked, id=25270, stack(0x00007f9b352e9000,0x00007f9b353ea000)] 0x00007f9af2a5a800 JavaThread "Timer-1" daemon [_thread_blocked, id=25269, stack(0x00007f9b353ea000,0x00007f9b354eb000)] 0x00007f9acc00c800 JavaThread "EagleEye-StatLogController-writer-thread-1" daemon [_thread_blocked, id=25252, stack(0x00007f9b35af1000,0x00007f9b35bf2000)] 0x00000000044e4800 JavaThread "com.taobao.diamond.client.Worker.default" daemon [_thread_in_native, id=25251, stack(0x00007f9b355ec000,0x00007f9b356ed000)] 0x0000000003dfb000 JavaThread "com.taobao.diamond.client.Timer" daemon [_thread_blocked, id=25250, stack(0x00007f9b356ed000,0x00007f9b357ee000)] 0x0000000003c1f800 JavaThread "Thread-7" daemon [_thread_blocked, id=25249, stack(0x00007f9b357ee000,0x00007f9b358ef000)] 0x0000000003c1d800 JavaThread "server-timer1" daemon [_thread_blocked, id=25248, stack(0x00007f9b358ef000,0x00007f9b359f0000)] 0x0000000003bd3800 JavaThread "server-timer" daemon [_thread_blocked, id=25247, stack(0x00007f9b359f0000,0x00007f9b35af1000)] 0x00007f9af2d45000 JavaThread "Pandora pandora-qos-reporter Pool [Thread-1]" daemon [_thread_blocked, id=25245, stack(0x00007f9b35bf2000,0x00007f9b35cf3000)] 0x00007f9af2bc5000 JavaThread "qos-boss-1-1" daemon [_thread_blocked, id=25244, stack(0x00007f9b35cf3000,0x00007f9b35df4000)] 0x00007f9ad800d000 JavaThread "EagleEye-AsyncAppender-Thread-TraceLog-atp" daemon [_thread_blocked, id=25242, stack(0x00007f9b35df4000,0x00007f9b35ef5000)] 0x00007f9af2e2c000 JavaThread "metrics-LogDescriptionManager-thread-1" daemon [_thread_blocked, id=25241, stack(0x00007f9b35ef5000,0x00007f9b35ff6000)] 0x00007f9af2e2b800 JavaThread "metrics-bin-reporter-2-thread-1" daemon [_thread_blocked, id=25240, stack(0x00007f9b35ff6000,0x00007f9b360f7000)] 0x00007f9ae8a63800 JavaThread "metrics-BinAppender-thread-1" daemon [_thread_blocked, id=25239, stack(0x00007f9b360f7000,0x00007f9b361f8000)] 0x00007f9ae8554800 JavaThread "metrics-file-reporter-1-thread-1" daemon [_thread_blocked, id=25236, stack(0x00007f9b361f8000,0x00007f9b362f9000)] 0x00007f9ae84d8800 JavaThread "metrics-RollingFileAppender-thread-1" daemon [_thread_blocked, id=25235, stack(0x00007f9b362f9000,0x00007f9b363fa000)] 0x00007f9ae80ee800 JavaThread "EagleEye-ScheduleTaskController-worker-thread-1" daemon [_thread_blocked, id=25234, stack(0x00007f9b363fa000,0x00007f9b364fb000)] 0x00007f9ae80e1800 JavaThread "EagleEye-StatLogController-roller-thread-1" daemon [_thread_blocked, id=25233, stack(0x00007f9b364fb000,0x00007f9b365fc000)] 0x00007f9ae80a6800 JavaThread "EagleEye-LogDaemon-Thread" daemon [_thread_blocked, id=25232, stack(0x00007f9b365fc000,0x00007f9b366fd000)] 0x00007f9af3f8d800 JavaThread "EagleEye-AsyncAppender-Thread-BizLog" daemon [_thread_blocked, id=25231, stack(0x00007f9b366fd000,0x00007f9b367fe000)] 0x00007f9af3e1d800 JavaThread "EagleEye-AsyncAppender-Thread-RpcLog" daemon [_thread_blocked, id=25230, stack(0x00007f9b367fe000,0x00007f9b368ff000)] 0x00007f9af3cab800 JavaThread "EagleEye-AsyncAppender-Thread-SelfLog" daemon [_thread_blocked, id=25229, stack(0x00007f9b368ff000,0x00007f9b36a00000)] 0x00007f9af173f800 JavaThread "Timer-0" daemon [_thread_blocked, id=25228, stack(0x00007f9b36a00000,0x00007f9b36b01000)] 0x00007f9b4c556800 JavaThread "GC Daemon" daemon [_thread_blocked, id=25222, stack(0x00007f9b4403a000,0x00007f9b4413b000)] 0x00007f9b4c099800 JavaThread "Service Thread" daemon [_thread_blocked, id=25220, stack(0x00007f9b446c5000,0x00007f9b447c6000)] 0x00007f9b4c097000 JavaThread "C2 CompilerThread1" daemon [_thread_blocked, id=25219, stack(0x00007f9b447c6000,0x00007f9b448c7000)] 0x00007f9b4c094000 JavaThread "C2 CompilerThread0" daemon [_thread_blocked, id=25218, stack(0x00007f9b448c7000,0x00007f9b449c8000)] 0x00007f9b4c091800 JavaThread "Signal Dispatcher" daemon [_thread_blocked, id=25217, stack(0x00007f9b449c8000,0x00007f9b44ac9000)] 0x00007f9b4c070800 JavaThread "Finalizer" daemon [_thread_blocked, id=25216, stack(0x00007f9b44ac9000,0x00007f9b44bca000)] 0x00007f9b4c06e800 JavaThread "Reference Handler" daemon [_thread_blocked, id=25215, stack(0x00007f9b44bca000,0x00007f9b44ccb000)] 0x00007f9b4c00a000 JavaThread "main" [_thread_in_native, id=25209, stack(0x00007f9b5280b000,0x00007f9b5290c000)] Other Threads: =>0x00007f9b4c06a000 VMThread [stack: 0x00007f9b44ccb000,0x00007f9b44dcc000] [id=25214] 0x00007f9b4c0a4800 WatcherThread [stack: 0x00007f9b445c4000,0x00007f9b446c5000] [id=25221] VM state:at safepoint (normal execution) VM Mutex/Monitor currently owned by a thread: ([mutex/lock_event]) [0x00007f9b4c0073d0] ExpandHeap_lock - owner thread: 0x00007f9b4c06a000 [0x00007f9b4c007a50] Threads_lock - owner thread: 0x00007f9b4c06a000 [0x00007f9b4c007f50] Heap_lock - owner thread: 0x00007f9af2e2b800 Heap PSYoungGen total 1122816K, used 0K [0x0000000780000000, 0x00000007eef00000, 0x0000000800000000) eden space 423936K, 0% used [0x0000000780000000,0x0000000780000000,0x0000000799e00000) from space 698880K, 0% used [0x0000000799e00000,0x0000000799e00000,0x00000007c4880000) to space 690176K, 0% used [0x00000007c4d00000,0x00000007c4d00000,0x00000007eef00000) ParOldGen total 3225088K, used 3184634K [0x0000000680000000, 0x0000000744d80000, 0x0000000780000000) object space 3225088K, 98% used [0x0000000680000000,0x00000007425fea80,0x0000000744d80000) PSPermGen total 2097152K, used 111831K [0x0000000600000000, 0x0000000680000000, 0x0000000680000000) object space 2097152K, 5% used [0x0000000600000000,0x0000000606d35ff8,0x0000000680000000) Card table byte_map: [0x00007f9b47fff000,0x00007f9b49000000] byte_map_base: 0x00007f9b44fff000 Polling page: 0x00007f9b52917000 Code Cache [0x00007f9b49000000, 0x00007f9b4a2e0000, 0x00007f9b4c000000) total_blobs=5813 nmethods=5091 adapters=673 free_code_cache=30158Kb largest_free_block=30581696 Compilation events (10 events): Event: 1204524.007 Thread 0x00007f9b4c094000 6182 com.taobao.eagleeye.json.IdentityHashMap::get (52 bytes) Event: 1204524.007 Thread 0x00007f9b4c097000 6181 ! com.taobao.eagleeye.json.JSONSerializer::getObjectWriter (872 bytes) Event: 1204524.009 Thread 0x00007f9b4c094000 nmethod 6182 0x00007f9b49cc2750 code [0x00007f9b49cc28a0, 0x00007f9b49cc29e8] Event: 1204524.009 Thread 0x00007f9b4c094000 6183 com.taobao.eagleeye.json.SerializeWriter::writeFieldName (80 bytes) Event: 1204524.011 Thread 0x00007f9b4c094000 nmethod 6183 0x00007f9b4a280010 code [0x00007f9b4a280160, 0x00007f9b4a280288] Event: 1204524.040 Thread 0x00007f9b4c097000 nmethod 6181 0x00007f9b4a01e110 code [0x00007f9b4a01e600, 0x00007f9b4a0201d8] Event: 1204590.715 Thread 0x00007f9b4c094000 6184 java.util.TreeMap::rotateRight (96 bytes) Event: 1204590.715 Thread 0x00007f9b4c097000 6185 com.taobao.eagleeye.json.BigDecimalCodec::write (88 bytes) Event: 1204590.717 Thread 0x00007f9b4c094000 nmethod 6184 0x00007f9b49f7af90 code [0x00007f9b49f7b0e0, 0x00007f9b49f7b238] Event: 1204590.718 Thread 0x00007f9b4c097000 nmethod 6185 0x00007f9b4a05ddd0 code [0x00007f9b4a05df40, 0x00007f9b4a05e138] GC Heap History (10 events): Event: 1204590.670 GC heap after Heap after GC invocations=36180 (full 121): PSYoungGen total 1093632K, used 0K [0x0000000780000000, 0x00000007ef400000, 0x0000000800000000) eden space 394752K, 0% used [0x0000000780000000,0x0000000780000000,0x0000000798180000) from space 698880K, 0% used [0x0000000798180000,0x0000000798180000,0x00000007c2c00000) to space 698880K, 0% used [0x00000007c4980000,0x00000007c4980000,0x00000007ef400000) ParOldGen total 3225088K, used 2652104K [0x0000000680000000, 0x0000000744d80000, 0x0000000780000000) object space 3225088K, 82% used [0x0000000680000000,0x0000000721df21d8,0x0000000744d80000) PSPermGen total 2097152K, used 111831K [0x0000000600000000, 0x0000000680000000, 0x0000000680000000) object space 2097152K, 5% used [0x0000000600000000,0x0000000606d35e60,0x0000000680000000) } Event: 1204596.643 GC heap before {Heap before GC invocations=36181 (full 121): PSYoungGen total 1093632K, used 394752K [0x0000000780000000, 0x00000007ef400000, 0x0000000800000000) eden space 394752K, 100% used [0x0000000780000000,0x0000000798180000,0x0000000798180000) from space 698880K, 0% used [0x0000000798180000,0x0000000798180000,0x00000007c2c00000) to space 698880K, 0% used [0x00000007c4980000,0x00000007c4980000,0x00000007ef400000) ParOldGen total 3225088K, used 2652104K [0x0000000680000000, 0x0000000744d80000, 0x0000000780000000) object space 3225088K, 82% used [0x0000000680000000,0x0000000721df21d8,0x0000000744d80000) PSPermGen total 2097152K, used 111831K [0x0000000600000000, 0x0000000680000000, 0x0000000680000000) object space 2097152K, 5% used [0x0000000600000000,0x0000000606d35f38,0x0000000680000000) Event: 1204596.732 GC heap after Heap after GC invocations=36181 (full 121): PSYoungGen total 1095168K, used 123671K [0x0000000780000000, 0x00000007ee600000, 0x0000000800000000) eden space 410624K, 0% used [0x0000000780000000,0x0000000780000000,0x0000000799100000) from space 684544K, 18% used [0x00000007c4980000,0x00000007cc245f30,0x00000007ee600000) to space 698880K, 0% used [0x0000000799100000,0x0000000799100000,0x00000007c3b80000) ParOldGen total 3225088K, used 2652104K [0x0000000680000000, 0x0000000744d80000, 0x0000000780000000) object space 3225088K, 82% used [0x0000000680000000,0x0000000721df21d8,0x0000000744d80000) PSPermGen total 2097152K, used 111831K [0x0000000600000000, 0x0000000680000000, 0x0000000680000000) object space 2097152K, 5% used [0x0000000600000000,0x0000000606d35f38,0x0000000680000000) } Event: 1204602.842 GC heap before {Heap before GC invocations=36182 (full 121): PSYoungGen total 1095168K, used 534295K [0x0000000780000000, 0x00000007ee600000, 0x0000000800000000) eden space 410624K, 100% used [0x0000000780000000,0x0000000799100000,0x0000000799100000) from space 684544K, 18% used [0x00000007c4980000,0x00000007cc245f30,0x00000007ee600000) to space 698880K, 0% used [0x0000000799100000,0x0000000799100000,0x00000007c3b80000) ParOldGen total 3225088K, used 2652104K [0x0000000680000000, 0x0000000744d80000, 0x0000000780000000) object space 3225088K, 82% used [0x0000000680000000,0x0000000721df21d8,0x0000000744d80000) PSPermGen total 2097152K, used 111831K [0x0000000600000000, 0x0000000680000000, 0x0000000680000000) object space 2097152K, 5% used [0x0000000600000000,0x0000000606d35f38,0x0000000680000000) Event: 1204603.067 GC heap after Heap after GC invocations=36182 (full 121): PSYoungGen total 1109504K, used 116361K [0x0000000780000000, 0x00000007ef480000, 0x0000000800000000) eden space 410624K, 0% used [0x0000000780000000,0x0000000780000000,0x0000000799100000) from space 698880K, 16% used [0x0000000799100000,0x00000007a02a2558,0x00000007c3b80000) to space 698880K, 0% used [0x00000007c4a00000,0x00000007c4a00000,0x00000007ef480000) ParOldGen total 3225088K, used 2761705K [0x0000000680000000, 0x0000000744d80000, 0x0000000780000000) object space 3225088K, 85% used [0x0000000680000000,0x00000007288fa6c8,0x0000000744d80000) PSPermGen total 2097152K, used 111831K [0x0000000600000000, 0x0000000680000000, 0x0000000680000000) object space 2097152K, 5% used [0x0000000600000000,0x0000000606d35f38,0x0000000680000000) } Event: 1204611.632 GC heap before {Heap before GC invocations=36183 (full 121): PSYoungGen total 1109504K, used 526985K [0x0000000780000000, 0x00000007ef480000, 0x0000000800000000) eden space 410624K, 100% used [0x0000000780000000,0x0000000799100000,0x0000000799100000) from space 698880K, 16% used [0x0000000799100000,0x00000007a02a2558,0x00000007c3b80000) to space 698880K, 0% used [0x00000007c4a00000,0x00000007c4a00000,0x00000007ef480000) ParOldGen total 3225088K, used 2761705K [0x0000000680000000, 0x0000000744d80000, 0x0000000780000000) object space 3225088K, 85% used [0x0000000680000000,0x00000007288fa6c8,0x0000000744d80000) PSPermGen total 2097152K, used 111831K [0x0000000600000000, 0x0000000680000000, 0x0000000680000000) object space 2097152K, 5% used [0x0000000600000000,0x0000000606d35f38,0x0000000680000000) Event: 1204611.935 GC heap after Heap after GC invocations=36183 (full 121): PSYoungGen total 1121280K, used 159460K [0x0000000780000000, 0x00000007ef300000, 0x0000000800000000) eden space 423936K, 0% used [0x0000000780000000,0x0000000780000000,0x0000000799e00000) from space 697344K, 22% used [0x00000007c4a00000,0x00000007ce5b9330,0x00000007ef300000) to space 698880K, 0% used [0x0000000799e00000,0x0000000799e00000,0x00000007c4880000) ParOldGen total 3225088K, used 2873393K [0x0000000680000000, 0x0000000744d80000, 0x0000000780000000) object space 3225088K, 89% used [0x0000000680000000,0x000000072f60c6c8,0x0000000744d80000) PSPermGen total 2097152K, used 111831K [0x0000000600000000, 0x0000000680000000, 0x0000000680000000) object space 2097152K, 5% used [0x0000000600000000,0x0000000606d35f38,0x0000000680000000) } Event: 1204620.761 GC heap before {Heap before GC invocations=36184 (full 121): PSYoungGen total 1121280K, used 583396K [0x0000000780000000, 0x00000007ef300000, 0x0000000800000000) eden space 423936K, 100% used [0x0000000780000000,0x0000000799e00000,0x0000000799e00000) from space 697344K, 22% used [0x00000007c4a00000,0x00000007ce5b9330,0x00000007ef300000) to space 698880K, 0% used [0x0000000799e00000,0x0000000799e00000,0x00000007c4880000) ParOldGen total 3225088K, used 2873393K [0x0000000680000000, 0x0000000744d80000, 0x0000000780000000) object space 3225088K, 89% used [0x0000000680000000,0x000000072f60c6c8,0x0000000744d80000) PSPermGen total 2097152K, used 111831K [0x0000000600000000, 0x0000000680000000, 0x0000000680000000) object space 2097152K, 5% used [0x0000000600000000,0x0000000606d35ff8,0x0000000680000000) Event: 1204621.151 GC heap after Heap after GC invocations=36184 (full 121): PSYoungGen total 1122816K, used 169794K [0x0000000780000000, 0x00000007eef00000, 0x0000000800000000) eden space 423936K, 0% used [0x0000000780000000,0x0000000780000000,0x0000000799e00000) from space 698880K, 24% used [0x0000000799e00000,0x00000007a43d0868,0x00000007c4880000) to space 690176K, 0% used [0x00000007c4d00000,0x00000007c4d00000,0x00000007eef00000) ParOldGen total 3225088K, used 3027001K [0x0000000680000000, 0x0000000744d80000, 0x0000000780000000) object space 3225088K, 93% used [0x0000000680000000,0x0000000738c0e520,0x0000000744d80000) PSPermGen total 2097152K, used 111831K [0x0000000600000000, 0x0000000680000000, 0x0000000680000000) object space 2097152K, 5% used [0x0000000600000000,0x0000000606d35ff8,0x0000000680000000) } Event: 1204621.151 GC heap before {Heap before GC invocations=36185 (full 122): PSYoungGen total 1122816K, used 169794K [0x0000000780000000, 0x00000007eef00000, 0x0000000800000000) eden space 423936K, 0% used [0x0000000780000000,0x0000000780000000,0x0000000799e00000) from space 698880K, 24% used [0x0000000799e00000,0x00000007a43d0868,0x00000007c4880000) to space 690176K, 0% used [0x00000007c4d00000,0x00000007c4d00000,0x00000007eef00000) ParOldGen total 3225088K, used 3027001K [0x0000000680000000, 0x0000000744d80000, 0x0000000780000000) object space 3225088K, 93% used [0x0000000680000000,0x0000000738c0e520,0x0000000744d80000) PSPermGen total 2097152K, used 111831K [0x0000000600000000, 0x0000000680000000, 0x0000000680000000) object space 2097152K, 5% used [0x0000000600000000,0x0000000606d35ff8,0x0000000680000000) Deoptimization events (10 events): Event: 1204401.184 Thread 0x00007f9ad010d800 Uncommon trap: reason=class_check action=maybe_recompile pc=0x00007f9b49746a14 method=cn.hutool.core.convert.ConverterRegistry.getDefaultConverter(Ljava/lang/reflect/Type;)Lcn/hutool/core/convert/Converter; @ 22 Event: 1204401.471 Thread 0x00007f9ad010d800 Uncommon trap: reason=unreached action=reinterpret pc=0x00007f9b4a227214 method=com.qdport.controller.edo.EdoDynamicController.exportPayOrderData(Ljava/lang/String;Ljava/lang/String;Ljava/lang/String;Ljava/lang/String;Ljava/lang/String;Ljava/lang/String;L Event: 1204401.679 Thread 0x00007f9ad010d800 Uncommon trap: reason=null_check action=make_not_entrant pc=0x00007f9b4a119570 method=com.alibaba.fastjson.parser.ParserConfig.get(Ljava/lang/reflect/Type;)Lcom/alibaba/fastjson/parser/deserializer/ObjectDeserializer; @ 18 Event: 1204401.679 Thread 0x00007f9ad010d800 Uncommon trap: reason=null_check action=make_not_entrant pc=0x00007f9b4a11a0d0 method=com.alibaba.fastjson.parser.ParserConfig.get(Ljava/lang/reflect/Type;)Lcom/alibaba/fastjson/parser/deserializer/ObjectDeserializer; @ 18 Event: 1204402.306 Thread 0x00007f9ad010d800 Uncommon trap: reason=unstable_if action=reinterpret pc=0x00007f9b4a2acd48 method=com.qdport.controller.edo.EdoDynamicController.exportPayOrderData(Ljava/lang/String;Ljava/lang/String;Ljava/lang/String;Ljava/lang/String;Ljava/lang/String;Ljava/lang/String Event: 1204482.174 Thread 0x00007f9ac4001800 Uncommon trap: reason=class_check action=maybe_recompile pc=0x00007f9b4975a408 method=com.alibaba.nacos.client.config.impl.ClientWorker$LongPullingRunnable.run()V @ 130 Event: 1204482.222 Thread 0x00007f9ad0002800 Uncommon trap: reason=bimorphic action=maybe_recompile pc=0x00007f9b49ef0d6c method=org.springframework.context.event.AbstractApplicationEventMulticaster.getApplicationListeners(Lorg/springframework/context/ApplicationEvent;Lorg/springframework/core/Resol Event: 1204523.968 Thread 0x00007f9af40df800 Uncommon trap: reason=unstable_if action=reinterpret pc=0x00007f9b49e96204 method=com.taobao.hsf.address.AddressProfiler.run()V @ 24 Event: 1204523.969 Thread 0x00007f9af40df800 Uncommon trap: reason=unstable_if action=reinterpret pc=0x00007f9b4a118ef8 method=java.text.FieldPosition.matchesField(Ljava/text/Format$Field;I)Z @ 21 Event: 1204581.597 Thread 0x00007f9ad0068800 Uncommon trap: reason=unstable_if action=reinterpret pc=0x00007f9b49d12f7c method=cn.hutool.core.convert.AbstractConverter.convertToStr(Ljava/lang/Object;)Ljava/lang/String; @ 11 Internal exceptions (10 events): Event: 1204618.577 Thread 0x00007f9b4c166800 Threw 0x000000079141a848 at /HUDSON/workspace/7u-2-build-linux-amd64/jdk7u80/2329/hotspot/src/share/vm/prims/jvm.cpp:1319 Event: 1204619.542 Thread 0x00007f9b4c43a800 Threw 0x0000000792fa6bf8 at /HUDSON/workspace/7u-2-build-linux-amd64/jdk7u80/2329/hotspot/src/share/vm/prims/jvm.cpp:1319 Event: 1204619.542 Thread 0x00007f9b4c43a800 Threw 0x0000000792faeb00 at /HUDSON/workspace/7u-2-build-linux-amd64/jdk7u80/2329/hotspot/src/share/vm/prims/jvm.cpp:1319 Event: 1204619.610 Thread 0x00007f9ad010f800 Threw 0x0000000793b29018 at /HUDSON/workspace/7u-2-build-linux-amd64/jdk7u80/2329/hotspot/src/share/vm/prims/jvm.cpp:1319 Event: 1204619.611 Thread 0x00007f9ad010f800 Threw 0x0000000793b30a50 at /HUDSON/workspace/7u-2-build-linux-amd64/jdk7u80/2329/hotspot/src/share/vm/prims/jvm.cpp:1319 Event: 1204620.562 Thread 0x00007f9ad0008800 Threw 0x0000000797ff58c8 at /HUDSON/workspace/7u-2-build-linux-amd64/jdk7u80/2329/hotspot/src/share/vm/prims/jvm.cpp:1319 Event: 1204620.562 Thread 0x00007f9ad0008800 Threw 0x0000000797ffd6d0 at /HUDSON/workspace/7u-2-build-linux-amd64/jdk7u80/2329/hotspot/src/share/vm/prims/jvm.cpp:1319 Event: 1204620.743 Thread 0x00007f9af2e2b800 Threw 0x0000000798ee0120 at /HUDSON/workspace/7u-2-build-linux-amd64/jdk7u80/2329/hotspot/src/share/vm/prims/jni.cpp:717 Event: 1204620.743 Thread 0x00007f9af2e2b800 Threw 0x0000000798ee6c38 at /HUDSON/workspace/7u-2-build-linux-amd64/jdk7u80/2329/hotspot/src/share/vm/prims/jni.cpp:717 Event: 1204620.743 Thread 0x00007f9af2e2b800 Threw 0x0000000798eeb330 at /HUDSON/workspace/7u-2-build-linux-amd64/jdk7u80/2329/hotspot/src/share/vm/prims/jni.cpp:717 Events (10 events): Event: 1204619.610 loading class 0x00007f9ab400eee0 done Event: 1204619.731 Thread 0x00007f9abc15f000 Thread added: 0x00007f9abc15f000 Event: 1204619.731 Thread 0x00007f9abc15f000 Thread exited: 0x00007f9abc15f000 Event: 1204620.562 loading class 0x00007f9ab40101e0 Event: 1204620.562 loading class 0x00007f9ab40101e0 done Event: 1204620.562 loading class 0x00007f9ab400eee0 Event: 1204620.562 loading class 0x00007f9ab400eee0 done Event: 1204620.678 Executing VM operation: RevokeBias Event: 1204620.679 Executing VM operation: RevokeBias done Event: 1204620.761 Executing VM operation: ParallelGCFailedAllocation ```
ubantu16.04安装caffe,最后运行测试的时候出现问题,求高手解答
CXX src/caffe/layers/cudnn_pooling_layer.cpp CXX src/caffe/layers/spp_layer.cpp CXX src/caffe/layers/relu_layer.cpp CXX src/caffe/layers/input_layer.cpp CXX src/caffe/layers/scale_layer.cpp CXX src/caffe/layers/bias_layer.cpp CXX src/caffe/layers/cudnn_lcn_layer.cpp CXX src/caffe/layers/cudnn_tanh_layer.cpp CXX src/caffe/layers/cudnn_sigmoid_layer.cpp CXX src/caffe/layers/split_layer.cpp CXX src/caffe/layers/inner_product_layer.cpp CXX src/caffe/layers/reshape_layer.cpp CXX src/caffe/layers/threshold_layer.cpp CXX src/caffe/layers/concat_layer.cpp CXX src/caffe/layers/tanh_layer.cpp CXX src/caffe/layers/embed_layer.cpp CXX src/caffe/solver.cpp CXX src/caffe/internal_thread.cpp CXX src/caffe/solvers/nesterov_solver.cpp CXX src/caffe/solvers/adam_solver.cpp CXX src/caffe/solvers/adagrad_solver.cpp CXX src/caffe/solvers/adadelta_solver.cpp CXX src/caffe/solvers/rmsprop_solver.cpp CXX src/caffe/solvers/sgd_solver.cpp CXX src/caffe/data_transformer.cpp CXX src/caffe/blob.cpp NVCC src/caffe/util/math_functions.cu nvcc warning : The 'compute_20', 'sm_20', and 'sm_21' architectures are deprecated, and may be removed in a future release (Use -Wno-deprecated-gpu-targets to suppress warning). NVCC src/caffe/util/im2col.cu nvcc warning : The 'compute_20', 'sm_20', and 'sm_21' architectures are deprecated, and may be removed in a future release (Use -Wno-deprecated-gpu-targets to suppress warning). NVCC src/caffe/layers/split_layer.cu nvcc warning : The 'compute_20', 'sm_20', and 'sm_21' architectures are deprecated, and may be removed in a future release (Use -Wno-deprecated-gpu-targets to suppress warning). NVCC src/caffe/layers/cudnn_softmax_layer.cu nvcc warning : The 'compute_20', 'sm_20', and 'sm_21' architectures are deprecated, and may be removed in a future release (Use -Wno-deprecated-gpu-targets to suppress warning). NVCC src/caffe/layers/cudnn_lcn_layer.cu nvcc warning : The 'compute_20', 'sm_20', and 'sm_21' architectures are deprecated, and may be removed in a future release (Use -Wno-deprecated-gpu-targets to suppress warning). NVCC src/caffe/layers/bias_layer.cu nvcc warning : The 'compute_20', 'sm_20', and 'sm_21' architectures are deprecated, and may be removed in a future release (Use -Wno-deprecated-gpu-targets to suppress warning). nvcc warning : The 'compute_20', 'sm_20', and 'sm_21' architectures are deprecated, and may be removed in a future release (Use -Wno-deprecated-gpu-targets to suppress warning). NVCC src/caffe/layers/prelu_layer.cu nvcc warning : The 'compute_20', 'sm_20', and 'sm_21' architectures are deprecated, and may be removed in a future release (Use -Wno-deprecated-gpu-targets to suppress warning). nvcc warning : The 'compute_20', 'sm_20', and 'sm_21' architectures are deprecated, and may be removed in a future release (Use -Wno-deprecated-gpu-targets to suppress warning). NVCC src/caffe/layers/crop_layer.cu nvcc warning : The 'compute_20', 'sm_20', and 'sm_21' architectures are deprecated, and may be removed in a future release (Use -Wno-deprecated-gpu-targets to suppress warning). nvcc warning : The 'compute_20', 'sm_20', and 'sm_21' architectures are deprecated, and may be removed in a future release (Use -Wno-deprecated-gpu-targets to suppress warning). NVCC src/caffe/layers/contrastive_loss_layer.cu nvcc warning : The 'compute_20', 'sm_20', and 'sm_21' architectures are deprecated, and may be removed in a future release (Use -Wno-deprecated-gpu-targets to suppress warning). nvcc warning : The 'compute_20', 'sm_20', and 'sm_21' architectures are deprecated, and may be removed in a future release (Use -Wno-deprecated-gpu-targets to suppress warning). NVCC src/caffe/layers/log_layer.cu nvcc warning : The 'compute_20', 'sm_20', and 'sm_21' architectures are deprecated, and may be removed in a future release (Use -Wno-deprecated-gpu-targets to suppress warning). nvcc warning : The 'compute_20', 'sm_20', and 'sm_21' architectures are deprecated, and may be removed in a future release (Use -Wno-deprecated-gpu-targets to suppress warning). NVCC src/caffe/layers/hdf5_data_layer.cu nvcc warning : The 'compute_20', 'sm_20', and 'sm_21' architectures are deprecated, and may be removed in a future release (Use -Wno-deprecated-gpu-targets to suppress warning). nvcc warning : The 'compute_20', 'sm_20', and 'sm_21' architectures are deprecated, and may be removed in a future release (Use -Wno-deprecated-gpu-targets to suppress warning). NVCC src/caffe/layers/power_layer.cu nvcc warning : The 'compute_20', 'sm_20', and 'sm_21' architectures are deprecated, and may be removed in a future release (Use -Wno-deprecated-gpu-targets to suppress warning). nvcc warning : The 'compute_20', 'sm_20', and 'sm_21' architectures are deprecated, and may be removed in a future release (Use -Wno-deprecated-gpu-targets to suppress warning). NVCC src/caffe/layers/tanh_layer.cu nvcc warning : The 'compute_20', 'sm_20', and 'sm_21' architectures are deprecated, and may be removed in a future release (Use -Wno-deprecated-gpu-targets to suppress warning). nvcc warning : The 'compute_20', 'sm_20', and 'sm_21' architectures are deprecated, and may be removed in a future release (Use -Wno-deprecated-gpu-targets to suppress warning). NVCC src/caffe/layers/absval_layer.cu nvcc warning : The 'compute_20', 'sm_20', and 'sm_21' architectures are deprecated, and may be removed in a future release (Use -Wno-deprecated-gpu-targets to suppress warning). nvcc warning : The 'compute_20', 'sm_20', and 'sm_21' architectures are deprecated, and may be removed in a future release (Use -Wno-deprecated-gpu-targets to suppress warning). NVCC src/caffe/layers/softmax_layer.cu nvcc warning : The 'compute_20', 'sm_20', and 'sm_21' architectures are deprecated, and may be removed in a future release (Use -Wno-deprecated-gpu-targets to suppress warning). nvcc warning : The 'compute_20', 'sm_20', and 'sm_21' architectures are deprecated, and may be removed in a future release (Use -Wno-deprecated-gpu-targets to suppress warning). NVCC src/caffe/layers/elu_layer.cu nvcc warning : The 'compute_20', 'sm_20', and 'sm_21' architectures are deprecated, and may be removed in a future release (Use -Wno-deprecated-gpu-targets to suppress warning). nvcc warning : The 'compute_20', 'sm_20', and 'sm_21' architectures are deprecated, and may be removed in a future release (Use -Wno-deprecated-gpu-targets to suppress warning). NVCC src/caffe/layers/scale_layer.cu nvcc warning : The 'compute_20', 'sm_20', and 'sm_21' architectures are deprecated, and may be removed in a future release (Use -Wno-deprecated-gpu-targets to suppress warning). nvcc warning : The 'compute_20', 'sm_20', and 'sm_21' architectures are deprecated, and may be removed in a future release (Use -Wno-deprecated-gpu-targets to suppress warning). NVCC src/caffe/layers/slice_layer.cu nvcc warning : The 'compute_20', 'sm_20', and 'sm_21' architectures are deprecated, and may be removed in a future release (Use -Wno-deprecated-gpu-targets to suppress warning). nvcc warning : The 'compute_20', 'sm_20', and 'sm_21' architectures are deprecated, and may be removed in a future release (Use -Wno-deprecated-gpu-targets to suppress warning). NVCC src/caffe/layers/im2col_layer.cu nvcc warning : The 'compute_20', 'sm_20', and 'sm_21' architectures are deprecated, and may be removed in a future release (Use -Wno-deprecated-gpu-targets to suppress warning). nvcc warning : The 'compute_20', 'sm_20', and 'sm_21' architectures are deprecated, and may be removed in a future release (Use -Wno-deprecated-gpu-targets to suppress warning). NVCC src/caffe/layers/conv_layer.cu nvcc warning : The 'compute_20', 'sm_20', and 'sm_21' architectures are deprecated, and may be removed in a future release (Use -Wno-deprecated-gpu-targets to suppress warning). nvcc warning : The 'compute_20', 'sm_20', and 'sm_21' architectures are deprecated, and may be removed in a future release (Use -Wno-deprecated-gpu-targets to suppress warning). NVCC src/caffe/layers/cudnn_lrn_layer.cu nvcc warning : The 'compute_20', 'sm_20', and 'sm_21' architectures are deprecated, and may be removed in a future release (Use -Wno-deprecated-gpu-targets to suppress warning). nvcc warning : The 'compute_20', 'sm_20', and 'sm_21' architectures are deprecated, and may be removed in a future release (Use -Wno-deprecated-gpu-targets to suppress warning). NVCC src/caffe/solvers/nesterov_solver.cu nvcc warning : The 'compute_20', 'sm_20', and 'sm_21' architectures are deprecated, and may be removed in a future release (Use -Wno-deprecated-gpu-targets to suppress warning). nvcc warning : The 'compute_20', 'sm_20', and 'sm_21' architectures are deprecated, and may be removed in a future release (Use -Wno-deprecated-gpu-targets to suppress warning). nvcc warning : The 'compute_20', 'sm_20', and 'sm_21' architectures are deprecated, and may be removed in a future release (Use -Wno-deprecated-gpu-targets to suppress warning). nvcc warning : The 'compute_20', 'sm_20', and 'sm_21' architectures are deprecated, and may be removed in a future release (Use -Wno-deprecated-gpu-targets to suppress warning). LD -o .build_release/lib/libcaffe.so.1.0.0 CXX/LD -o .build_release/test/test_all.testbin src/caffe/test/test_caffe_main.cpp .build_release/tools/caffe make: .build_release/tools/caffe: Command not found Makefile:532: recipe for target 'runtest' failed make: *** [runtest] Error 127 minglei@minglei:~/caffe$
如何解决训练词向量word2vec时出现的内存问题?
用13GB的语料进行词向量的训练的话,用16GB的电脑,怎样防止内存溢出 最近在学习自己训练词向量,整理了13GB的小说语料, 昨晚设置好从分词做到词向量训练,结果今天早上看了一下内存溢出。 仅仅只完成了130M的分词,连词向量的训练都没开始就宕机了。 下图为执行代码 分词工具使用的是北大的pkuseg 请问应该如何修改代码? 这是我第一次做实战性质的项目 完全没有经验 还请各位前辈帮忙修改代码 ``` #文本预处理 sentences = [] rules = u"[\u4e00-\u9fa5]+" pattern = re.compile(rules) f_writer = open("data/分词后的1s1lCN13G.txt", "w", encoding="utf-8") with open("data/1s1lCN13G.txt", "r" , encoding="utf-8") as f_reader: for line in f_reader: if line == "" or line is None: continue line = " ".join(seg.cut(line)) seg_list = pattern.findall(line) word_list = [] for word in seg_list: if word not in stop_words: word_list.append(word) if len(word_list) > 0: sentences.append(word_list) line = " ".join(word_list) f_writer.write(line + "\n") f_writer.flush() f_writer.close() ``` ``` #模型训练 model = word2vec.Word2Vec(sentences,sg=1,hs=1,window=10,min_count=20,iter=10,size=256,workers=16) model.save("data/13G") ```
shareSDK运行报错,求解
Description Resource Path Location Type Conversion to Dalvik format failed: Unable to execute dex: Multiple dex files define Lcn/sharesdk/wechat/friends/Wechat$1; WisdomBeijing Unknown Android Packaging Problem
ie浏览器运行java中的打印预览出错?
basic: PluginMain.unregisterApplet: 1 from mananger sun.plugin2.applet.Applet2Manager@bab32d basic: 已添加进度监听程序: sun.plugin.util.ProgressMonitorAdapter@1a86e77 security: Expected Main URL: http://110.249.221.20:8082/report/runqianReport4Applet.jar basic: Plugin2ClassLoader.addURL parent called for http://110.249.221.20:8082/report/runqianReport4Applet.jar security: blacklist: check contains 9fKAOxlxGDnNQIzxDVQ6UjwsTU0=, state now IN_MEMORY security: blacklist: not found in cache security: 该 jar 文件不在黑名单上 security: 该 jar 文件没有签名, 所以将跳过黑名单检查 security: 找不到可信库列表文件 security: 警告: 以下资源已使用弱签名算法 MD5withRSA 进行签名, 并且被视为未签名: http://110.249.221.20:8082/report/runqianReport4Applet.jar 此算法现已通过安全属性禁用: jdk.jar.disabledAlgorithms=MD2, MD5, RSA keySize < 1024, DSA keySize < 1024 该文件已高速缓存为 C:\Users\凤凰购物\AppData\LocalLow\Sun\Java\Deployment\cache\6.0\55\6e30c6b7-28e0d833。请运行 'jarsigner -verify -verbose "C:\Users\凤凰购物\AppData\LocalLow\Sun\Java\Deployment\cache\6.0\55\6e30c6b7-28e0d833"' 以获取详细信息, 或者转到 http://www.java.com/jcpsecurity。 cache: Create from verifier: JarSigningData{hasOnlySignedEntries=false, hasSingleCodeSource=false, hasMissingSignedEntries=false} security: Grant connect perm for http://110.249.221.20:8082/report/runqianReport4Applet.jar : java.security.Permissions@38894d ( ("java.net.URLPermission" "http://110.249.221.20:8082/-" "*:*") ("java.net.URLPermission" "http://110.249.221.20:8082" "*:*") ) security: SSV validation: running: 1.8.0_191 requested: null range: null javaVersionParam: null Rule Set version: null network: Created version ID: 1.8.0.191 network: Created version ID: 1.8.0.191 security: continue with running version security: JUT Record: plugin2 http://110.249.221.20:8082/report/jsppage.do?url=app/report/showPreview&width=1920&height=1080&reportFile=syte/syte/khbmb.raq&param=grid=1000471008371&set=undefined: launchjnlp= srctype=file code=com.runqian.report4.view.applet.PrintReport.class columns=0 needselectprinter=no archive=http://110.249.221.20:8082/report/runqianReport4Applet.jar type=application/x-java-applet;version=1.6 saveprintsetup=yes filename=syte/syte/(0000)khbmb.raq reportparamsid=101437 approot=http://110.249.221.20:8082/report name=khbmb width=1824 scriptable=true height=951 app_model=eJyNU8tu1DAUvdPpY4DSRSs2IESFyiCxcJJhRKegEaqqIhUFadSWD3ATd+I2E7v2zTxYVGLLkgUSC/6A/2DPN7DlD5DgOsm0RYiBLJw4PvY5557rz99hwRq4E6kBs3nGYqFTNWFGHLNtrV+pWKRQPrU5uB5CI6JfR9wKhJXwhA+5lwn0Xu+Hz0K4EQsbGalRqgxhtVxOedb3DtDIrE+QVTFGkVkC7AurchMJi3CrROYoU2/bGD4JpUUCL59wcwE7g3OoE3+qIu4I3LwWwrUBl9lOym0BmKNNVkS5kThx2hEeheTMI2de6cwjZ97U2cbBFSwRLqDEVFQHzeNE0wH3Zx5wSBjauDgUWaxMsXOsqZ7LzhGj0jAqzYcHm09u//hm6rC0B42E22SHNu/BvFYGyQLPMVFOxpT5WF6qSJTF6ruhjUIVqbSa10lKRfmTHoB77xHWgsBnrfYWa7UC1vKfdvxOC6FBsh2bR7H9DkCiQNS6kL1WyHZBsIsgxm+/3v34hX+qQ40kW/lGjLXrh9G8G8dF3W+6/ih+1OiUhzOaaePlZaaXjTX3Z7BLQ2FsNXU1de+lf9lcn9o0eXYmOTWZm7WJPKUoqJ1m2B//H8W7KcWJ1Zr3BYvV89ykXa71dMUmatQzYijFqDmSMSbdYKvlNxMh+wl2A7/jN0vkC8q5aycovGI4TY4GR8zws6bmhg+6fSNjgvt+e5PGzuPNoEn3rptnsTiWmYj/bgYhcBlUVWAlW5s5RYyXxejRjcSyPixy90cjLBQKzg2sz0rQ9XwVHaxSBxhYKdrG3XS2m+WDq4t06uJ2rxfuHupfNX1d6Q== network: 找不到高速缓存条目 [url: http://110.249.221.20:8082/report/com/runqian/base4/resources/print.class, 版本: null] network: 正在使用代理 DIRECT 连接 http://110.249.221.20:8082/report/com/runqian/base4/resources/print.class network: 正在使用代理 DIRECT 连接 http://110.249.221.20:8082/ network: 正在连接 http://110.249.221.20:8082/report/com/runqian/base4/resources/print.class 与 cookie "JSESSIONID=E201D3F7A1D52EFCF2DF1197430711A8; Hm_lvt_cc83da0b81bd91768b35e064ce214fdf=1539762178,1539763430,1539764202; Hm_lpvt_cc83da0b81bd91768b35e064ce214fdf=1539764252" network: 找不到高速缓存条目 [url: http://110.249.221.20:8082/report/com/runqian/base4/resources/print.properties, 版本: null] network: 正在使用代理 DIRECT 连接 http://110.249.221.20:8082/report/com/runqian/base4/resources/print.properties network: 正在连接 http://110.249.221.20:8082/report/com/runqian/base4/resources/print.properties 与 cookie "JSESSIONID=E201D3F7A1D52EFCF2DF1197430711A8; Hm_lvt_cc83da0b81bd91768b35e064ce214fdf=1539762178,1539763430,1539764202; Hm_lpvt_cc83da0b81bd91768b35e064ce214fdf=1539764252" network: 找不到高速缓存条目 [url: http://110.249.221.20:8082/report/com/runqian/base4/resources/print.properties, 版本: null] network: 正在使用代理 DIRECT 连接 http://110.249.221.20:8082/report/com/runqian/base4/resources/print.properties network: 正在连接 http://110.249.221.20:8082/report/com/runqian/base4/resources/print.properties 与 cookie "JSESSIONID=E201D3F7A1D52EFCF2DF1197430711A8; Hm_lvt_cc83da0b81bd91768b35e064ce214fdf=1539762178,1539763430,1539764202; Hm_lpvt_cc83da0b81bd91768b35e064ce214fdf=1539764374" network: 找不到高速缓存条目 [url: http://110.249.221.20:8082/report/com/runqian/base4/resources/print_zh.class, 版本: null] network: 正在使用代理 DIRECT 连接 http://110.249.221.20:8082/report/com/runqian/base4/resources/print_zh.class network: 正在连接 http://110.249.221.20:8082/report/com/runqian/base4/resources/print_zh.class 与 cookie "JSESSIONID=E201D3F7A1D52EFCF2DF1197430711A8; Hm_lvt_cc83da0b81bd91768b35e064ce214fdf=1539762178,1539763430,1539764202; Hm_lpvt_cc83da0b81bd91768b35e064ce214fdf=1539764374" network: 找不到高速缓存条目 [url: http://110.249.221.20:8082/report/com/runqian/base4/resources/print_zh_CN.class, 版本: null] network: 正在使用代理 DIRECT 连接 http://110.249.221.20:8082/report/com/runqian/base4/resources/print_zh_CN.class network: 正在连接 http://110.249.221.20:8082/report/com/runqian/base4/resources/print_zh_CN.class 与 cookie "JSESSIONID=E201D3F7A1D52EFCF2DF1197430711A8; Hm_lvt_cc83da0b81bd91768b35e064ce214fdf=1539762178,1539763430,1539764202; Hm_lpvt_cc83da0b81bd91768b35e064ce214fdf=1539764374" network: 找不到高速缓存条目 [url: http://110.249.221.20:8082/report/com/runqian/base4/resources/print_zh_CN.properties, 版本: null] network: 正在使用代理 DIRECT 连接 http://110.249.221.20:8082/report/com/runqian/base4/resources/print_zh_CN.properties network: 正在连接 http://110.249.221.20:8082/report/com/runqian/base4/resources/print_zh_CN.properties 与 cookie "JSESSIONID=E201D3F7A1D52EFCF2DF1197430711A8; Hm_lvt_cc83da0b81bd91768b35e064ce214fdf=1539762178,1539763430,1539764202; Hm_lpvt_cc83da0b81bd91768b35e064ce214fdf=1539764374" network: 找不到高速缓存条目 [url: http://110.249.221.20:8082/report/com/runqian/base4/resources/print_zh_CN.properties, 版本: null] network: 正在使用代理 DIRECT 连接 http://110.249.221.20:8082/report/com/runqian/base4/resources/print_zh_CN.properties network: 正在连接 http://110.249.221.20:8082/report/com/runqian/base4/resources/print_zh_CN.properties 与 cookie "JSESSIONID=E201D3F7A1D52EFCF2DF1197430711A8; Hm_lvt_cc83da0b81bd91768b35e064ce214fdf=1539762178,1539763430,1539764202; Hm_lpvt_cc83da0b81bd91768b35e064ce214fdf=1539764374" network: 找不到高速缓存条目 [url: http://110.249.221.20:8082/report/com/runqian/base4/resources/print_zh_Hans.class, 版本: null] network: 正在使用代理 DIRECT 连接 http://110.249.221.20:8082/report/com/runqian/base4/resources/print_zh_Hans.class network: 正在连接 http://110.249.221.20:8082/report/com/runqian/base4/resources/print_zh_Hans.class 与 cookie "JSESSIONID=E201D3F7A1D52EFCF2DF1197430711A8; Hm_lvt_cc83da0b81bd91768b35e064ce214fdf=1539762178,1539763430,1539764202; Hm_lpvt_cc83da0b81bd91768b35e064ce214fdf=1539764374" network: 找不到高速缓存条目 [url: http://110.249.221.20:8082/report/com/runqian/base4/resources/print_zh_Hans.properties, 版本: null] network: 正在使用代理 DIRECT 连接 http://110.249.221.20:8082/report/com/runqian/base4/resources/print_zh_Hans.properties network: 正在连接 http://110.249.221.20:8082/report/com/runqian/base4/resources/print_zh_Hans.properties 与 cookie "JSESSIONID=E201D3F7A1D52EFCF2DF1197430711A8; Hm_lvt_cc83da0b81bd91768b35e064ce214fdf=1539762178,1539763430,1539764202; Hm_lpvt_cc83da0b81bd91768b35e064ce214fdf=1539764374" network: 找不到高速缓存条目 [url: http://110.249.221.20:8082/report/com/runqian/base4/resources/print_zh_Hans.properties, 版本: null] network: 正在使用代理 DIRECT 连接 http://110.249.221.20:8082/report/com/runqian/base4/resources/print_zh_Hans.properties network: 正在连接 http://110.249.221.20:8082/report/com/runqian/base4/resources/print_zh_Hans.properties 与 cookie "JSESSIONID=E201D3F7A1D52EFCF2DF1197430711A8; Hm_lvt_cc83da0b81bd91768b35e064ce214fdf=1539762178,1539763430,1539764202; Hm_lpvt_cc83da0b81bd91768b35e064ce214fdf=1539764374" network: 找不到高速缓存条目 [url: http://110.249.221.20:8082/report/com/runqian/base4/resources/print_zh_Hans_CN.class, 版本: null] network: 正在使用代理 DIRECT 连接 http://110.249.221.20:8082/report/com/runqian/base4/resources/print_zh_Hans_CN.class network: 正在连接 http://110.249.221.20:8082/report/com/runqian/base4/resources/print_zh_Hans_CN.class 与 cookie "JSESSIONID=E201D3F7A1D52EFCF2DF1197430711A8; Hm_lvt_cc83da0b81bd91768b35e064ce214fdf=1539762178,1539763430,1539764202; Hm_lpvt_cc83da0b81bd91768b35e064ce214fdf=1539764374" network: 找不到高速缓存条目 [url: http://110.249.221.20:8082/report/com/runqian/base4/resources/print_zh_Hans_CN.properties, 版本: null] network: 正在使用代理 DIRECT 连接 http://110.249.221.20:8082/report/com/runqian/base4/resources/print_zh_Hans_CN.properties network: 正在连接 http://110.249.221.20:8082/report/com/runqian/base4/resources/print_zh_Hans_CN.properties 与 cookie "JSESSIONID=E201D3F7A1D52EFCF2DF1197430711A8; Hm_lvt_cc83da0b81bd91768b35e064ce214fdf=1539762178,1539763430,1539764202; Hm_lpvt_cc83da0b81bd91768b35e064ce214fdf=1539764374" network: 找不到高速缓存条目 [url: http://110.249.221.20:8082/report/com/runqian/base4/resources/print_zh_Hans_CN.properties, 版本: null] network: 正在使用代理 DIRECT 连接 http://110.249.221.20:8082/report/com/runqian/base4/resources/print_zh_Hans_CN.properties network: 正在连接 http://110.249.221.20:8082/report/com/runqian/base4/resources/print_zh_Hans_CN.properties 与 cookie "JSESSIONID=E201D3F7A1D52EFCF2DF1197430711A8; Hm_lvt_cc83da0b81bd91768b35e064ce214fdf=1539762178,1539763430,1539764202; Hm_lpvt_cc83da0b81bd91768b35e064ce214fdf=1539764374" basic: 已加载小应用程序。 basic: 已调整小应用程序大小且已将其添加到父容器中 basic: PERF: AppletExecutionRunnable - applet.init() BEGIN ; jvmLaunch dt 551817 us, pluginInit dt 123005535 us, TotalTime: 123557352 us java.security.AccessControlException: access denied ("java.util.PropertyPermission" "java.awt.im.style" "write") at java.security.AccessControlContext.checkPermission(Unknown Source) at java.security.AccessController.checkPermission(Unknown Source) at java.lang.SecurityManager.checkPermission(Unknown Source) at sun.plugin2.applet.AWTAppletSecurityManager.checkPermission(Unknown Source) at java.lang.System.setProperty(Unknown Source) at com.runqian.report4.view.applet.PrintReport.init(PrintReport.java:78) at com.sun.deploy.uitoolkit.impl.awt.AWTAppletAdapter.init(Unknown Source) at sun.plugin2.applet.Plugin2Manager$AppletExecutionRunnable.run(Unknown Source) at java.lang.Thread.run(Unknown Source) security: 重置拒绝会话证书存储 basic: 已删除进度监听程序: sun.plugin.util.ProgressMonitorAdapter@1a86e77 security: 重置拒绝会话证书存储 basic: Dialog type is not candidate for embedding![图片说明](https://img-ask.csdn.net/upload/201810/17/1539765096_665392.png)
终于明白阿里百度这样的大公司,为什么面试经常拿ThreadLocal考验求职者了
点击上面↑「爱开发」关注我们每晚10点,捕获技术思考和创业资源洞察什么是ThreadLocalThreadLocal是一个本地线程副本变量工具类,各个线程都拥有一份线程私有的数
win10系统安装教程(U盘PE+UEFI安装)
一、准备工作 u盘,电脑一台,win10原版镜像(msdn官网) 二、下载wepe工具箱  极力推荐微pe(微pe官方下载) 下载64位的win10 pe,使用工具箱制作启动U盘打开软件,   选择安装到U盘(按照操作无需更改) 三、重启进入pe系统   1、关机后,将U盘插入电脑 2、按下电源后,按住F12进入启动项选择(技嘉主板是F12)     选择需要启
程序员必须掌握的核心算法有哪些?
由于我之前一直强调数据结构以及算法学习的重要性,所以就有一些读者经常问我,数据结构与算法应该要学习到哪个程度呢?,说实话,这个问题我不知道要怎么回答你,主要取决于你想学习到哪些程度,不过针对这个问题,我稍微总结一下我学过的算法知识点,以及我觉得值得学习的算法。这些算法与数据结构的学习大多数是零散的,并没有一本把他们全部覆盖的书籍。下面是我觉得值得学习的一些算法以及数据结构,当然,我也会整理一些看过
《奇巧淫技》系列-python!!每天早上八点自动发送天气预报邮件到QQ邮箱
将代码部署服务器,每日早上定时获取到天气数据,并发送到邮箱。 也可以说是一个小人工智障。 思路可以运用在不同地方,主要介绍的是思路。
Nginx 软件层面加强Nginx性能优化的面试问答和解决方案
Nginx 软件层面加强Nginx性能优化的面试问答和解决方案 去年我去爱卡汽车面试PHP,一轮和二轮面的都不错,在三轮面到Nginx的时候很多问题当时不知道怎么回答,确实没有深入学习过,花了一段时间的学习,终于能解答Nginx高性能优化的问题了,10月24号为了获得程序员勋章,发布了半个优化笔记,浏览到了1000+,受到这个鼓舞,我抽时间在仔细整理下关于Nginx性能优化的问题,我们从软件说起。...
【管理系统课程设计】美少女手把手教你后台管理
【文章后台管理系统】URL设计与建模分析+项目源码+运行界面 栏目管理、文章列表、用户管理、角色管理、权限管理模块(文章最后附有源码) 1. 这是一个什么系统? 1.1 学习后台管理系统的原因 随着时代的变迁,现如今各大云服务平台横空出世,市面上有许多如学生信息系统、图书阅读系统、停车场管理系统等的管理系统,而本人家里就有人在用烟草销售系统,直接在网上完成挑选、购买与提交收货点,方便又快捷。 试想,若没有烟草销售系统,本人家人想要购买烟草,还要独自前往药...
11月19日科技资讯|华为明日发布鸿蒙整体战略;京东宣告全面向技术转型;Kotlin 1.3.60 发布
「极客头条」—— 技术人员的新闻圈! CSDN 的读者朋友们早上好哇,「极客头条」来啦,快来看今天都有哪些值得我们技术人关注的重要新闻吧。扫描上方二维码进入 CSDN App 可以收听御姐萌妹 Style 的人工版音频哟。 一分钟速览新闻点! 6G 专家组成员:速率是 5G 的 10 至 100 倍,预计 2030 年商用 雷军:很多人多次劝我放弃WPS,能坚持下来并不是纯粹的商业决定 ...
C语言魔塔游戏
很早就很想写这个,今天终于写完了。 游戏截图: 编译环境: VS2017 游戏需要一些图片,如果有想要的或者对游戏有什么看法的可以加我的QQ 2985486630 讨论,如果暂时没有回应,可以在博客下方留言,到时候我会看到。 下面我来介绍一下游戏的主要功能和实现方式 首先是玩家的定义,使用结构体,这个名字是可以自己改变的 struct gamerole { char n
化繁为简 - 腾讯计费高一致TDXA的实践之路
导语:腾讯计费是孵化于支撑腾讯内部业务千亿级营收的互联网计费平台,在如此庞大的业务体量下,腾讯计费要支撑业务的快速增长,同时还要保证每笔交易不错账。采用最终一致性或离线补...
Python爬虫爬取淘宝,京东商品信息
小编是一个理科生,不善长说一些废话。简单介绍下原理然后直接上代码。 使用的工具(Python+pycharm2019.3+selenium+xpath+chromedriver)其中要使用pycharm也可以私聊我selenium是一个框架可以通过pip下载 pip install selenium -i https://pypi.tuna.tsinghua.edu.cn/simple/ 
Java学习笔记(七十二)—— Cookie
概述 会话技术: 会话:一次会话中包含多次请求和响应 一次会话:浏览器第一次给服务器发送资源请求,会话建立,直到有一方断开为止 功能:在一次会话的范围内的多次请求间,共享数据 方式: 客户端会话技术:Cookie,把数据存储到客户端 服务器端会话技术:Session,把数据存储到服务器端 Cookie 概念:客户端会话技术,将数据存储到客户端 快速入门: 使用步骤: 创建C
阿里程序员写了一个新手都写不出的低级bug,被骂惨了。
这种新手都不会范的错,居然被一个工作好几年的小伙子写出来,差点被当场开除了。
Java工作4年来应聘要16K最后没要,细节如下。。。
前奏: 今天2B哥和大家分享一位前几天面试的一位应聘者,工作4年26岁,统招本科。 以下就是他的简历和面试情况。 基本情况: 专业技能: 1、&nbsp;熟悉Sping了解SpringMVC、SpringBoot、Mybatis等框架、了解SpringCloud微服务 2、&nbsp;熟悉常用项目管理工具:SVN、GIT、MAVEN、Jenkins 3、&nbsp;熟悉Nginx、tomca
2020年,冯唐49岁:我给20、30岁IT职场年轻人的建议
点击“技术领导力”关注∆  每天早上8:30推送 作者| Mr.K   编辑| Emma 来源| 技术领导力(ID:jishulingdaoli) 前天的推文《冯唐:职场人35岁以后,方法论比经验重要》,收到了不少读者的反馈,觉得挺受启发。其实,冯唐写了不少关于职场方面的文章,都挺不错的。可惜大家只记住了“春风十里不如你”、“如何避免成为油腻腻的中年人”等不那么正经的文章。 本文整理了冯
程序员该看的几部电影
##1、骇客帝国(1999) 概念:在线/离线,递归,循环,矩阵等 剧情简介: 不久的将来,网络黑客尼奥对这个看似正常的现实世界产生了怀疑。 他结识了黑客崔妮蒂,并见到了黑客组织的首领墨菲斯。 墨菲斯告诉他,现实世界其实是由一个名叫“母体”的计算机人工智能系统控制,人们就像他们饲养的动物,没有自由和思想,而尼奥就是能够拯救人类的救世主。 可是,救赎之路从来都不会一帆风顺,到底哪里才是真实的世界?
作为一个程序员,CPU的这些硬核知识你必须会!
CPU对每个程序员来说,是个既熟悉又陌生的东西? 如果你只知道CPU是中央处理器的话,那可能对你并没有什么用,那么作为程序员的我们,必须要搞懂的就是CPU这家伙是如何运行的,尤其要搞懂它里面的寄存器是怎么一回事,因为这将让你从底层明白程序的运行机制。 随我一起,来好好认识下CPU这货吧 把CPU掰开来看 对于CPU来说,我们首先就要搞明白它是怎么回事,也就是它的内部构造,当然,CPU那么牛的一个东
@程序员,如何花式构建线程?
作者 |曾建责编 | 郭芮出品 | CSDN(ID:CSDNnews)在项目和业务的开发中,我们难免要经常使用线程来进行业务处理,使用线程可以保证我们的业务在相互处理之间可以保证原子性...
破14亿,Python分析我国存在哪些人口危机!
2020年1月17日,国家统计局发布了2019年国民经济报告,报告中指出我国人口突破14亿。 猪哥的朋友圈被14亿人口刷屏,但是很多人并没有看到我国复杂的人口问题:老龄化、男女比例失衡、生育率下降、人口红利下降等。 今天我们就来分析一下我们国家的人口数据吧! 一、背景 1.人口突破14亿 2020年1月17日,国家统计局发布了 2019年国民经济报告 ,报告中指出:年末中国大陆总人口(包括31个
强烈推荐10本程序员在家读的书
很遗憾,这个鼠年春节注定是刻骨铭心的,新型冠状病毒让每个人的神经都是紧绷的。那些处在武汉的白衣天使们,尤其值得我们的尊敬。而我们这些窝在家里的程序员,能不外出就不外出,就是对社会做出的最大的贡献。 有些读者私下问我,窝了几天,有点颓丧,能否推荐几本书在家里看看。我花了一天的时间,挑选了 10 本我最喜欢的书,你可以挑选感兴趣的来读一读。读书不仅可以平复恐惧的压力,还可以对未来充满希望,毕竟苦难终
Linux自学篇——linux命令英文全称及解释
man: Manual 意思是手册,可以用这个命令查询其他命令的用法。 pwd:Print working directory 显示当前目录 su:Swith user 切换用户,切换到root用户 cd:Change directory 切换目录 ls:List files 列出目录下的文件 ps:Process Status 进程状态 mk
Python实战:抓肺炎疫情实时数据,画2019-nCoV疫情地图
文章目录1. 前言2. 数据下载3. 数据处理4. 数据可视化 1. 前言 今天,群里白垩老师问如何用python画武汉肺炎疫情地图。白垩老师是研究海洋生态与地球生物的学者,国家重点实验室成员,于不惑之年学习python,实为我等学习楷模。先前我并没有关注武汉肺炎的具体数据,也没有画过类似的数据分布图。于是就拿了两个小时,专门研究了一下,遂成此文。 2月6日追记:本文发布后,腾讯的数据源多次变更u
智力题(程序员面试经典)
NO.1  有20瓶药丸,其中19瓶装有1克/粒的药丸,余下一瓶装有1.1克/粒的药丸。给你一台称重精准的天平,怎么找出比较重的那瓶药丸?天平只能用一次。 解法 有时候,严格的限制条件有可能反倒是解题的线索。在这个问题中,限制条件是天平只能用一次。 因为天平只能用一次,我们也得以知道一个有趣的事实:一次必须同时称很多药丸,其实更准确地说,是必须从19瓶拿出药丸进行称重。否则,如果跳过两瓶或更多瓶药
在家远程办公效率低?那你一定要收好这个「在家办公」神器!
相信大家都已经收到国务院延长春节假期的消息,接下来,在家远程办公可能将会持续一段时间。 但是问题来了。远程办公不是人在电脑前就当坐班了,相反,对于沟通效率,文件协作,以及信息安全都有着极高的要求。有着非常多的挑战,比如: 1在异地互相不见面的会议上,如何提高沟通效率? 2文件之间的来往反馈如何做到及时性?如何保证信息安全? 3如何规划安排每天工作,以及如何进行成果验收? ......
作为一个程序员,内存和磁盘的这些事情,你不得不知道啊!!!
截止目前,我已经分享了如下几篇文章: 一个程序在计算机中是如何运行的?超级干货!!! 作为一个程序员,CPU的这些硬核知识你必须会! 作为一个程序员,内存的这些硬核知识你必须懂! 这些知识可以说是我们之前都不太重视的基础知识,可能大家在上大学的时候都学习过了,但是嘞,当时由于老师讲解的没那么有趣,又加上这些知识本身就比较枯燥,所以嘞,大家当初几乎等于没学。 再说啦,学习这些,也看不出来有什么用啊!
2020年的1月,我辞掉了我的第一份工作
其实,这篇文章,我应该早点写的,毕竟现在已经2月份了。不过一些其它原因,或者是我的惰性、还有一些迷茫的念头,让自己迟迟没有试着写一点东西,记录下,或者说是总结下自己前3年的工作上的经历、学习的过程。 我自己知道的,在写自己的博客方面,我的文笔很一般,非技术类的文章不想去写;另外我又是一个还比较热衷于技术的人,而平常复杂一点的东西,如果想写文章写的清楚点,是需要足够...
别低估自己的直觉,也别高估自己的智商
所有群全部吵翻天,朋友圈全部沦陷,公众号疯狂转发。这两周没怎么发原创,只发新闻,可能有人注意到了。我不是懒,是文章写了却没发,因为大家的关注力始终在这次的疫情上面,发了也没人看。当然,我...
Java坑人面试题系列: 包装类(中级难度)
Java Magazine上面有一个专门坑人的面试题系列: https://blogs.oracle.com/javamagazine/quiz-2。 这些问题的设计宗旨,主要是测试面试者对Java语言的了解程度,而不是为了用弯弯绕绕的手段把面试者搞蒙。 如果你看过往期的问题,就会发现每一个都不简单。 这些试题模拟了认证考试中的一些难题。 而 “中级(intermediate)” 和 “高级(ad
Spring Boot 2.x基础教程:使用JdbcTemplate访问MySQL数据库
在第2章节中,我们介绍了如何通过Spring Boot来实现HTTP接口,以及围绕HTTP接口相关的单元测试、文档生成等实用技能。但是,这些内容还不足以帮助我们构建一个动态应用的服务端程序。不论我们是要做App、小程序、还是传统的Web站点,对于用户的信息、相关业务的内容,通常都需要对其进行存储,而不是像第2章节中那样,把用户信息存储在内存中(重启就丢了!)。 对于信息的存储,现在已经有非常非常多...
基于Python的人脸自动戴口罩系统
目录 1、项目背景 2、页面设计 3、器官识别 4、退出系统 1、项目背景 2019年新型冠状病毒感染的肺炎疫情发生以来,牵动人心,举国哀痛,口罩、酒精、消毒液奇货可居。 抢不到口罩,怎么办?作为技术人今天分享如何使用Python实现自动戴口罩系统,来安慰自己,系统效果如下所示: 本系统的实现原理是借助 Dlib模块的Landmark人脸68个关键点检测库轻松识别出人脸五官
这个世界上人真的分三六九等,你信吗?
偶然间,在知乎上看到一个问题 一时间,勾起了我深深的回忆。 以前在厂里打过两次工,做过家教,干过辅导班,做过中介。零下几度的晚上,贴过广告,满脸、满手地长冻疮。 再回首那段岁月,虽然苦,但让我学会了坚持和忍耐。让我明白了,在这个世界上,无论环境多么的恶劣,只要心存希望,星星之火,亦可燎原。 下文是原回答,希望能对你能有所启发。 如果我说,这个世界上人真的分三六九等,...
节后首个工作日,企业们集体开晨会让钉钉挂了
By 超神经场景描述:昨天 2 月 3 日,是大部分城市号召远程工作的第一天,全国有接近 2 亿人在家开始远程办公,钉钉上也有超过 1000 万家企业活跃起来。关键词:十一出行 人脸...
Java基础知识点梳理
Java基础知识点梳理 摘要: 虽然已经在实际工作中经常与java打交道,但是一直没系统地对java这门语言进行梳理和总结,掌握的知识也比较零散。恰好利用这段时间重新认识下java,并对一些常见的语法和知识点做个总结与回顾,一方面为了加深印象,方便后面查阅,一方面为了学好java打下基础。 Java简介 java语言于1995年正式推出,最开始被命名为Oak语言,由James Gosling(詹姆
jQuery实现高仿QQ音乐
几个实现的效果看视频吧: bandicam 2020-02-05 16-28-20-127 动图很是不清楚 github地址奉上:https://github.com/tangmusenLiu/Large-warehouse https://github.com/tangmu
为什么听过很多道理,依然过不好这一生?
记录学习笔记是一个重要的习惯,不希望学习过的东西成为过眼云烟。做总结的同时也是一次复盘思考的过程。 本文是根据阅读得到 App上《万维钢·精英日课》部分文章后所做的一点笔记和思考。学习是一个系统的过程,思维模型的建立需要相对完整的学习和思考过程。以下观点是在碎片化阅读后总结的一点心得总结。
2020年全新Java学习路线图,含配套视频,学完即为中级Java程序员!!
新的一年来临,突如其来的疫情打破了平静的生活! 在家的你是否很无聊,如果无聊就来学习吧! 世上只有一种投资只赚不赔,那就是学习!!! 传智播客于2020年升级了Java学习线路图,硬核升级,免费放送! 学完你就是中级程序员,能更快一步找到工作! 一、Java基础 JavaSE基础是Java中级程序员的起点,是帮助你从小白到懂得编程的必经之路。 在Java基础板块中有6个子模块的学
B 站上有哪些很好的学习资源?
哇说起B站,在小九眼里就是宝藏般的存在,放年假宅在家时一天刷6、7个小时不在话下,更别提今年的跨年晚会,我简直是跪着看完的!! 最早大家聚在在B站是为了追番,再后来我在上面刷欧美新歌和漂亮小姐姐的舞蹈视频,最近两年我和周围的朋友们已经把B站当作学习教室了,而且学习成本还免费,真是个励志的好平台ヽ(.◕ฺˇд ˇ◕ฺ;)ノ 下面我们就来盘点一下B站上优质的学习资源: 综合类 Oeasy: 综合
如何优雅地打印一个Java对象?
你好呀,我是沉默王二,一个和黄家驹一样身高,和刘德华一样颜值的程序员。虽然已经写了十多年的 Java 代码,但仍然觉得自己是个菜鸟(请允许我惭愧一下)。 在一个月黑风高的夜晚,我思前想后,觉得再也不能这么蹉跎下去了。于是痛下决心,准备通过输出的方式倒逼输入,以此来修炼自己的内功,从而进阶成为一名真正意义上的大神。与此同时,希望这些文章能够帮助到更多的读者,让大家在学习的路上不再寂寞、空虚和冷。 ...
雷火神山直播超两亿,Web播放器事件监听是怎么实现的?
Web播放器解决了在手机浏览器和PC浏览器上播放音视频数据的问题,让视音频内容可以不依赖用户安装App,就能进行播放以及在社交平台进行传播。在视频业务大数据平台中,播放数据的统计分析非常重要,所以Web播放器在使用过程中,需要对其内部的数据进行收集并上报至服务端,此时,就需要对发生在其内部的一些播放行为进行事件监听。 那么Web播放器事件监听是怎么实现的呢? 01 监听事件明细表 名...
JAVA后端面试《Spring》
Spring1.Spring是什么?有什么好处?2.IOC是什么?有什么好处?具体过程?3.DI是什么?4.IOC和DI的关系?5.bean标签的属性有哪些?6.IOC创建对象有哪几种方式?7.Spring是如何实现IOC的?也就是如何创建对象的? 1.Spring是什么?有什么好处? 概念: SPring是一个支持控制反转(IOC)和面向切面编程(AOP)的容器框架。 好处: 两降低&gt;&...
Serverless 基本概念入门
从行业趋势看,Serverless 是云计算必经的一场革命 2019 年,Serverless 被 Gartner 称为最有潜力的云计算技术发展方向,并被赋予是必然性的发展趋势。Serverless 从底层开始变革计算资源的形态,为软件架构设计与应用服务部署带来了新的设计思路。 为此,我们策划了Serverless 技术专栏,从基础概念入门,到前后台架构设计、应用拓展、最佳实践等多维度,...
3万字总结,Mysql优化之精髓
本文知识点较多,篇幅较长,请耐心学习 MySQL已经成为时下关系型数据库产品的中坚力量,备受互联网大厂的青睐,出门面试想进BAT,想拿高工资,不会点MySQL优化知识,拿offer的成功率会大大下降。 为什么要优化 系统的吞吐量瓶颈往往出现在数据库的访问速度上 随着应用程序的运行,数据库的中的数据会越来越多,处理时间会相应变慢 数据是存放在磁盘上的,读写速度无法和内存相比 如何优化 设计...
相关热词 c# 识别回车 c#生成条形码ean13 c#子控制器调用父控制器 c# 写大文件 c# 浏览pdf c#获取桌面图标的句柄 c# list反射 c# 句柄 进程 c# 倒计时 线程 c# 窗体背景色
立即提问