vs2019配置opencv3.4.5和opencv_contrib-3.4.5编译成功后生成install报错

按照网上的教程cmake成功了,重新生成解决方案也成功了,现在点仅生成install报错,很多回答都是管理员权限,我试了没有用,到底是什么问题啊?卡在这里很长时间了

c++

2个回答

报的什么错你贴出来啊

[ 92%] Built target pch_Generate_opencv_cudaoptflow
[ 92%] Building NVCC (Device) object modules/cudaoptflow/CMakeFiles/cuda_compile_1.dir/src/cuda/cuda_compile_1_generated_pyrlk.cu.o
In file included from /home/agent/opencv-3.4.5/modules/core/include/opencv2/core/cuda/functional.hpp:50:0,
from /home/agent/opencv-3.4.5/modules/cudaoptflow/src/cuda/pyrlk.cu:47:
/usr/local/cuda-10.0/include/device_functions.h:54:2: warning: #warning "device_functions.h is an internal header file and must not be used directly. This file will be removed in a future CUDA release. Please use cuda_runtime_api.h or cuda_runtime.h instead." [-Wcpp]
#warning "device_functions.h is an internal header file and must not be used directly. This file will be removed in a future CUDA release. Please use cuda_runtime_api.h or cuda_runtime.h instead."
^~~~~~~
In file included from /home/agent/opencv-3.4.5/modules/core/include/opencv2/core/cuda/functional.hpp:50:0,
from /home/agent/opencv-3.4.5/modules/cudaoptflow/src/cuda/pyrlk.cu:47:
/usr/local/cuda-10.0/include/device_functions.h:54:2: warning: #warning "device_functions.h is an internal header file and must not be used directly. This file will be removed in a future CUDA release. Please use cuda_runtime_api.h or cuda_runtime.h instead." [-Wcpp]
#warning "device_functions.h is an internal header file and must not be used directly. This file will be removed in a future CUDA release. Please use cuda_runtime_api.h or cuda_runtime.h instead."
^~~~~~~
In file included from /home/agent/opencv-3.4.5/modules/core/include/opencv2/core/cuda/functional.hpp:50:0,
from /home/agent/opencv-3.4.5/modules/cudaoptflow/src/cuda/pyrlk.cu:47:
/usr/local/cuda-10.0/include/device_functions.h:54:2: warning: #warning "device_functions.h is an internal header file and must not be used directly. This file will be removed in a future CUDA release. Please use cuda_runtime_api.h or cuda_runtime.h instead." [-Wcpp]
#warning "device_functions.h is an internal header file and must not be used directly. This file will be removed in a future CUDA release. Please use cuda_runtime_api.h or cuda_runtime.h instead."
^~~~~~~
Killed
CMake Error at cuda_compile_1_generated_pyrlk.cu.o.RELEASE.cmake:281 (message):
Error generating file
/home/agent/opencv-3.4.5/build/modules/cudaoptflow/CMakeFiles/cuda_compile_1.dir/src/cuda/./cuda_compile_1_generated_pyrlk.cu.o

modules/cudaoptflow/CMakeFiles/opencv_cudaoptflow.dir/build.make:648: recipe for target 'modules/cudaoptflow/CMakeFiles/cuda_compile_1.dir/src/cuda/cuda_compile_1_generated_pyrlk.cu.o' failed
make[2]: *** [modules/cudaoptflow/CMakeFiles/cuda_compile_1.dir/src/cuda/cuda_compile_1_generated_pyrlk.cu.o] Error 1
CMakeFiles/Makefile2:9317: recipe for target 'modules/cudaoptflow/CMakeFiles/opencv_cudaoptflow.dir/all' failed
make[1]: *** [modules/cudaoptflow/CMakeFiles/opencv_cudaoptflow.dir/all] Error 2
Makefile:162: recipe for target 'all' failed
make: *** [all] Error 2

liangjingjing1006
liangjingjing1006 大佬看看,什么问题?感觉是说有个.h文件不能使用
2 个月之前 回复
Csdn user default icon
上传中...
上传图片
插入图片
抄袭、复制答案,以达到刷声望分或其他目的的行为,在CSDN问答是严格禁止的,一经发现立刻封号。是时候展现真正的技术了!
其他相关推荐
Myeclipse中maven配置成功后install报错
在Myeclipse中配置maven成功后,点击intall时报如下错误: 解决办法: 1.添加M2_HOME的环境变量 2.Preference->Java->Installed JREs->Edit 选择一个jdk,添加  -Dmaven.multiModuleProjectDirectory=$M2_HOME 添加  -Dmaven.m
opencv3.4.0+opencv_contrib-3.4.0编译后的install
这是opencv3.4.0源码和opencv_contrib-3.4.0扩展包一起编译的,为qt5。 我的编译是为QT5.10.1编译的.
VS2015+OpenCV3.4.1+OpenCV_contrib3.4.1+Win10+Debug下编译生成的install库
VS2015+OpenCV3.4.1+OpenCV_contrib3.4.1+Win10+Debug下编译生成的install库
OpenMVS+VS2015+Windows8配置(编译成功)
其实今天的题目本应是“吾日三省吾身”的,但写了两段之后,感觉含有过多的感慨与抱怨,也许是我自己文笔不够,不能较好的表达我内心的想法吧,所以还是换一个题目,能够让我这篇文章更快通过吧。 oepnMVS的配置。为什么要讲这个,因为openMVS官网介绍的build方法只讲了编译它需要依赖的第三方库与工具,并概略介绍了在Windows,Linux,Mac OS X上编译的方法,实话实说,根据官网的教程...
成功编译后的 spark-2.1.0-bin-2.6.0-cdh5.7.0
慕课网sparksql课程,成功编译后的文件。我自己卡了十多天,终于编译成功,并且可用,分享给大家。
编译成功后的问题
我编译成功后运行java hellojava 为什么老是出错。
EGE在VS2019中的配置
** EGE在VS2019中的配置 ** 下载ege文件 将如图文件夹放入项目根目录 打开解决方案属性 3.1 打开C/C++常规 附加包含目录 添加 3.2 连接器 常规 添加库目录 完成 ...
OpenCV CMake后vs编译INSTALL报错,不成功
环境: 1.系统win7,64位 2.VS2010 3.opencv3.43   错误 error MSB3073: 命令“setlocal1>C:\Program Files (x86)\MSBuild\Microsoft.Cpp\v4.0\Microsoft.CppCommon.targets(113,5): error MSB3073: 命令“setlocal 1>C:...
编译成功,但内存报错~~~~~
截图:rn[img=http://hi.csdn.net/attachment/201007/14/5989796_1279077047fc2i.jpg][/img]rnrn代码编译无错:rn[b]头文件:[/b]rn#ifndef GEOMETRY_Hrn#define GEOMETRY_Hrnrn#include rn#include rn#include rnrnclass Geometry : public QMainWindowrnrn Q_OBJECTrnrnpublic:rn Geometry(QWidget *parent = 0);rn ~Geometry();rnrn QGridLayout *layout;rnrn QLabel *x_Label;rn QLabel *xLabel;rn QLabel *y_Label;rn QLabel *yLabel;rn QLabel *frameGeometry_Label;rn QLabel *frameGeometryLabel;rn QLabel *pos_Label;rn QLabel *posLabel;rn QLabel *geometry_Label;rn QLabel *geometryLabel;rn QLabel *width_Label;rn QLabel *widthLabel;rn QLabel *height_Label;rn QLabel *heightLabel;rn QLabel *rect_Label;rn QLabel *rectLabel;rn QLabel *size_Label;rn QLabel *sizeLabel;rnrn void updateLabel();rnrnprotected:rn void moveEvent(QMoveEvent *);rn void resizeEvent(QResizeEvent *);rnrnrn;rnrn#endif // GEOMETRY_Hrnrnrn[b]执行文件:[/b]rn#include "geometry.h"rnrnGeometry::Geometry(QWidget *parent)rn : QMainWindow(parent)rnrn setWindowTitle(tr("Geometry"));rnrn layout = new QGridLayout(this);rnrn x_Label->setText(tr("x():"));rn layout->addWidget(x_Label,0,0);rn layout->addWidget(xLabel,0,1);rnrn y_Label->setText(tr("y():"));rn layout->addWidget(y_Label,1,0);rn layout->addWidget(yLabel,1,1);rnrn frameGeometry_Label->setText(tr("frameGeometry():"));rn layout->addWidget(frameGeometry_Label,2,0);rn layout->addWidget(frameGeometryLabel,2,1);rnrn pos_Label->setText(tr("pos():"));rn layout->addWidget(pos_Label,3,0);rn layout->addWidget(posLabel,3,1);rnrn geometry_Label->setText(tr("geometry():"));rn layout->addWidget(geometry_Label,4,0);rn layout->addWidget(geometryLabel,4,1);rnrn width_Label->setText(tr("width():"));rn layout->addWidget(width_Label,5,0);rn layout->addWidget(widthLabel,5,1);rnrn height_Label->setText(tr("height():"));rn layout->addWidget(height_Label,6,0);rn layout->addWidget(heightLabel,6,1);rnrn rect_Label->setText(tr("rect():"));rn layout->addWidget(rect_Label,7,0);rn layout->addWidget(rectLabel,7,1);rnrn size_Label->setText(tr("size():"));rn layout->addWidget(size_Label,8,0);rn layout->addWidget(sizeLabel,8,1);rnrn layout->setMargin(15);rn layout->setSpacing(10);rnrn updateLabel();rnrnrnGeometry::~Geometry()rnrnrnrnvoid Geometry::updateLabel()rnrn QString temp;rnrn xLabel->setText(temp.setNum(x()));rnrn yLabel->setText(temp.setNum(y()));rnrn QString fg;rn fg = temp.setNum(frameGeometry().x())+","+rn temp.setNum(frameGeometry().y())+","+rn temp.setNum(frameGeometry().height())+","+rn temp.setNum(frameGeometry().width());rn frameGeometryLabel->setText(fg);rnrn QString po;rn po = temp.setNum(pos().x())+","+rn temp.setNum(pos().y());rn posLabel->setText(po);rnrn QString ge;rn ge = temp.setNum(geometry().x())+","+rn temp.setNum(geometry().y())+","+rn temp.setNum(geometry().height())+","+rn temp.setNum(geometry().width());rn geometryLabel->setText(ge);rnrn widthLabel->setText(temp.setNum(width()));rnrn heightLabel->setText(temp.setNum(height()));rnrn QString re;rn re = temp.setNum(rect().x())+","+rn temp.setNum(rect().y())+","+rn temp.setNum(rect().height())+","+rn temp.setNum(rect().width());rn rectLabel->setText(re);rnrn QString si;rn si = temp.setNum(size().height())+","+rn temp.setNum(size().width());rn sizeLabel->setText(si);rnrnrnvoid Geometry::moveEvent(QMoveEvent *)rnrn updateLabel();rnrnrnvoid Geometry::resizeEvent(QResizeEvent *)rnrn updateLabel();rnrn
Debug下工程编译成功,'Release下编译在报错
情况如标题所说。rn具体报错消息为:rn1>D:\Program Files\Microsoft Visual Studio 9.0\VC\atlmfc\include\afxwin2.inl(46) : error C2084: function 'LRESULT CWnd::SendMessageW(UINT,WPARAM,LPARAM) const' already has a bodyrnrn1>D:\Program Files\Microsoft Visual Studio 9.0\VC\atlmfc\include\afxwin2.inl(46) : error C2264: 'CWnd::SendMessageW' : error in function definition or declaration; function not calledrnrnrn请高手指点下,谢谢。
编译文件时make install报错
在一般用户使用时 正常编译文件四步骤: $ tar -zxvf filename //解压 $ ./configure //去解压目录下执行 $ make //编译所有 $ make install //将编译好的文件进行安装 在执行make install时遇到了下面的错误: [hadoop@hadoop01 ~/tools/xz-5.0.3]$ make install Making ...
编译2.6内核,到make install时报错
更新了moduletools,运行make没问题,到make install时报错说:mkinitrd failed:no BusLogic Module found,在make menuconfig里选了scis BugLogic模块,rn在编译的路径里也有了BugLogic.ko文件,怎么办?
maven编译(install)Java文件时报错
最近从GitHub上下载了bootdo项目来试运行,在用maven的Maven install命令编译文件时,出现了No compiler is provided in this environment. Perhaps you are running on a JRE rather than a JDK?错误,这个错误大概的意思就是“在这个环境中不提供编译器。也许您运行的是JRE而不是JDK”,...
OpenCV3.4.5 +contrib VS2015 win7 编译好的文件
OpenCV3.4.5 +contrib VS2015 win7 编译好的文件,主要在vs2015里面配置环境就好
vs2019编译好的g2o库
vs2019编译的g2o(未编译viewer),Eigen无须编译,官网最新版自行下载吧
fwknop客户端在vs2019上编译
1、下载源代码 下载链接:http://www.cipherdyne.org/fwknop/download/ 2、解压,进入里面win32目录 3、用记事本打开选中文件 找到下明圈出来的位置,并将其中lib修改成common 注:两个文件都要将..\lib\fko_util.h、..\lib\fko_util.c、..\lib\strlcat.c、..\lib\strl...
osg 编译问题 生成install时出错
win7 32位 用vs2013编译osg,ALL_BUILD已经编译完成了 当时在生成INSTALL时出错了![图片说明](https://img-ask.csdn.net/upload/201611/20/1479610165_722515.png)
vc编译问题,Link报错却生成成功
我在编译一个dll工程的时候遇到奇怪的问题,出现下列这种Link错误rnnafxcw.lib(appcore.obj) : error LNK2001: unresolved external symbol ___argvrnrn但是却编译成功了,exp,lib,dll都生成了,请问这是怎么回事?
java:关于已经编译成功生成class文件,却报错找不到
环境:Windows10、jdk-12.0.1 使用terminal编译执行, .java文件compiler成为.class文件,然后就死活报错说找不到类 解决方法: 1、修改环境变量CLASSPATH (没有解决问题) .;%JAVA_HOME% //前面加一个英语句号代表当前文件,和后面的lib用个分号隔开 2、删除你的CLASSPA...
hadoop2.7.2编译成功的一个配置
JDK1.8 protoc 2.5.0 findbugs1.3.9 mavent3.3.9 hadoop2.7.2源码 如下图:
filezilla 登录成功后报错
上传工具filezilla,客户端和服务端都已经配置好。rn但是客户端登录成功后报错:rn响应: 550 User does not have permission to access own home directoryrn错误: 严重错误: 无法连接到服务器rn百度了下说5开头是服务器问题,和文件夹权限有关,但是我已经吧服务端配置的用户和共享文件夹的所有权限都勾选了,晚上的资料太少,找不到对应解决方案,希望能在这里得到帮助,谢谢大家!rn登录日志我已经截图,见附件[img=https://img-bbs.csdn.net/upload/201706/01/1496301032_702937.png][/img]
OpenCV3.4.5官方文档
OpenCV3.4.5官方文档,主要api介绍及代码展示,简单的理论介绍,英文原版
编译生成可执行文件后......
在PB7.0中编译生成exe文件,exe文件在运行时还需要几个PB的链接dll文件,是哪几个呢?rn另外数据库的连接在程序中是写死的,则在运行前先要配置ODBC,该怎么配呢?为什么配了之后,还是提示连接不上数据库,但在PB中直接运行则可连上。
EJB编译成功后的疑问
EJB编译成功后,把那些编译了的文件怎么处理?把那些文件放到哪里去呢?请那些高手过来详细回答
SVN检索项目后install报错解决办法!
1.如何从SVN中检出项目,我之前的一篇博客已经有操作步骤了。 2.下面如果检出项目后,install报错,看控制台式缺少什么jar包,然后去仓库中能找到对应的jar包,说明仓库的jar没有加载进来。 此时按照控制台提示,在仓库中找到对应的jar包,删除除了jar包的其他配置文件。 3.回到eclipse中如下操作: 点击ok,之后再install,发现就成功了。而且仓库中对应ja...
vs编译生成之后报错
严重性 代码 说明 项目 文件行禁止显示状态错误 CS2001 Source file 'D:\Local\Apright_LW-Wiseb2b\Feekong.Model\obj\Release\TemporaryGeneratedFile_E7A71F73-0F8D-4B9B-B56E-8E70B10BC5D3.cs' could not be found.BPM.ModelD:\Local\...
WebApi 还原了程序集后编译成功,但浏览报错
![图片说明](https://img-ask.csdn.net/upload/201712/05/1512455183_928221.png)nnn我用 Update-Package -ProjectName 'WebApi' -Reinstall还原了程序集之后编辑生成成功了,但是预览报错
vs2017+qt5.10.1配置后报错
如标题所说,配置好之后打算调试代码是弹出了一个对话框“”Qt VS ToolsrnThe fol lowing error occurred:rnCannot connect to Appwrapper.Please make sure that TCP portrn12015 is not blocked.rn[/img]“”[img=https://img-bbs.csdn.net/upload/201805/15/1526363926_506018.png][/img][img=https://img-bbs.csdn.net/upload/201805/15/1526364056_597462.jpg][/img]rnrnrn我并没有安装任何360软件,更别说安装360wifi了。希望看到这个贴的大佬,帮我看看是什么问题
WIN10+VS2017下opencv3.1.0 contrib编译后install文件
WIN10+VS2017下opencv3.1.0 contrib编译后install文件,懂opencv的人自然懂。
vs2019永久配置opencv开发环境
有很多同学肯定想学习opencv相关的知识,但是有些情况下每建一次项目都要重新引入下各种文件是不是很苦恼,所以我也面临了这个问题,在网上看到很多的同学的方法,有的也都是很一样的,将什么.dll加入环境变量,然后设置项目配置文件什么的,这些东西我也尝试过,但是很容易忘记,我也特意写了一些笔记,但是有时还是会忘记。 恰巧我也升级了vs2019,所以也打算更新下方法,做到一劳永逸。下面是教程部分。 首先...
vs2019配置opencv4.1.0过程记录
1.首先安装好vs2019和opencv4.1.0,此处不再赘述 2.环境变量配置 3.VS创建C++项目 4.VS配置 具体配置 5.编写程序测试 #include<opencv2/opencv.hpp> using namespace cv; int main() { Mat girl = imread("images.jpg"); //载入图像到Mat ims...
opencv的 opencv_contrib-3.4.5源码
opencv-3.4.5对应的额外源码 opencv_contrib源码,需要可下载用
Visual Assist X 支持VS2019 亲测成功
亲自测试 vs2017 vs2019 成功,大家下载验证成功 给个好评
linux 下mysql安装成功后的配置
mysql5.6配置优化: http://www.cnblogs.com/littlehb/archive/2013/04/06/3001975.html (推荐) http://www.jb51.net/article/50918.htm http://www.jb51.net/article/47419.htm http://linux.cn/article-3912-1.html...
pb8.0编译后报错!急!
pb8.0编译后报错,我有2个pbl,main.pbl和fun.pbl,将fun.pbl加到main.pbl的rnliberay中,我在main.pbl中调用fun.pbl的函数,编译通过。运行时报错,说rn找不到我在main.pbl中调用的fun.pbl的函数,是什么原因?我以前用6.5一直好好的。
急,编译后连接数据库报错!!!
我编写了一个基于PFC的应用程序,在PB环境中运行正常,但编译后运行时连接数据库出错,错误信息:DBMS is not supported in your current installation.rn 我用的是PB7.0和SQL SERVER2000。rn  请高手指教!!!rn
专程请教!编译后报错!
重装VF了,还是没用!rn编译后,运行EXE时报'Visual Foxpro cannot start.Could not load resources.'rnrn研究好多天了,始终没有结果.请大师帮忙了!rn拜托了~
关于资源文件 编译后 报错
看了各位朋友的文章,我收益非浅rnrn学会了用软件 Resourcer 生成 资源文件 *.resources rn并学会 在工程中 添加 —》添加现有项 —》选择我的资源文件 —》生成操作—》嵌入的资源 rnrn我在程序中,成功使用了资源文件中的图片,和图标等等rnrn//使用图片资源rn ResourceManager rm = new ResourceManager("WindowsApplication12.aaa",Assembly.GetEntryAssembly());rn //图片rn this.pictureBox1.Image = (Image)rm.GetObject("b.jpg");rn //图标rn this.Icon=(Icon)rm.GetObject("c.ico");rnrn可是当我生成可执行文件的以后,执行却提示说没有成功引用 resources 文件rnrncsc c:\a\form1.csrncsc /resources:c:\a\a.resources c:\a\form1.csrnrn我都能成功生成form1.exe 但是执行的时候提示 rn未能在给定的程序集中找到任何适用于指定的区域性(或非特定区域性)的资源。请确保已将"WindowsApplication12.aaa.resources"正确嵌入或连接到程序集"Form1"。rnrn出错框点继续 ,就没有图片,但可以正常运行rnrn希望有清楚的朋友给予帮助,我的确找不到答案才问的rnrn
npm install 报错的解决办法
使用 淘宝的 cnpm 替代原来的 npm (http://npm.taobao.org/)原来的错误消失
在windows下 mysql源代码编译成功后如何配置服务器
我已下载mysql-4.0.16源代码 在windows环境下 用vc6.0已编译成功 rn请问源代码环境下 如何配置服务器参数(连接) rn以及如何在配置好的环境下创建表? rn谢谢
相关热词 c# 标准差 计算 c#siki第五季 c#入门推荐书 c# 解码海康数据流 c# xml的遍历循环 c# 取 查看源码没有的 c#解决高并发 委托 c#日期转化为字符串 c# 显示问号 c# 字典对象池