anconda更新后出现OSError[Winerror 126]找不到指定模块该如何解决?

如题,以下为报错
Traceback (most recent call last):
File "F:\a\lib\site-packages\conda\exceptions.py", line 1043, in call
return func(*args, **kwargs)
File "F:\a\lib\site-packages\conda\cli\main.py", line 84, in main
exit_code = do_call(args, p)
File "F:\a\lib\site-packages\conda\cli\conda_argparse.py", line 80, in do_call
module = import_module(relative_mod, __name
_.rsplit('.', 1)[0])
File "F:\a\lib\importlib__init__.py", line 127, in import_module
return bootstrap._gcd_import(name[level:], package, level)
File "", line 1006, in _gcd_import
File "", line 983, in _find_and_load
File "", line 967, in _find_and_load_unlocked
File "", line 677, in _load_unlocked
File "", line 728, in exec_module
File "", line 219, in _call_with_frames_removed
File "F:\a\lib\site-packages\conda\cli\main_install.py", line 8, in
from .install import install
File "F:\a\lib\site-packages\conda\cli\install.py", line 19, in
from ..core.index import calculate_channel_urls, get_index
File "F:\a\lib\site-packages\conda\core\index.py", line 9, in
from .package_cache_data import PackageCacheData
File "F:\a\lib\site-packages\conda\core\package_cache_data.py", line 15, in
from conda_package_handling.api import InvalidArchiveError
File "F:\a\lib\site-packages\conda_package_handling\api.py", line 3, in
from libarchive.exception import ArchiveError as _LibarchiveArchiveError
File "F:\a\lib\site-packages\libarchive\
_init__.py", line 1, in
from .entry import ArchiveEntry
File "F:\a\lib\site-packages\libarchive\entry.py", line 6, in
from . import ffi
File "F:\a\lib\site-packages\libarchive\ffi.py", line 27, in
libarchive = ctypes.cdll.LoadLibrary(libarchive_path)
File "F:\a\lib\ctypes__init__.py", line 434, in LoadLibrary
return self._dlltype(name)
File "F:\a\lib\ctypes__init__.py", line 356, in init
self._handle = _dlopen(self._name, mode)
OSError: [WinError 126] 找不到指定的模块。

During handling of the above exception, another exception occurred:

Traceback (most recent call last):
File "F:\a\Scripts\conda-script.py", line 12, in
sys.exit(main())
File "F:\a\lib\site-packages\conda\cli\main.py", line 150, in main
return conda_exception_handler(_main, *args, **kwargs)
File "F:\a\lib\site-packages\conda\exceptions.py", line 1335, in conda_exception_handler
return_value = exception_handler(func, *args, **kwargs)
File "F:\a\lib\site-packages\conda\exceptions.py", line 1046, in call
return self.handle_exception(exc_val, exc_tb)
File "F:\a\lib\site-packages\conda\exceptions.py", line 1090, in handle_exception
return self.handle_unexpected_exception(exc_val, exc_tb)
File "F:\a\lib\site-packages\conda\exceptions.py", line 1101, in handle_unexpected_exception
self.print_unexpected_error_report(error_report)
File "F:\a\lib\site-packages\conda\exceptions.py", line 1171, in print_unexpected_error_report
from .cli.main_info import get_env_vars_str, get_main_info_str
File "F:\a\lib\site-packages\conda\cli\main_info.py", line 19, in
from ..core.index import supplement_index_with_system
File "F:\a\lib\site-packages\conda\core\index.py", line 9, in
from .package_cache_data import PackageCacheData
File "F:\a\lib\site-packages\conda\core\package_cache_data.py", line 15, in
from conda_package_handling.api import InvalidArchiveError
File "F:\a\lib\site-packages\conda_package_handling\api.py", line 7, in
from .tarball import CondaTarBZ2 as _CondaTarBZ2
File "F:\a\lib\site-packages\conda_package_handling\tarball.py", line 7, in
import libarchive
File "F:\a\lib\site-packages\libarchive\
_init__.py", line 1, in
from .entry import ArchiveEntry
File "F:\a\lib\site-packages\libarchive\entry.py", line 6, in
from . import ffi
File "F:\a\lib\site-packages\libarchive\ffi.py", line 27, in
libarchive = ctypes.cdll.LoadLibrary(libarchive_path)
File "F:\a\lib\ctypes__init__.py", line 434, in LoadLibrary
return self._dlltype(name)
File "F:\a\lib\ctypes__init__.py", line 356, in init
self._handle = _dlopen(self._name, mode)
OSError: [WinError 126] 找不到指定的模块。

davidwmyz
davidwmyz 我凡是遇到这种问题都是下载到本地再安装
6 个月之前 回复
weixin_43091381
米米碰碰碰 我也是这个问题咋整
7 个月之前 回复
qq_42194739
艾特小七 你好,这个问题你解决了么?
10 个月之前 回复
michael625
michaelyryi 问题解决了吗?
10 个月之前 回复
A1031091451
A1031091451 我也是出现了这样的问题
10 个月之前 回复
qq_42676681
qq_42676681 请问解决了嘛?我也出现这样的问题
10 个月之前 回复
Here4626
Here4626 请问解决了吗
10 个月之前 回复

1个回答

Csdn user default icon
上传中...
上传图片
插入图片
抄袭、复制答案,以达到刷声望分或其他目的的行为,在CSDN问答是严格禁止的,一经发现立刻封号。是时候展现真正的技术了!
其他相关推荐
OSError: [WinError 193] %1 不是有效的 Win32 应用程序。

python运行脚本出现以上提示。网上没有找到64位python,如有资源,请分享一下~~~~

ImportError: DLL load failed: 找不到指定的模块。

![图片说明](https://img-ask.csdn.net/upload/201608/01/1470040303_445967.png) caffe,,python,这是怎么回事,ImportError: DLL load failed: 找不到指定的模块。

anconda安装的tensorflow版本出错

在anancoda中新建了一个环境,然后安装了tensorflow1.14.0 ![图片说明](https://img-ask.csdn.net/upload/202003/05/1583397096_42161.png) 但在notebook里,显示的却是2.1版本的 ``` import tensorflow as tf data1 = tf.constant(2.5) data2 = tf.constant(3.5) # from tensorflow.contrib.layers import layers # regularizer = ((tf.nn.l2_loss(a) * 2) ** 0.5) * 0.5 * 0.0005 # regularizer = layers.l2_regularizer(0.0005) print(tf.__version__) ``` 输出是2.1.0,确认运行的是正确环境下的notebook,请问如何解决?

安装完Anaconda3后,使用conda指令安装库文件出现问题

使用conda指令安装库文件出现问题 使用 conda install numpy 出现如下问题 ![图片说明](https://img-ask.csdn.net/upload/201902/27/1551255959_289601.jpg)

Anaconda无法打开Spyder?已尝试使用https://blog.csdn.net/qq_21420941/article/details/101676113的方法。

错误提示: ``` (base) C:\Users\11>spyder --new-instance Traceback (most recent call last): File "C:\ProgramData\Anaconda3\Scripts\spyder-script.py", line 10, in <module> sys.exit(main()) File "C:\ProgramData\Anaconda3\lib\site-packages\spyder\app\start.py", line 215, in main from spyder.app import mainwindow File "C:\ProgramData\Anaconda3\lib\site-packages\spyder\app\mainwindow.py", line 167, in <module> from spyder.utils.environ import WinUserEnvDialog File "C:\ProgramData\Anaconda3\lib\site-packages\spyder\utils\environ.py", line 19, in <module> from spyder.plugins.variableexplorer.widgets.collectionseditor import ( File "C:\ProgramData\Anaconda3\lib\site-packages\spyder\plugins\variableexplorer\widgets\collectionseditor.py", line 57, in <module> from spyder.plugins.variableexplorer.widgets.collectionsdelegate import ( File "C:\ProgramData\Anaconda3\lib\site-packages\spyder\plugins\variableexplorer\widgets\collectionsdelegate.py", line 31, in <module> from spyder.plugins.variableexplorer.widgets.objectexplorer.attribute_model \ File "C:\ProgramData\Anaconda3\lib\site-packages\spyder\plugins\variableexplorer\widgets\objectexplorer\__init__.py", line 19, in <module> from .attribute_model import DEFAULT_ATTR_COLS, DEFAULT_ATTR_DETAILS File "C:\ProgramData\Anaconda3\lib\site-packages\spyder\plugins\variableexplorer\widgets\objectexplorer\attribute_model.py", line 29, in <module> import numpy as np File "C:\Users\11\AppData\Roaming\Python\Python37\site-packages\numpy\__init__.py", line 140, in <module> from . import _distributor_init File "C:\Users\11\AppData\Roaming\Python\Python37\site-packages\numpy\_distributor_init.py", line 26, in <module> WinDLL(os.path.abspath(filename)) File "C:\ProgramData\Anaconda3\lib\ctypes\__init__.py", line 364, in __init__ self._handle = _dlopen(self._name, mode) OSError: [WinError 193] %1 不是有效的 Win32 应用程序。 (base) C:\Users\11> (base) C:\Users\11> (base) C:\Users\11>spyder --new-instancespyder --new-instance usage: spyder [options] files spyder: error: unrecognized arguments: --new-instancespyder (base) C:\Users\11> (base) C:\Users\11>conda remove QtPy PyQt5 Collecting package metadata (repodata.json): done Solving environment: failed PackagesNotFoundError: The following packages are missing from the target environment: - pyqt5 (base) C:\Users\11> (base) C:\Users\11>pip unstall QtPy PyQt5 ERROR: unknown command "unstall" - maybe you meant "uninstall" (base) C:\Users\11> (base) C:\Users\11> .android '.android' 不是内部或外部命令,也不是可运行的程序 或批处理文件。 (base) C:\Users\11>pip uninstall QtPy PyQt5 Found existing installation: QtPy 1.9.0 Uninstalling QtPy-1.9.0: Would remove: c:\programdata\anaconda3\lib\site-packages\qtpy-1.9.0.dist-info\* c:\programdata\anaconda3\lib\site-packages\qtpy\* Proceed (y/n)? Y ERROR: Exception: Traceback (most recent call last): File "C:\ProgramData\Anaconda3\lib\shutil.py", line 566, in move os.rename(src, real_dst) PermissionError: [WinError 5] 拒绝访问。: 'c:\\programdata\\anaconda3\\lib\\site-packages\\qtpy-1.9.0.dist-info\\' -> 'c:\\programdata\\anaconda3\\lib\\site-packages\\~tpy-1.9.0.dist-info' During handling of the above exception, another exception occurred: Traceback (most recent call last): File "C:\ProgramData\Anaconda3\lib\site-packages\pip\_internal\cli\base_command.py", line 186, in _main status = self.run(options, args) File "C:\ProgramData\Anaconda3\lib\site-packages\pip\_internal\commands\uninstall.py", line 79, in run auto_confirm=options.yes, verbose=self.verbosity > 0, File "C:\ProgramData\Anaconda3\lib\site-packages\pip\_internal\req\req_install.py", line 687, in uninstall uninstalled_pathset.remove(auto_confirm, verbose) File "C:\ProgramData\Anaconda3\lib\site-packages\pip\_internal\req\req_uninstall.py", line 394, in remove moved.stash(path) File "C:\ProgramData\Anaconda3\lib\site-packages\pip\_internal\req\req_uninstall.py", line 283, in stash renames(path, new_path) File "C:\ProgramData\Anaconda3\lib\site-packages\pip\_internal\utils\misc.py", line 334, in renames shutil.move(old, new) File "C:\ProgramData\Anaconda3\lib\shutil.py", line 578, in move rmtree(src) File "C:\ProgramData\Anaconda3\lib\shutil.py", line 516, in rmtree return _rmtree_unsafe(path, onerror) File "C:\ProgramData\Anaconda3\lib\shutil.py", line 400, in _rmtree_unsafe onerror(os.unlink, fullname, sys.exc_info()) File "C:\ProgramData\Anaconda3\lib\shutil.py", line 398, in _rmtree_unsafe os.unlink(fullname) PermissionError: [WinError 5] 拒绝访问。: 'c:\\programdata\\anaconda3\\lib\\site-packages\\qtpy-1.9.0.dist-info\\AUTHORS.md' ``` 各位大佬 求解!

python爬虫中用xpath总是获取不到内容,希望大家帮我看看这两个网页中所需内容如何定位?谢谢~

用python爬虫,代码用xpath总是获取不到内容,希望大家帮我看看这两个网页中所需内容如何定位? 1.想要获取下面网址中的 债券基本信息 ,试了很多xpath的路径都失败了,都是空的_(¦3」∠)_,下面贴出测试用的代码,希望大家能帮我看下xpath那部分为什么不对(倒数第二行),也可能是其他问题o(╥﹏╥)o ``` import requests from lxml import html url = 'http://www.chinamoney.com.cn/chinese/zqjc/?bondDefinedCode=1000040278' page = requests.Session().get(url) tree = html.fromstring(page.text) result = tree.xpath('//tbody//tr//th/text()') print(result) ``` 2.想要获取下面网址中的一个href属性 (截图中阴影部分,就是查询结果的网址),也试了很多xpath的路径也都失败了,不知道@href前应该写什么。 ![图片说明](https://img-ask.csdn.net/upload/201903/27/1553648799_758977.png) ``` url = 'http://www.chinamoney.com.cn/chinese/qwjsn/?searchValue=14中关村集MTN001' ``` 第一次提问,有什么不合适的希望谅解,工作需要,时间比较急切,麻烦大家了。━((*′д`)爻(′д`*))━!!!!

anconda下import theano出错

我在window下安装了anconda,mingw,libpython和theano用conda list都可以看到,可是在ipython下import theano出现如下错误 Exception Traceback (most recent call last) <ipython-input-1-3397704bd624> in <module>() ----> 1 import theano D:\Program Files\Anaconda2\lib\site-packages\theano\__init__.pyc in <module>() 61 object2, utils) 62 ---> 63 from theano.compile import ( 64 SymbolicInput, In, 65 SymbolicOutput, Out, D:\Program Files\Anaconda2\lib\site-packages\theano\compile\__init__.py in <module>() 7 SpecifyShape, specify_shape, register_specify_shape_c_code) 8 ----> 9 from theano.compile.function_module import * 10 11 from theano.compile.mode import * D:\Program Files\Anaconda2\lib\site-packages\theano\compile\function_module.py in <module>() 20 from theano.compat import izip 21 from theano.gof import graph ---> 22 import theano.compile.mode 23 from theano.compile.io import ( 24 In, SymbolicInput, SymbolicInputKit, SymbolicOutput) D:\Program Files\Anaconda2\lib\site-packages\theano\compile\mode.py in <module>() 10 import theano 11 from theano import gof ---> 12 import theano.gof.vm 13 from theano.configparser import config 14 from theano.compile.ops import _output_guard D:\Program Files\Anaconda2\lib\site-packages\theano\gof\vm.py in <module>() 636 637 try: --> 638 from . import lazylinker_c 639 640 class CVM(lazylinker_c.CLazyLinker, VM): D:\Program Files\Anaconda2\lib\site-packages\theano\gof\lazylinker_c.py in <module>() 124 args = cmodule.GCC_compiler.compile_args() 125 cmodule.GCC_compiler.compile_str(dirname, code, location=loc, --> 126 preargs=args) 127 # Save version into the __init__.py file. 128 init_py = os.path.join(loc, '__init__.py') D:\Program Files\Anaconda2\lib\site-packages\theano\gof\cmodule.pyc in compile_str(module_name, src_code, location, include_dirs, lib_dirs, libs, preargs, py_module, hide_symbols) 2194 # difficult to read. 2195 raise Exception('Compilation failed (return status=%s): %s' % -> 2196 (status, compile_stderr.replace('\n', '. '))) 2197 elif config.cmodule.compilation_warning and compile_stderr: 2198 # Print errors just below the command line. . ception: Compilation failed (return status=1): g++.exe: error: Files\Anaconda2\MinGW: No such file or directory 哪位大侠能帮我看下什么问题?谢谢

Anaconda安装后安装目录下缺失文件

![图片说明](https://img-ask.csdn.net/upload/201912/30/1577699395_797615.png) 如题,安装后安装目录下没有scripts、Library等目录,同时多出大量.cph结尾的文件夹。 尝试过https://blog.csdn.net/cplover25/article/details/102829786 博主提供的方法,用管理员权限进行所有用户的配置,还尝试了Just Me配置,都没有改变。

如何在anconda show +package name 的结果中选择安装包的版本?

我最近想学习hmm,在安装hmmlearn包时,我使用了anaconda show conda-forge/hmmlearn 得到它的下载途径,见下图 ![图片说明](https://img-ask.csdn.net/upload/201906/25/1561430116_882949.jpg) 下面的提示说,只要把run下面的语句: ``` conda install --channel https://conda.anaconda.org/conda-forge hmmlearn ```运行即可,但它安装完之后的hmmlearn版本是0.2.1的。我想安装0.2.0版本的,需要怎么改写这条语句呢?

Anaconda3卸载后再安装出错该如何解决

![图片说明](https://img-ask.csdn.net/upload/201908/28/1567005406_791004.png) 如上图,用的是官网的安装包,之前曾经安装过Anaconda,后来由于未知的原因,,每次软件启动出现Application installing的问题,从而卸载,然重新安装的时候就发现安装包解析的文件就严重缺少,同时,找不到任何可以启动anaconda的文件,更不见anaconda navigation.感觉应该是删除不完全导致的,请大佬指点下该如何改。

Pycharm创建Django项目时配置虚拟环境报错

![首先使用代码创建django项目](https://img-ask.csdn.net/upload/201905/17/1558093614_505782.png) ![配置虚拟环境](https://img-ask.csdn.net/upload/201905/17/1558093695_325078.png)![出现以上错误](https://img-ask.csdn.net/upload/201905/17/1558093703_228820.png) anconda 是最新的 19.03版本 Python 3.7.3 pycharm 是专业版 19.02版本 Django 2.0.7 如图,问这个怎么办? 出现这个问题是因为我原来的Django在虚拟环境运行时候找不到指定模块,所以重装了。但是重装之后出现这个问题,求大神解决!

在使用anconda的matploylib时出现"namespace这样的错误,请问是什么原因?该如何解决?

在我的电脑上运行一下代码时报错: 代码 ``` import matplotlib.pyplot as plt squres=[1,4,9,16,25] plt.plot(squres) plt.show( ) ``` 这是报错: ![图片说明](https://img-ask.csdn.net/upload/202001/03/1578042212_463527.png) 在别人的电脑上运行(同样的代码)结果: ![图片说明](https://img-ask.csdn.net/upload/202001/03/1578042322_446180.jpg) 请问该怎么解决?什么原因?报错是什么意思呢?

关于pip和conda遇到的问题

今天在写CNN分类时,需要import theano相关 而这里边遇到的坑就很多了,不过现在最大的问题是下边这个 在安装库的过程中,发现自己遇到了问题,无论是pip install 还是conda install,都会出现疑似无法寻找到匹配文件的问题,比如在网页里确信0x存在的,我用pip安装,会出现cannot fetch index base URL…… 用conda安装文件时会出现Error:HTTPError:403 Forbidden…… 我怀疑我遇到的是同样的问题,如图所示 ![图片说明](https://img-ask.csdn.net/upload/201812/28/1545994221_80384.png) 无论安装什么都会出现这样的问题,不论翻墙不翻墙。 非常急,希望有见过这类情况的好心大佬解惑 ps:寻找过一些解决办法,也有人说是ie浏览器缓存过多,删过缓存了还是这样 ps:本来之前用pip命令安装过很多库的,不知道什么时候就不行了,也可能和安装anaconda有关 ps:win7 64位环境

conda list里面已经安装了seaborn,但是pycharm里面无法使用,求助怎么解决

pycharm使用的编译器是Anaconda2,版本3.6;conda list现实已经安装了seaborn;但是在pycharm里面无法使用seaborn,附图,怎么解决?求大佬指点![图片说明](https://img-ask.csdn.net/upload/202002/21/1582214736_489795.png)

tensorflow环境下VS编译安装pycocotools提示缺失cl.exe

在base环境中安装pycocotools成功。 但是在python3.5 TensorFlow环境下无法编译,提示缺失cl.exe文件。 安装VS的时候有选择c++ 选项,base环境下安装也成功。不知道为什么在TensorFlow环境下就提示缺少cl.exe。其实文件夹里cl.exe是存在的。 不知道是环境配置的原因还是别的。。。

小白求助 anaconda创建环境一直没有下一步

输入命令创建环境 ``` conda create -n tensorflow python=3.6 ``` 没有下一步 只有两个done ![图片说明](https://img-ask.csdn.net/upload/202002/19/1582092666_457190.png) 按照提示更新 ![图片说明](https://img-ask.csdn.net/upload/202002/19/1582092728_440532.png) 却还要我更新 求助啊 困在这里好久了

Anaconda的Navigator打不开,开始会出现图标,显示initializing后就没有任何反应了,网上看的办法都试了还是不行,快要崩溃了呜呜呜

![图片说明](https://img-ask.csdn.net/upload/202003/07/1583543986_316031.jpg)

anconda在import theano失败,求大神帮助!!

=============================== Problem occurred during compilation with the command line below: C:\MinGW\bin\g++.exe -shared -g -march=core-avx2 -mcx16 -msahf -mmovbe -maes -mpclmul -mpopcnt -mabm -mno-lwp -mno-fma -mno-fma4 -mn o-xop -mbmi -mbmi2 -mno-tbm -mno-avx -mno-avx2 -msse4.2 -msse4.1 -mlzcnt -mno-rtm -mno-hle -mrdrnd -mf16c -mfsgsbase -mno-rdseed -mn o-prfchw -mno-adx -mfxsr -mno-xsave -mno-xsaveopt --param l1-cache-size=32 --param l1-cache-line-size=64 --param l2-cache-size=3072 -mtune=core-avx2 -D NPY_NO_DEPRECATED_API=NPY_1_7_API_VERSION -m64 -DMS_WIN64 -IC:\Anaconda\lib\site-packages\numpy\core\include -IC :\Anaconda\include -o C:\Users\Jim\AppData\Local\Theano\compiledir_Windows-7-6.1.7600-Intel64_Family_6_Model_60_Stepping_3_GenuineIn tel-2.7.9-64\lazylinker_ext\lazylinker_ext.pyd C:\Users\Jim\AppData\Local\Theano\compiledir_Windows-7-6.1.7600-Intel64_Family_6_Mode l_60_Stepping_3_GenuineIntel-2.7.9-64\lazylinker_ext\mod.cpp -LC:\Anaconda\libs -LC:\Anaconda -lpython27 C:\Users\Jim\AppData\Local\Temp\cc4OSOrg.o: In function `unpack_list_of_ssize_t': C:/Users/Jim/AppData/Local/Theano/compiledir_Windows-7-6.1.7600-Intel64_Family_6_Model_60_Stepping_3_GenuineIntel-2.7.9-64/lazylinke r_ext/mod.cpp:58: undefined reference to `__imp_PyExc_TypeError' C:/Users/Jim/AppData/Local/Theano/compiledir_Windows-7-6.1.7600-Intel64_Family_6_Model_60_Stepping_3_GenuineIntel-2.7.9-64/lazylinke r_ext/mod.cpp:68: undefined reference to `__imp_PyExc_IndexError' C:\Users\Jim\AppData\Local\Temp\cc4OSOrg.o: In function `CLazyLinker_init':

pyqt打包,出现问题,不知道怎样解决

使用pyinstaller 打包时出现错误 ``` Unable to find "D:\anaconda3\lib\site-packages\PyQt5\Qt\translations\qtwebengine_locales" when adding binary and data files. ```

在中国程序员是青春饭吗?

今年,我也32了 ,为了不给大家误导,咨询了猎头、圈内好友,以及年过35岁的几位老程序员……舍了老脸去揭人家伤疤……希望能给大家以帮助,记得帮我点赞哦。 目录: 你以为的人生 一次又一次的伤害 猎头界的真相 如何应对互联网行业的「中年危机」 一、你以为的人生 刚入行时,拿着傲人的工资,想着好好干,以为我们的人生是这样的: 等真到了那一天,你会发现,你的人生很可能是这样的: ...

程序员请照顾好自己,周末病魔差点一套带走我。

程序员在一个周末的时间,得了重病,差点当场去世,还好及时挽救回来了。

技术大佬:我去,你写的 switch 语句也太老土了吧

昨天早上通过远程的方式 review 了两名新来同事的代码,大部分代码都写得很漂亮,严谨的同时注释也很到位,这令我非常满意。但当我看到他们当中有一个人写的 switch 语句时,还是忍不住破口大骂:“我擦,小王,你丫写的 switch 语句也太老土了吧!” 来看看小王写的代码吧,看完不要骂我装逼啊。 private static String createPlayer(PlayerTypes p...

和黑客斗争的 6 天!

互联网公司工作,很难避免不和黑客们打交道,我呆过的两家互联网公司,几乎每月每天每分钟都有黑客在公司网站上扫描。有的是寻找 Sql 注入的缺口,有的是寻找线上服务器可能存在的漏洞,大部分都...

上班一个月,后悔当初着急入职的选择了

最近有个老铁,告诉我说,上班一个月,后悔当初着急入职现在公司了。他之前在美图做手机研发,今年美图那边今年也有一波组织优化调整,他是其中一个,在协商离职后,当时捉急找工作上班,因为有房贷供着,不能没有收入来源。所以匆忙选了一家公司,实际上是一个大型外包公司,主要派遣给其他手机厂商做外包项目。**当时承诺待遇还不错,所以就立马入职去上班了。但是后面入职后,发现薪酬待遇这块并不是HR所说那样,那个HR自...

女程序员,为什么比男程序员少???

昨天看到一档综艺节目,讨论了两个话题:(1)中国学生的数学成绩,平均下来看,会比国外好?为什么?(2)男生的数学成绩,平均下来看,会比女生好?为什么?同时,我又联想到了一个技术圈经常讨...

总结了 150 余个神奇网站,你不来瞅瞅吗?

原博客再更新,可能就没了,之后将持续更新本篇博客。

副业收入是我做程序媛的3倍,工作外的B面人生是怎样的?

提到“程序员”,多数人脑海里首先想到的大约是:为人木讷、薪水超高、工作枯燥…… 然而,当离开工作岗位,撕去层层标签,脱下“程序员”这身外套,有的人生动又有趣,马上展现出了完全不同的A/B面人生! 不论是简单的爱好,还是正经的副业,他们都干得同样出色。偶尔,还能和程序员的特质结合,产生奇妙的“化学反应”。 @Charlotte:平日素颜示人,周末美妆博主 大家都以为程序媛也个个不修边幅,但我们也许...

如果你是老板,你会不会踢了这样的员工?

有个好朋友ZS,是技术总监,昨天问我:“有一个老下属,跟了我很多年,做事勤勤恳恳,主动性也很好。但随着公司的发展,他的进步速度,跟不上团队的步伐了,有点...

我入职阿里后,才知道原来简历这么写

私下里,有不少读者问我:“二哥,如何才能写出一份专业的技术简历呢?我总感觉自己写的简历太烂了,所以投了无数份,都石沉大海了。”说实话,我自己好多年没有写过简历了,但我认识的一个同行,他在阿里,给我说了一些他当年写简历的方法论,我感觉太牛逼了,实在是忍不住,就分享了出来,希望能够帮助到你。 01、简历的本质 作为简历的撰写者,你必须要搞清楚一点,简历的本质是什么,它就是为了来销售你的价值主张的。往深...

外包程序员的幸福生活

今天给你们讲述一个外包程序员的幸福生活。男主是Z哥,不是在外包公司上班的那种,是一名自由职业者,接外包项目自己干。接下来讲的都是真人真事。 先给大家介绍一下男主,Z哥,老程序员,是我十多年前的老同事,技术大牛,当过CTO,也创过业。因为我俩都爱好喝酒、踢球,再加上住的距离不算远,所以一直也断断续续的联系着,我对Z哥的状况也有大概了解。 Z哥几年前创业失败,后来他开始干起了外包,利用自己的技术能...

优雅的替换if-else语句

场景 日常开发,if-else语句写的不少吧??当逻辑分支非常多的时候,if-else套了一层又一层,虽然业务功能倒是实现了,但是看起来是真的很不优雅,尤其是对于我这种有强迫症的程序"猿",看到这么多if-else,脑袋瓜子就嗡嗡的,总想着解锁新姿势:干掉过多的if-else!!!本文将介绍三板斧手段: 优先判断条件,条件不满足的,逻辑及时中断返回; 采用策略模式+工厂模式; 结合注解,锦...

深入剖析Springboot启动原理的底层源码,再也不怕面试官问了!

大家现在应该都对Springboot很熟悉,但是你对他的启动原理了解吗?

离职半年了,老东家又发 offer,回不回?

有小伙伴问松哥这个问题,他在上海某公司,在离职了几个月后,前公司的领导联系到他,希望他能够返聘回去,他很纠结要不要回去? 俗话说好马不吃回头草,但是这个小伙伴既然感到纠结了,我觉得至少说明了两个问题:1.曾经的公司还不错;2.现在的日子也不是很如意。否则应该就不会纠结了。 老实说,松哥之前也有过类似的经历,今天就来和小伙伴们聊聊回头草到底吃不吃。 首先一个基本观点,就是离职了也没必要和老东家弄的苦...

2020阿里全球数学大赛:3万名高手、4道题、2天2夜未交卷

阿里巴巴全球数学竞赛( Alibaba Global Mathematics Competition)由马云发起,由中国科学技术协会、阿里巴巴基金会、阿里巴巴达摩院共同举办。大赛不设报名门槛,全世界爱好数学的人都可参与,不论是否出身数学专业、是否投身数学研究。 2020年阿里巴巴达摩院邀请北京大学、剑桥大学、浙江大学等高校的顶尖数学教师组建了出题组。中科院院士、美国艺术与科学院院士、北京国际数学...

男生更看重女生的身材脸蛋,还是思想?

往往,我们看不进去大段大段的逻辑。深刻的哲理,往往短而精悍,一阵见血。问:产品经理挺漂亮的,有点心动,但不知道合不合得来。男生更看重女生的身材脸蛋,还是...

为什么程序员做外包会被瞧不起?

二哥,有个事想询问下您的意见,您觉得应届生值得去外包吗?公司虽然挺大的,中xx,但待遇感觉挺低,马上要报到,挺纠结的。

当HR压你价,说你只值7K,你该怎么回答?

当HR压你价,说你只值7K时,你可以流畅地回答,记住,是流畅,不能犹豫。 礼貌地说:“7K是吗?了解了。嗯~其实我对贵司的面试官印象很好。只不过,现在我的手头上已经有一份11K的offer。来面试,主要也是自己对贵司挺有兴趣的,所以过来看看……”(未完) 这段话主要是陪HR互诈的同时,从公司兴趣,公司职员印象上,都给予对方正面的肯定,既能提升HR的好感度,又能让谈判气氛融洽,为后面的发挥留足空间。...

面试:第十六章:Java中级开发(16k)

HashMap底层实现原理,红黑树,B+树,B树的结构原理 Spring的AOP和IOC是什么?它们常见的使用场景有哪些?Spring事务,事务的属性,传播行为,数据库隔离级别 Spring和SpringMVC,MyBatis以及SpringBoot的注解分别有哪些?SpringMVC的工作原理,SpringBoot框架的优点,MyBatis框架的优点 SpringCould组件有哪些,他们...

面试阿里p7,被按在地上摩擦,鬼知道我经历了什么?

面试阿里p7被问到的问题(当时我只知道第一个):@Conditional是做什么的?@Conditional多个条件是什么逻辑关系?条件判断在什么时候执...

你期望月薪4万,出门右拐,不送,这几个点,你也就是个初级的水平

先来看几个问题通过注解的方式注入依赖对象,介绍一下你知道的几种方式@Autowired和@Resource有何区别说一下@Autowired查找候选者的...

面试了一个 31 岁程序员,让我有所触动,30岁以上的程序员该何去何从?

最近面试了一个31岁8年经验的程序猿,让我有点感慨,大龄程序猿该何去何从。

大三实习生,字节跳动面经分享,已拿Offer

说实话,自己的算法,我一个不会,太难了吧

程序员垃圾简历长什么样?

已经连续五年参加大厂校招、社招的技术面试工作,简历看的不下于万份 这篇文章会用实例告诉你,什么是差的程序员简历! 疫情快要结束了,各个公司也都开始春招了,作为即将红遍大江南北的新晋UP主,那当然要为小伙伴们做点事(手动狗头)。 就在公众号里公开征简历,义务帮大家看,并一一点评。《启舰:春招在即,义务帮大家看看简历吧》 一石激起千层浪,三天收到两百多封简历。 花光了两个星期的所有空闲时...

《经典算法案例》01-08:如何使用质数设计扫雷(Minesweeper)游戏

我们都玩过Windows操作系统中的经典游戏扫雷(Minesweeper),如果把质数当作一颗雷,那么,表格中红色的数字哪些是雷(质数)?您能找出多少个呢?文中用列表的方式罗列了10000以内的自然数、质数(素数),6的倍数等,方便大家观察质数的分布规律及特性,以便对算法求解有指导意义。另外,判断质数是初学算法,理解算法重要性的一个非常好的案例。

《Oracle Java SE编程自学与面试指南》最佳学习路线图(2020最新版)

正确选择比瞎努力更重要!

字节跳动面试官竟然问了我JDBC?

轻松等回家通知

面试官:你连SSO都不懂,就别来面试了

大厂竟然要考我SSO,卧槽。

终于,月薪过5万了!

来看几个问题想不想月薪超过5万?想不想进入公司架构组?想不想成为项目组的负责人?想不想成为spring的高手,超越99%的对手?那么本文内容是你必须要掌握的。本文主要详解bean的生命...

自从喜欢上了B站这12个UP主,我越来越觉得自己是个废柴了!

不怕告诉你,我自从喜欢上了这12个UP主,哔哩哔哩成为了我手机上最耗电的软件,几乎每天都会看,可是吧,看的越多,我就越觉得自己是个废柴,唉,老天不公啊,不信你看看…… 间接性踌躇满志,持续性混吃等死,都是因为你们……但是,自己的学习力在慢慢变强,这是不容忽视的,推荐给你们! 都说B站是个宝,可是有人不会挖啊,没事,今天咱挖好的送你一箩筐,首先啊,我在B站上最喜欢看这个家伙的视频了,为啥 ,咱撇...

立即提问