gyfjch01
赵小盛
2019-07-21 20:15
采纳率: 40%
浏览 10.4k
已采纳

运行报错,大佬们帮忙看看什么原因java.util.concurrent.ExecutionException

"C:\Program Files\Java\jdk1.8.0_201\bin\java" "-Dmaven.multiModuleProjectDirectory=C:\Users\Administrator\Desktop\travel - 副本" -Dfile.encoding=gb2312 "-Dmaven.home=C:\Program Files\JetBrains\IntelliJ IDEA 2017.2.6\plugins\maven\lib\maven3" "-Dclassworlds.conf=C:\Program Files\JetBrains\IntelliJ IDEA 2017.2.6\plugins\maven\lib\maven3\bin\m2.conf" "-javaagent:C:\Program Files\JetBrains\IntelliJ IDEA 2017.2.6\lib\idea_rt.jar=51249:C:\Program Files\JetBrains\IntelliJ IDEA 2017.2.6\bin" -classpath "C:\Program Files\JetBrains\IntelliJ IDEA 2017.2.6\plugins\maven\lib\maven3\boot\plexus-classworlds-2.5.2.jar" org.codehaus.classworlds.Launcher -Didea.version=2017.2.6 tomcat7:run
[INFO] Scanning for projects...
[WARNING]
[WARNING] Some problems were encountered while building the effective model for cn.itcast:travel:war:1.0-SNAPSHOT
[WARNING] 'build.plugins.plugin.version' for org.apache.maven.plugins:maven-compiler-plugin is missing. @ line 131, column 21
[WARNING]
[WARNING] It is highly recommended to fix these problems because they threaten the stability of your build.
[WARNING]
[WARNING] For this reason, future Maven versions might no longer support building such malformed projects.
[WARNING]
[INFO]

[INFO] ------------------------------------------------------------------------
[INFO] Building travel 1.0-SNAPSHOT
[INFO] ------------------------------------------------------------------------
[INFO]
[INFO] >>> tomcat7-maven-plugin:2.1:run (default-cli) > process-classes @ travel >>>
[INFO]
[INFO] --- maven-resources-plugin:2.6:resources (default-resources) @ travel ---
[WARNING] Using platform encoding (gb2312 actually) to copy filtered resources, i.e. build is platform dependent!
[INFO] Copying 3 resources
[INFO]
[INFO] --- maven-compiler-plugin:3.1:compile (default-compile) @ travel ---
[INFO] Changes detected - recompiling the module!
[INFO] Compiling 40 source files to C:\Users\Administrator\Desktop\travel - 副本\target\classes
[WARNING] /C:/Users/Administrator/Desktop/travel - 副本/src/main/java/cn/itcast/travel/dao/impl/FindDaoImpl.java: 某些输入文件使用了未经检查或不安全的操作。
[WARNING] /C:/Users/Administrator/Desktop/travel - 副本/src/main/java/cn/itcast/travel/dao/impl/FindDaoImpl.java: 有关详细信息, 请使用 -Xlint:unchecked 重新编译。
[INFO]
[INFO] <<< tomcat7-maven-plugin:2.1:run (default-cli) < process-classes @ travel <<<
[INFO]
[INFO] --- tomcat7-maven-plugin:2.1:run (default-cli) @ travel ---
[INFO] Running war on http://localhost:80/travel
[INFO] Using existing Tomcat server configuration at C:\Users\Administrator\Desktop\travel - 副本\target\tomcat
[INFO] create webapp with contextPath: /travel
七月 21, 2019 5:00:20 下午 org.apache.coyote.AbstractProtocol init
信息: Initializing ProtocolHandler ["http-bio-80"]
七月 21, 2019 5:00:20 下午 org.apache.catalina.core.StandardService startInternal
信息: Starting service Tomcat
七月 21, 2019 5:00:20 下午 org.apache.catalina.core.StandardEngine startInternal
信息: Starting Servlet Engine: Apache Tomcat/7.0.37
七月 21, 2019 5:00:21 下午 org.apache.catalina.core.ContainerBase startInternal
严重: A child container failed during start
java.util.concurrent.ExecutionException: org.apache.catalina.LifecycleException: Failed to start component [StandardEngine[Tomcat].StandardHost[localhost].StandardContext[/travel]]
at java.util.concurrent.FutureTask.report(FutureTask.java:122)
at java.util.concurrent.FutureTask.get(FutureTask.java:192)
at org.apache.catalina.core.ContainerBase.startInternal(ContainerBase.java:1123)
at org.apache.catalina.core.StandardHost.startInternal(StandardHost.java:800)
at org.apache.catalina.util.LifecycleBase.start(LifecycleBase.java:150)
at org.apache.catalina.core.ContainerBase$StartChild.call(ContainerBase.java:1559)
at org.apache.catalina.core.ContainerBase$StartChild.call(ContainerBase.java:1549)
at java.util.concurrent.FutureTask.run(FutureTask.java:266)
at java.util.concurrent.ThreadPoolExecutor.runWorker(ThreadPoolExecutor.java:1149)
at java.util.concurrent.ThreadPoolExecutor$Worker.run(ThreadPoolExecutor.java:624)
at java.lang.Thread.run(Thread.java:748)
Caused by: org.apache.catalina.LifecycleException: Failed to start component [StandardEngine[Tomcat].StandardHost[localhost].StandardContext[/travel]]
at org.apache.catalina.util.LifecycleBase.start(LifecycleBase.java:154)
... 6 more
Caused by: java.lang.IllegalArgumentException: Invalid #write/* in servlet mapping
at org.apache.catalina.core.StandardContext.addServletMapping(StandardContext.java:3223)
at org.apache.catalina.core.StandardContext.addServletMapping(StandardContext.java:3198)
at org.apache.catalina.deploy.WebXml.configureContext(WebXml.java:1366)
at org.apache.catalina.startup.ContextConfig.webConfig(ContextConfig.java:1353)
at org.apache.catalina.startup.ContextConfig.configureStart(ContextConfig.java:878)
at org.apache.catalina.startup.ContextConfig.lifecycleEvent(ContextConfig.java:369)
at org.apache.catalina.util.LifecycleSupport.fireLifecycleEvent(LifecycleSupport.java:119)
at org.apache.catalina.util.LifecycleBase.fireLifecycleEvent(LifecycleBase.java:90)
at org.apache.catalina.core.StandardContext.startInternal(StandardContext.java:5179)
at org.apache.catalina.util.LifecycleBase.start(LifecycleBase.java:150)
... 6 more

七月 21, 2019 5:00:21 下午 org.apache.catalina.core.ContainerBase startInternal
严重: A child container failed during start
java.util.concurrent.ExecutionException: org.apache.catalina.LifecycleException: Failed to start component [StandardEngine[Tomcat].StandardHost[localhost]]
at java.util.concurrent.FutureTask.report(FutureTask.java:122)
at java.util.concurrent.FutureTask.get(FutureTask.java:192)
at org.apache.catalina.core.ContainerBase.startInternal(ContainerBase.java:1123)
at org.apache.catalina.core.StandardEngine.startInternal(StandardEngine.java:302)
at org.apache.catalina.util.LifecycleBase.start(LifecycleBase.java:150)
at org.apache.catalina.core.StandardService.startInternal(StandardService.java:443)
at org.apache.catalina.util.LifecycleBase.start(LifecycleBase.java:150)
at org.apache.catalina.core.StandardServer.startInternal(StandardServer.java:732)
at org.apache.catalina.util.LifecycleBase.start(LifecycleBase.java:150)
at org.apache.catalina.startup.Tomcat.start(Tomcat.java:335)
at org.apache.tomcat.maven.plugin.tomcat7.run.AbstractRunMojo.startContainer(AbstractRunMojo.java:1091)
at org.apache.tomcat.maven.plugin.tomcat7.run.AbstractRunMojo.execute(AbstractRunMojo.java:512)
at org.apache.maven.plugin.DefaultBuildPluginManager.executeMojo(DefaultBuildPluginManager.java:134)
at org.apache.maven.lifecycle.internal.MojoExecutor.execute(MojoExecutor.java:207)
at org.apache.maven.lifecycle.internal.MojoExecutor.execute(MojoExecutor.java:153)
at org.apache.maven.lifecycle.internal.MojoExecutor.execute(MojoExecutor.java:145)
at org.apache.maven.lifecycle.internal.LifecycleModuleBuilder.buildProject(LifecycleModuleBuilder.java:116)
at org.apache.maven.lifecycle.internal.LifecycleModuleBuilder.buildProject(LifecycleModuleBuilder.java:80)
at org.apache.maven.lifecycle.internal.builder.singlethreaded.SingleThreadedBuilder.build(SingleThreadedBuilder.java:51)
at org.apache.maven.lifecycle.internal.LifecycleStarter.execute(LifecycleStarter.java:128)
at org.apache.maven.DefaultMaven.doExecute(DefaultMaven.java:307)
at org.apache.maven.DefaultMaven.doExecute(DefaultMaven.java:193)
at org.apache.maven.DefaultMaven.execute(DefaultMaven.java:106)
at org.apache.maven.cli.MavenCli.execute(MavenCli.java:863)
at org.apache.maven.cli.MavenCli.doMain(MavenCli.java:288)
at org.apache.maven.cli.MavenCli.main(MavenCli.java:199)
at sun.reflect.NativeMethodAccessorImpl.invoke0(Native Method)
at sun.reflect.NativeMethodAccessorImpl.invoke(NativeMethodAccessorImpl.java:62)
at sun.reflect.DelegatingMethodAccessorImpl.invoke(DelegatingMethodAccessorImpl.java:43)
at java.lang.reflect.Method.invoke(Method.java:498)
at org.codehaus.plexus.classworlds.launcher.Launcher.launchEnhanced(Launcher.java:289)
at org.codehaus.plexus.classworlds.launcher.Launcher.launch(Launcher.java:229)
at org.codehaus.plexus.classworlds.launcher.Launcher.mainWithExitCode(Launcher.java:415)
at org.codehaus.plexus.classworlds.launcher.Launcher.main(Launcher.java:356)
at org.codehaus.classworlds.Launcher.main(Launcher.java:47)
Caused by: org.apache.catalina.LifecycleException: Failed to start component [StandardEngine[Tomcat].StandardHost[localhost]]
at org.apache.catalina.util.LifecycleBase.start(LifecycleBase.java:154)
at org.apache.catalina.core.ContainerBase$StartChild.call(ContainerBase.java:1559)
at org.apache.catalina.core.ContainerBase$StartChild.call(ContainerBase.java:1549)
at java.util.concurrent.FutureTask.run(FutureTask.java:266)
at java.util.concurrent.ThreadPoolExecutor.runWorker(ThreadPoolExecutor.java:1149)
at java.util.concurrent.ThreadPoolExecutor$Worker.run(ThreadPoolExecutor.java:624)
at java.lang.Thread.run(Thread.java:748)
Caused by: org.apache.catalina.LifecycleException: A child container failed during start
at org.apache.catalina.core.ContainerBase.startInternal(ContainerBase.java:1131)
at org.apache.catalina.core.StandardHost.startInternal(StandardHost.java:800)
at org.apache.catalina.util.LifecycleBase.start(LifecycleBase.java:150)
... 6 more

[INFO] ------------------------------------------------------------------------
[INFO] BUILD FAILURE
[INFO] ------------------------------------------------------------------------
[INFO] Total time: 3.989 s
[INFO] Finished at: 2019-07-21T17:00:21+08:00
[INFO] Final Memory: 32M/279M
[INFO] ------------------------------------------------------------------------
[ERROR] Failed to execute goal org.apache.tomcat.maven:tomcat7-maven-plugin:2.1:run (default-cli) on project travel: Could not start Tomcat: Failed to start component [StandardServer[-1]]: Failed to start component [StandardService[Tomcat]]: Failed to start component [StandardEngine[Tomcat]]: A child container failed during start -> [Help 1]
[ERROR]
[ERROR] To see the full stack trace of the errors, re-run Maven with the -e switch.
[ERROR] Re-run Maven using the -X switch to enable full debug logging.
[ERROR]
[ERROR] For more information about the errors and possible solutions, please read the following articles:
[ERROR] [Help 1] http://cwiki.apache.org/confluence/display/MAVEN/MojoExecutionException

Process finished with exit code 1

  • 点赞
  • 写回答
  • 关注问题
  • 收藏
  • 邀请回答

3条回答 默认 最新

  • u013254183
    老铁咖啡 2019-07-21 22:36
    已采纳

    Caused by: java.lang.IllegalArgumentException: Invalid #write/* in servlet mapping
    检查你的servlet mapping

    1.web.xml 中对于 url-pattern 部分的配置错误
    2.web.xml 中 servlet 和 servlet-mapping 中的 servlet-name 没有对应起来

    点赞 评论
  • Sometimes_Ymc
    Sometimes_Ymc 2019-07-24 11:25

    注意看下日志文件里面的报错信息,再去百度这个错误。

    点赞 1 评论
  • dashicaineng
    点赞 评论

相关推荐