dataframe.to_sql过程中遇到的索引问题

我通过dataframe透视功能得到以下的表:
图片说明
这个表的索引是code,columns是日期,然后我想要把表格转为sql文件进一步处理,我使用了如下语句:
engine = create_engine('mysql+pymysql://root:root@localhost:3306/test')

df_ans.to_sql(name='toe_list05', con=engine, if_exists='append',index = True,index_label=None)

结果导入的sql文件索引列的code码不见了,全都是下面这个样子:
图片说明
请问如何能够把code列显示出来呢?多谢!

Csdn user default icon
上传中...
上传图片
插入图片
抄袭、复制答案,以达到刷声望分或其他目的的行为,在CSDN问答是严格禁止的,一经发现立刻封号。是时候展现真正的技术了!
其他相关推荐
yum安装过程中遇到的问题
centos7 就用 yum install 包名 指令装一个包。  看上去很正常啊, 结果      就一直卡在 Running transaction 不动了。   重新试了几次都一样的情况,   暂时还没有找到解决办法。   墙内只搜到了以下老帖,   https://blog.csdn.net/qq_21398167/article/details/49468329 ...
面试过程中遇到的问题
1.HTTP与HTPPS的区别 HTTP传输的数据都是未加密的,也就是明文的,因此使用HTTP协议传输隐私信息非常的不安全,为了保证这些数据能够安全的加密传输,于是网景公司设计了SSL协议用于对HTTP协议传输的数据进行加密,从此诞生了HTTPS协议。 HTTP与HTTPS的主要区别如下: (1)https协议需要到ca申请证书,一般免费证书较少,因而需要一定的费用。 (2)http是超文
软件开发过程中遇到的问题
今天早晨去石家庄河北电力工程监理有限公司,回来后就在整理这篇图文,结果还是过了12:00。这是针对昨天图文“Software Development Problem”的翻译以及自己的一些理解,分享给大家。其实,看看这些东西蛮好的,最起码能够复习一些专业的英文词汇,对自己带团队做项目也是一种方法论方面的积累。
Android开发过程中遇到的问题
长期补充,我只是大自然的搬运工=。=记录一些自己开发过程中遇到的问题和解决的办法
安装过程中遇到的问题
附:安装过程中遇到的问题 1. 编译subversion时出现少expat库 解决:下载expat-2.0.0.tar.gz安装皆可 2. 安装subversion时,编译到最后会出现一段 configure: WARNING: we have configured without BDB filesystem support 大概是不能创建db格式的版本库 解决:这个没什...
Hadoop集群搭建过程中遇到的问题
1.    要先搭建zookeeper 在再搭建hbase   而且搭建hbase的时候        hbase_env.sh   里面的    HBASE_MANAGES_ZK=false 不能等于true ,因为hbase本身自带zookeeper,所以要把hbase里面的zookeeper关掉,,,才可以。     2.    在一些配置conf里,有的有两个     bin   ...
存储过程中遇到的问题
if not exists(select name from tempdb.sys.objects where name like '%#outtable%')rn beginrn if(select count(*) from CODE_Pcode_create where orderno=@ordernum and isout='10') !=0rn beginrn select itemtype as '类型',prats as '产品名称',count(*) as '已出库' into #outtable from CODE_Pcode_create where orderno=@ordernum and isout='10' group by itemtype,partsrn endrn elsern rn beginrn create table #outtable(类型 varchar(300),产品名称 varchar(300),已出库 int)rn insert into #outtable(类型,产品名称,已出库) select distinct 产品名称,类型,0 from CODE_Pcode_create where orderno=@ordernum rn endrn endrn elsern drop table #outtablernrnrnrn总是提示#outable已存在
存储过程中遇到的问题.
存储过程为:rnCREATE PROCEDURE InsertUserrn@UserName NVARCHAR(20),rn@pwd NVARCHAR(20),rn@UserIntro NVARCHAR(1000)rnASrnSET XACT_ABORT ONrnBEGIN TRANSACTIONrndeclare @UserId intrnSELECT @UserId=max(UserId)+1 from UserListrnINSERT INTO [UserList]rnVALUES (@UserId,@UserName,@pwd,@UserIntro)rnCOMMIT TRANSACTIONrnRETURN 0rnGOrn调用它的函数为:rnpublic static bool ExecuteInsertUserList(string UserName,string Pwd,string UserIntro)rnrn SqlConnection Conn=open_Conn();rn SqlCommand Cmd=new SqlCommand("InsertUser",Conn);rn Cmd.CommandType=CommandType.StoredProcedure;rn Cmd.Parameters.Add("@UserName",SqlDbType.NVarChar,20,UserName);rn Cmd.Parameters.Add("@pwd",SqlDbType.NVarChar,20,Pwd);rn Cmd.Parameters.Add("@UserIntro",SqlDbType.NVarChar,1000,UserIntro);rn tryrn rn Cmd.ExecuteNonQuery();rn return true;rn rn catch(Exception e)rn rn //throw e;rn return false;rn rn return false;rnrn错误为:rn过程 'InsertUser' 需要参数 '@UserName',但未提供该参数。
hadoop安装过程中遇到的问题
报错:Call From ubuntu/127.0.0.1 to ubuntu:42912 failed on connection exception ........ 在namenode,datanode等节点成功启动的情况下,这是由于hostname配置不对,导致datanode无法连接namenode 。所以应该将master/slave1.......等节点/etc/hostna...
Cmake 过程中遇到的问题
刚开始学习opencv,在配置Qt+opencv的过程中遇到了很多问题,其中大部分都在seuStones的博客帮助下得到了解决。真的很感谢大佬,在这里贴上大佬帖子的链接https://blog.csdn.net/u010189457/article/details/66478574。 但是在Cmake的过程中还是遇到了两个问题: 1:this is a compatibility header...
微信支付过程中遇到的问题
运行微信支付测试代码https://pay.weixin.qq.com/wiki/doc/api/jsapi.php?chapter=11_1(我下载的是PHP) 发现demo里有几处需要修改的。 第一问题: Warning: curl_setopt() expects parameter 2 to be long, string given in D:\wwwroot\we
iOS开发过程中遇到的问题
iOS开发过程中遇到的问题问题1:Xcode默认启动页面没了问题描述:今天随便在xcode中建了个空项目,然后觉得名字起错了,把xcode关闭,然后到文件目录里面把项目文件夹删除了。这个时候再启动xcode,发觉跳不出默认启动页面了。屏幕上什么都没有,只有在dock上有显示xcode已启动. 注:默认启动页面就是左面让你选择建个空项目还是其他种类项目的列表,右边是所有之前操作过的项目列表。问题的解
开发过程中遇到的问题
问题从下往上是时间的顺序 这次是如何构建Android Jenkins+Git+Gradle持续集成中 遇到的问题!! 首先看这篇文章,这是链接地址已经非常的详细了!但是也有点小坑… 1.首先是下载jenkins,吧他放到tomcat的文件夹webapps下(这是我的目录E:\tomcat\apache-tomcat-8.0.36\webapps) 2.然后去tomcat的bin文件夹里面找到st
qt开发过程中遇到的问题
项目需求根据点击tabwidget不同的tab修改窗体大小以适应内容,在使用resize函数对窗体大小进行调整的时候,发现仅仅使用this->resize(QSize(1280,720));无法实现改变窗体大小。setGeometry()函数依然如此;(无法触发resizeevent)添加adjustSize()后发现触发了两次resizeEvent依然无法满足需求。之后发现sizeHint()函数
在上网过程中遇到的问题!!!!!!!!!!!!!
在几天前,我一上网就会出现"此程序执行非法操作,即将关闭"的提示.然后,所上的网站自rn动关闭.在打其他的网站也会被关闭.这到底是怎么回事???????????rn恳求各位高手帮忙!!!!>_<
写过程中遇到的问题??
如下一个过程rncreate proc cw01 -- cw01 '200401' rn@yymm varchar(6)rnasrnbeginrncreate table #temprn(a varchar(30),rn b varchar(30),rn c varchar(30),rn d varchar(30),rn e varchar(30),rn f varchar(30),rnrn)rndeclare @year varchar(8)rndeclare @a1 varchar(30)rndeclare @b1 varchar(30)rndeclare @c1 varchar(30)rndeclare @d1 varchar(30)rndeclare @e1 varchar(30)rndeclare @f1 varchar(30)rndeclare @qstr varchar(200)rnset @year='cw'+@yymmrnexec(' select sum(发出数量)/250 from '+ @year+' a where substring(a.商品代码,3,2)='+'''32''')rnexec(' select sum(发出数量)/250 from '+ @year+' a where substring(a.商品代码,3,4)='+'''3201''')rnexec(' select sum(发出数量)/250 from '+ @year+' a where substring(a.商品代码,3,4)='+'''3208''')rn................................等等rninsert into #temp(a,b,c,d,e,f) values ('合计',b1,c1,d1.e1.f1) rnselect * from #temprnendrnrn现在遇到的问题是怎样将exec(' select sum(发出数量)/250 from '+ @year+' a where substring(a.商品代码,3,4)='+'''3288''')中查询到的数值我想赋给变量@a1,@b1,@c1,@d1等等rn如果我这样写exec('select '+@b1+'=sum(发出数量)/250 from '+ @year+' a where substring(a.商品代码,3,4)='+'''3288''')rn会报=号两边出错,或者是报变量@b1没有声明,rn正确的写法应该怎么办呢
学习过程中遇到的问题
什么都别说,还是直接上代码: 在编辑这段代码过程中,遇到的问题如下: 1.报:“undefined is not function”的错误,错误原因:       1)定义的foreach()方法和在调用的foreach()方法由于大小写不一致,如forEach是javascript中的预定义的方法,所以在编辑的时候,直接函数自动完成forEach(),导致与定义的foreach()方法
编译过程中遇到的问题
rnrn我用VC6的App Wizard建立了一个Win32 Application,“Hello The World”,rn然后我在这个工程的目录下面建立了两个文件file1.h 和 file1.cpp,并分别加入到rn这个工程的Workspace当中的两个文件夹Header Files和Source Files当中.rnfile1.h和file1.cpp都是空的,但在file1.cpp里有一句" #include "file1.h",然后rn再在工程的文件里加入了#include "file1.h",但是一编译出现错误:rnrnc:\my project\test3\file1.cpp(10) : fatal error C1010: unexpected end of file while looking for precompiled header directivernGenerating Code...rnError executing cl.exe.rnrnrn我是新手不明白是怎么回事,是不是新加入工程的一对file1.h和file1.cpp还要先编译吗?rn是的话怎么做? rn请尽量说的详细点,最好能告诉我一下原理,谢谢了!
数据库复制过程中遇到的问题
1.发布'xxx' 的初始快照尚不可用 解决方法:到该文件夹重新配置sql的帐号对该文件夹权限加个Everyone权限,文件夹路径为C:\Program Files\Microsoft SQL Server\MSSQL12.MSSQLSERVER\MSSQL以及C:\Program Files\Microsoft SQL Server\MSSQL12.MSSQLSERVER\MSSQL\re...
web自动化过程中遇到的问题
extent report 打开,没有css样式 解决方案:在初始化的时候,添加:NetworkMode.OFFLINE
Caffe运行过程中遇到的问题
一、问题如图问题描述:大概就是solver文件参数出现了问题,或者路径的问题。再次注意,路径中使用“/",不要用"\"解决办法,我把cifar10_quick_solver.prototxt和cifar10_quick_solver_prototxt直接复制过来,上述问题就不出现了,可以又出现问题二。如下:二、问题如图:问题描述:大概就是需要一直重新加载数据,所以我又去重新制作了一下数据集。还是这
集成环信过程中遇到的问题?
# Error:Execution failed for task ':app:transformClassesWithDexForDebug'.&amp;gt; com.android.build.api.transform.TransformException: com.android.ide.common.process.ProcessException: org.gradle.process.in...
安装 warpctc_tensorflow 过程中遇到的问题
问题一:“fatal error: 'nsync_cv.h' file not found” I changed the file tensorflow/core/platform/default/mutex.h by adding the relative path as prefix of nsync_cv.h and nsync_mu.h to fix the issue, as follo...
Mysql安装过程中遇到的问题及解决办法
因为做SSH网上商城的项目,需要使用MySql数据库,所以就马上着手安装MySQL,但是在安装过程中,可谓是一波三折,总是遇到问题,让我不得不去寻找解决办法。         最开始我是找的mysql-5.6.26-winx64.msi,进行安装的,但是安装完了,并不知道怎么用,百度一下吧,看到人家的安装教程和图解都和自己的安装过程不一样,于是就不知道怎么办了,尝试了半天并没有弄好,于是找人拷贝
安装MySQL过程中遇到的问题
一、MySQL安装失败后,如何卸载干净以便重新安装? 1、在你最后附的图的界面上,点【finish】,退出安装 然后再次进入Mysql Installer,点击右栏的【remove】 进入下一个界面,勾选所有选项,点击【excute】,这样会删除所有下载的MySQL文件 2、这样还不是完全清除了MySQL,接下来要把MySQL的注册表统统删除: 开始->运行->regedit,打开注册表
在前端开发过程中遇到的问题1
1.在使用Bootstrap框架的过程中,代码没有错误但是元素样式却无法正常显示。 原因可能是导入的js文件顺序不正确。 html文件在加载和执行javaScript文件时,会按照一定的顺序来进行加载和执行,如果导入的代码顺序有误,就可能会导致想要的效果无法正常显示。 因为导入的javaScript文件就是HTML文档的一部分,因此JavaScript在页面装载时,会按照文档中的引入标记的顺
关于MySQL安装过程中遇到的问题
由于学习Java Web,今天晚上我选择安装MySQL服务器。 1、下载 百度搜素MySQL,直接进入官网下载。 下载网址:https://dev.mysql.com/downloads/mysql/ 这里我选择的是64位的zip格式 另有msi模式,直接安装 zip格式可以直接解压,但需要自己手动配置 2.安装 由于下载的是zip格式,我直接将其解压到D盘 安装步骤: 2.1
ubuntu下hadoop安装过程中遇到的问题
如题, 这并不是一个教程, 只是收集了一些问题。 教程可以参考 http://blog.csdn.net/wangjia55/article/details/53160679 感谢网上的资源, 经过了几天终于配好了, 先是在windows上折腾, 但是datanode和namenode就是启动不了,然后, ubuntu下很快就弄好了, 问题还是出现了不少, 罗列一下: 首先 关闭防火墙,
使用MyBatis过程中遇到的问题
声明:本人列出的解决方案,肯定是解决了自己的问题,但是不一定能解决各位的问题,毕竟同一个错误也可能是不同原因导致。 1Parameter 'XXX' not found.Available parameters are [0, 1, param1, param2]. 当只传一个参数到sql语句时,可以直接写参数名,当传多个参数时,应当这样写(多个参数已#{0}开始)
在前端开发过程中遇到的问题2
1.隐藏元素的两种方式区别 display:none  该元素不仅会被隐藏,而且不在网页布局中占据任何空间     visibility:hidden 该元素虽然会被隐藏,但是仍然占据在网页中的位置和空间 2.js文件放置在不同的位置有什么不同的效果 放在中的js通常是基础性的,全局的样式或者效果,不涉及某个具体的DOM对象,因为此时如果想在HTML中通过getElementBtId找到一
numpy安装过程中遇到的问题
python的强大很大程度上是其第三方库的强大,如何安装第三方库,则非常重要。 一般的安装方法是进入python的安装目录下C://Python27/Scripts;或者直接将该目录添加到windows系统环境变量PATH中,直接使用命令。 有两种方法: 1、  easy_install xxx 2、  pip install xxx 但是有些复杂的库,用上面的两种方法不能安
android-vlc 编译过程中遇到的问题
vlc-android 源码下载及主要编译过程可以参考vlc官方微博,地址如下: https://wiki.videolan.org/AndroidCompile在vlc-android编译过程中,我遇到了很多问题,在此记录一下:1 vlc依赖库a52dec编译时报错,如下: mkdir -p – /home/chen/workspace/vlc-android/vlc/contrib/x86_
SSH实践过程中遇到的问题
一 报nosuchmethoderror:   org.objectweb.asm.ClassWriter. (Z)V 原因:asm-3.3.jar 与cglib-2.1.3.jar 冲突导致 解决方法: 使用asm.jar  替换asm-3.3.jar ; 从Build Path中删除,将WEB-INF/lib中的文件也删除。 二. 启动tomcat时报User类中 prope
ssm + ajax过程中遇到的问题
问题1:html文件中的静态资源无法访问(下面红色标记的部分无法访问) 问题2:ajax代码的url部分无法访问(下面红色标记的部分无法访问)
备份过程中遇到如下问题。。。。。。
求解决方法:exp自动备份不能进行,重启服务器后提示apache.exe遇到问题需要关闭,点击不发送错误后,再启用自动备份正常工作。apache.exe具体是什么进程?跟exp自动备份关系怎样?是不是端口被占用,该修改?
使用NekoHTML过程中遇到的问题
我在用NekoHTML对HTML进行处理时,所有类似&的字符实体引用都不能正确解析,输出都是?。应该怎么解决呢?rn我已经将http://cyberneko.org/html/features/scanner/notify-builtin-refs设置为true了。rn
使用element-ui过程中遇到的问题
webpack打包后icon不显示 1、使用webpack打包vue项目,使用font-awsome字体,发现打包之后,font-awsome图标不显示,报错为路径不对 2、build &gt; webpack.base.conf.js 里面loader的设置 ...
python安装过程中可能遇到的问题
1.Python3.5的网址 https://www.python.org/ 2.安装pip.exe 具体教程 http://lovesoo.org/windows-install-the-pip-method.html 其下载网址 https://pypi.python.org/pypi/pip 3.提示没有安装setuptools 文件的解决办法 解决办法按照所给网
在学习tensorflow过程中遇到的问题
在学习tensorflow过程中遇到的问题 Tensorboard报错 No dashboards are active for the current data set 运行完tensorflow代码后,进行tensorboard可视化时出现上述问题。 图1 No dashboards are active for the current data set 报错 首先,碰到这种报错情况,我们先...
elastic-job使用及过程中遇到的问题
以前公司的项目分布式调度用的两种方式,一是通过配置文件进行分区,一是用阿里的一个dtss控件;配置文件的方式就不说了,比较挫;而阿里的dtss控件存在问题,而且该控件也已经停止维护更新(别的控件又要收钱)。 所以找到了这个elastic-job,目前只用到了其中的SimpleJob,后续的再更新。。。 官方文档 官网地址:http://elasticjob.io/index_...
相关热词 c#部署端口监听项目、 c#接口中的属性使用方法 c# 昨天 c#func链接匿名方法 c#怎么创建文件夹 c#从键盘接收空格 c#da/ad c#部门请假管理系统 c#服务器socket c# 默认的访问修饰符