VS2013生成时候报 error MSB3073?

RT,在使用vs2013重新生成一个在虚拟机上的项目时候,突然跳出这个报错,报错的半个小时前才正常生成过一次,期间也就加了一两条输出语句,并未对项目生成路径有过任何操作。

错误提示如下:
错误 2 error : Command-line action failed D:\project\newgame2\newgame2\VisualGDB newgame2
错误 3 error : Build has failed. See the Output window for more details. D:\project\newgame2\newgame2\EXEC newgame2
错误 4 error MSB3073: 命令“"C:\Program Files (x86)\Sysprogs\VisualGDB\VisualGDB.exe" /rebuild "D:\project\newgame2\newgame2\newgame2.vcxproj" "/solution:D:\project\newgame2\newgame2.sln" "/config:Debug" "/platform:Win32"
”已退出,代码为 1。 C:\Program Files (x86)\MSBuild\Microsoft.Cpp\v4.0\V120\Microsoft.MakeFile.Targets 43 5 newgame2

输出如下:
1>C:\Program Files (x86)\MSBuild\Microsoft.Cpp\v4.0\V120\Microsoft.MakeFile.Targets(43,5): error MSB3073: 命令“"C:\Program Files (x86)\Sysprogs\VisualGDB\VisualGDB.exe" /rebuild "D:\project\newgame2\newgame2\newgame2.vcxproj" "/solution:D:\project\newgame2\newgame2.sln" "/config:Debug" "/platform:Win32"

点击错误跳转到C:\Program Files (x86)\MSBuild\Microsoft.Cpp\v4.0\V120下的Microsoft.MakeFile.Targets文件中,截图如下:
图片说明

麻烦遇到过同样问题并解决了的老哥、大神们指点一下,万分感谢

c++
chenhaipin
chenhaipin 回复chenhaipin:可以的话 能否加个扣扣指教一下~谢谢1220890875
6 个月之前 回复
chenhaipin
chenhaipin 您好,请问您解决了吗,我也遇到了同样的问题
6 个月之前 回复

1个回答

qq_25815379
晨起煮粥 跟层主遇到情况还是有区别
7 个月之前 回复
Csdn user default icon
上传中...
上传图片
插入图片
抄袭、复制答案,以达到刷声望分或其他目的的行为,在CSDN问答是严格禁止的,一经发现立刻封号。是时候展现真正的技术了!
其他相关推荐
vs2013安装vtk/cmake错误
错误 1 error MSB3073: 命令“setlocal "D:\Program Files\CMake\bin\cmake.exe" -DBUILD_TYPE=Debug -P cmake_install.cmake if %errorlevel% neq 0 goto :cmEnd :cmEnd endlocal & call :cmErrorLevel %errorlevel% & goto :cmDone :cmErrorLevel exit /b %1 :cmDone if %errorlevel% neq 0 goto :VCEnd :VCEnd”已退出,代码为 1。 C:\Program Files (x86)\MSBuild\Microsoft.Cpp\v4.0\V120\Microsoft.CppCommon.targets 132 5 INSTALL 输出 1>C:\Program Files (x86)\MSBuild\Microsoft.Cpp\v4.0\V120\Microsoft.CppCommon.targets(132,5): error MSB3073: 命令“setlocal 1>C:\Program Files (x86)\MSBuild\Microsoft.Cpp\v4.0\V120\Microsoft.CppCommon.targets(132,5): error MSB3073: "D:\Program Files\CMake\bin\cmake.exe" -DBUILD_TYPE=Debug -P cmake_install.cmake 1>C:\Program Files (x86)\MSBuild\Microsoft.Cpp\v4.0\V120\Microsoft.CppCommon.targets(132,5): error MSB3073: if %errorlevel% neq 0 goto :cmEnd 1>C:\Program Files (x86)\MSBuild\Microsoft.Cpp\v4.0\V120\Microsoft.CppCommon.targets(132,5): error MSB3073: :cmEnd 1>C:\Program Files (x86)\MSBuild\Microsoft.Cpp\v4.0\V120\Microsoft.CppCommon.targets(132,5): error MSB3073: endlocal & call :cmErrorLevel %errorlevel% & goto :cmDone 1>C:\Program Files (x86)\MSBuild\Microsoft.Cpp\v4.0\V120\Microsoft.CppCommon.targets(132,5): error MSB3073: :cmErrorLevel 1>C:\Program Files (x86)\MSBuild\Microsoft.Cpp\v4.0\V120\Microsoft.CppCommon.targets(132,5): error MSB3073: exit /b %1 1>C:\Program Files (x86)\MSBuild\Microsoft.Cpp\v4.0\V120\Microsoft.CppCommon.targets(132,5): error MSB3073: :cmDone 1>C:\Program Files (x86)\MSBuild\Microsoft.Cpp\v4.0\V120\Microsoft.CppCommon.targets(132,5): error MSB3073: if %errorlevel% neq 0 goto :VCEnd 1>C:\Program Files (x86)\MSBuild\Microsoft.Cpp\v4.0\V120\Microsoft.CppCommon.targets(132,5): error MSB3073: :VCEnd”已退出,代码为 1。 ========== 生成: 成功 0 个,失败 1 个,最新 0 个,跳过 0 个 ==========
菜鸟求教:用vs2010编译vtk install重新生成时出错
1>C:\Program Files (x86)\MSBuild\Microsoft.Cpp\v4.0\Microsoft.CppCommon.targets(113,5): error MSB3073: 命令“setlocal 1>C:\Program Files (x86)\MSBuild\Microsoft.Cpp\v4.0\Microsoft.CppCommon.targets(113,5): error MSB3073: E:\vtk\Cmake\bin\cmake.exe -DBUILD_TYPE=Debug -P cmake_install.cmake 1>C:\Program Files (x86)\MSBuild\Microsoft.Cpp\v4.0\Microsoft.CppCommon.targets(113,5): error MSB3073: if %errorlevel% neq 0 goto :cmEnd 1>C:\Program Files (x86)\MSBuild\Microsoft.Cpp\v4.0\Microsoft.CppCommon.targets(113,5): error MSB3073: :cmEnd 1>C:\Program Files (x86)\MSBuild\Microsoft.Cpp\v4.0\Microsoft.CppCommon.targets(113,5): error MSB3073: endlocal & call :cmErrorLevel %errorlevel% & goto :cmDone 1>C:\Program Files (x86)\MSBuild\Microsoft.Cpp\v4.0\Microsoft.CppCommon.targets(113,5): error MSB3073: :cmErrorLevel 1>C:\Program Files (x86)\MSBuild\Microsoft.Cpp\v4.0\Microsoft.CppCommon.targets(113,5): error MSB3073: exit /b %1 1>C:\Program Files (x86)\MSBuild\Microsoft.Cpp\v4.0\Microsoft.CppCommon.targets(113,5): error MSB3073: :cmDone 1>C:\Program Files (x86)\MSBuild\Microsoft.Cpp\v4.0\Microsoft.CppCommon.targets(113,5): error MSB3073: if %errorlevel% neq 0 goto :VCEnd 1>C:\Program Files (x86)\MSBuild\Microsoft.Cpp\v4.0\Microsoft.CppCommon.targets(113,5): error MSB3073: :VCEnd”已退出,代码为 1。 1> 1>生成失败。 百度问题说是权限问题,用管理员身份运行就好,可是我本来就是用管理员身份打开的啊~T-T~忧桑太平洋
关于Visual Studio 2017中 MSB3073的问题
1>------ 已启动生成: 项目: M4.Views, 配置: Debug Any CPU ------ 1> All packages listed in packages.config are already installed. 1> M4.Views -> D:\m4WPF\M4.Views\bin\Debug\M4.Views.dll 1> 'C:\Program' 不是内部或外部命令,也不是可运行的程序 1> 或批处理文件。 1>C:\Program Files (x86)\Microsoft Visual Studio\2017\Enterprise\MSBuild\15.0\Bin\Microsoft.Common.CurrentVersion.targets(4935,5): error MSB3073: 命令“C:\Program Files (x86)\Microsoft Visual Studio\2017\Enterprise\MSBuild\15.0\Bin\MSBuild.exe /t:updateuid "D:\m4WPF\M4.Views\M4.Views.csproj"”已退出,代码为 9009。 2>------ 已启动生成: 项目: M4, 配置: Debug Any CPU ------ 2> All packages listed in packages.config are already installed. 2> M4 -> D:\m4WPF\M4\bin\Debug\M4.exe 上面是报错,可以看出是vs自己运行指令的时候没有加引号,但是就是这么个问题找了半天没找到解决方案。path也加过了,不过也不是这个的问题。 请问有什么好的解决方案吗?
VS2010出现问题error MSB6006:“CL.exe“已退出,代码为5
随便建 一个项目,并调试空项目就出现问题, 问题有这么一些: >------ 已启动生成: 项目: pro, 配置: Debug Win32 ------ 1>生成启动时间为 2015/8/26 15:50:28。 1>PrepareForBuild: 1> 正在创建目录“D:\WorkSpace\VsWorkspace\Projects\pro\Debug\”。 1>InitializeBuildStatus: 1> 正在创建“Debug\pro.unsuccessfulbuild”,因为已指定“AlwaysCreate”。 1>ClCompile: 1> TRACKER : 1>C:\Program Files\MSBuild\Microsoft.Cpp\v4.0\Platforms\Win32\Microsoft.Cpp.Win32.Targets(57,5): error MSB6006: “CL.exe”已退出,代码为 5。 1> 1>生成失败。 1> 1>已用时间 00:00:00.83 ========== 生成: 成功 0 个,失败 1 个,最新 0 个,跳过 0 个 ==========
error MSB6006: “cmd.exe”已退出,代码为 1。
1>------ 已启动生成: 项目: ZERO_CHECK, 配置: Debug Win32 ------ 1> Checking Build System 1> 系统找不到指定的路径。 1> 系统找不到指定的批处理标签 - VCReportError 1>C:\Program Files\MSBuild\Microsoft.Cpp\v4.0\Microsoft.CppCommon.targets(151,5): error MSB6006: “cmd.exe”已退出,代码为 1。 2>------ 已启动生成: 项目: boost_system, 配置: Debug Win32 ------ 3>------ 已启动生成: 项目: boost_thread, 配置: Debug Win32 ------ 2> Building Custom Rule F:/FireBreath-firebreath-1.7.0/FireBreath-firebreath-1.7.0/src/3rdParty/boost/libs/system/CMakeLists.txt 2> 系统找不到指定的路径。 2> 系统找不到指定的批处理标签 - VCReportError 3> Building Custom Rule F:/FireBreath-firebreath-1.7.0/FireBreath-firebreath-1.7.0/src/3rdParty/boost/libs/thread/CMakeLists.txt 2>C:\Program Files\MSBuild\Microsoft.Cpp\v4.0\Microsoft.CppCommon.targets(151,5): error MSB6006: “cmd.exe”已退出,代码为 1。 3> 系统找不到指定的路径。 3> 系统找不到指定的批处理标签 - VCReportError 3>C:\Program Files\MSBuild\Microsoft.Cpp\v4.0\Microsoft.CppCommon.targets(151,5): error MSB6006: “cmd.exe”已退出,代码为 1。 4>------ 已启动生成: 项目: PluginCore, 配置: Debug Win32 ------ 5>------ 已启动生成: 项目: ScriptingCore, 配置: Debug Win32 ------ 4> Building Custom Rule F:/FireBreath-firebreath-1.7.0/FireBreath-firebreath-1.7.0/src/PluginCore/CMakeLists.txt 4> 系统找不到指定的路径。 4> 系统找不到指定的批处理标签 - VCReportError 4>C:\Program Files\MSBuild\Microsoft.Cpp\v4.0\Microsoft.CppCommon.targets(151,5): error MSB6006: “cmd.exe”已退出,代码为 1。 6>------ 已启动生成: 项目: bsr_PluginAuto, 配置: Debug Win32 ------ 5> Building Custom Rule F:/FireBreath-firebreath-1.7.0/FireBreath-firebreath-1.7.0/src/ScriptingCore/CMakeLists.txt 5> 系统找不到指定的路径。 5> 系统找不到指定的批处理标签 - VCReportError 5>C:\Program Files\MSBuild\Microsoft.Cpp\v4.0\Microsoft.CppCommon.targets(151,5): error MSB6006: “cmd.exe”已退出,代码为 1。 7>------ 已启动生成: 项目: NpapiCore, 配置: Debug Win32 ------ 6> Building Custom Rule F:/FireBreath-firebreath-1.7.0/FireBreath-firebreath-1.7.0/src/PluginAuto/CMakeLists.txt 7> Building Custom Rule F:/FireBreath-firebreath-1.7.0/FireBreath-firebreath-1.7.0/src/NpapiCore/CMakeLists.txt 6> 系统找不到指定的路径。 7> 系统找不到指定的路径。 7> 系统找不到指定的批处理标签 - VCReportError 6> 系统找不到指定的批处理标签 - VCReportError 6>C:\Program Files\MSBuild\Microsoft.Cpp\v4.0\Microsoft.CppCommon.targets(151,5): error MSB6006: “cmd.exe”已退出,代码为 1。 7>C:\Program Files\MSBuild\Microsoft.Cpp\v4.0\Microsoft.CppCommon.targets(151,5): error MSB6006: “cmd.exe”已退出,代码为 1。 8>------ 已启动生成: 项目: ActiveXCore, 配置: Debug Win32 ------ 8> Building Custom Rule F:/FireBreath-firebreath-1.7.0/FireBreath-firebreath-1.7.0/src/ActiveXCore/CMakeLists.txt 8> 系统找不到指定的路径。 8> 系统找不到指定的批处理标签 - VCReportError 8>C:\Program Files\MSBuild\Microsoft.Cpp\v4.0\Microsoft.CppCommon.targets(151,5): error MSB6006: “cmd.exe”已退出,代码为 1。 9>------ 已启动生成: 项目: ptIntellCfgPlugin, 配置: Debug Win32 ------ 9> Building Custom Rule F:/FireBreath-firebreath-1.7.0/FireBreath-firebreath-1.7.0/projects/ptIntellCfgPlugin/CMakeLists.txt 9> 系统找不到指定的路径。 9> 系统找不到指定的批处理标签 - VCReportError 9>C:\Program Files\MSBuild\Microsoft.Cpp\v4.0\Microsoft.CppCommon.targets(151,5): error MSB6006: “cmd.exe”已退出,代码为 1。 ========== 生成: 成功 0 个,失败 9 个,最新 1 个,跳过 0 个 ==========
VS2013/CUDA编译的问题【MSB3721】
在VS2013下运行CUDA程序都是没有问题的,,,,直到我突然想包含一个头文件, 只要我加入了这个头文件,就会报错,错误如下: 1>C:\Program Files (x86)\MSBuild\Microsoft.Cpp\v4.0\BuildCustomizations\CUDA 6.5.targets(593,9): error MSB3721: 命令“"C:\Program Files\NVIDIA GPU Computing Toolkit\CUDA\v6.5\bin\nvcc.exe" -gencode=arch=compute_20,code=\"sm_20,compute_20\" --use-local-env --cl-version 2010 -ccbin "C:\Program Files (x86)\Microsoft Visual Studio 10.0\VC\bin\x86_amd64" -I"D:\Program Files\MATLAB\R2012a\extern\include" -I"C:\Program Files\NVIDIA GPU Computing Toolkit\CUDA\v6.5\include" -I"C:\Program Files\NVIDIA GPU Computing Toolkit\CUDA\v6.5\include" -G --keep-dir x64\Debug -maxrregcount=0 --machine 64 --compile -cudart static -g -DWIN32 -DWIN64 -D_DEBUG -D_CONSOLE -D_MBCS -Xcompiler "/EHsc /W3 /nologo /Od /Zi /RTC1 /MDd " -o x64\Debug\kernel.cu.obj "F:\ZJD\PRO\LRDSS\C++\LRDSS\LRDSS\kernel.cu"”已退出,返回代码为 2。 1> 1>生成失败。 在线查了很多资料,,都解决不了呀,,路径中也没中文问题,,而且只要不包含这个头文件,CUDA程序也能够运行的,,,,咋办呢~~?
目录下有ComService.dll,VS说找不到,914439889,有偿解决
1> ComService.cpp 1> 正在生成代码... 1> LINK : 没有找到 D:\WangHu Game\Change Version\Change Version\temp\Debug\ComService.dll 或上一个增量链接没有生成它;正在执行完全链接 1>ComService.obj : warning LNK4075: 忽略“/EDITANDCONTINUE”(由于“/SAFESEH”规范) 1> 正在创建库 ....\lib\Debug\ComService.lib 和对象 ....\lib\Debug\ComService.exp 1> ComService.vcxproj -> D:\WangHu Game\Change Version\Change Version\temp\Debug\ComService.dll 1> 系统找不到指定的文件。 1> 系统找不到指定的文件。 1>C:\Program Files (x86)\MSBuild\Microsoft.Cpp\v4.0\V120\Microsoft.CppCommon.targets(132,5): error MSB3073: 命令“copy /y D:\WangHu Game\Change Version\Change Version\temp\Debug\ComService.dll ....\cbin\Debug 1>C:\Program Files (x86)\MSBuild\Microsoft.Cpp\v4.0\V120\Microsoft.CppCommon.targets(132,5): error MSB3073: copy /y D:\WangHu Game\Change Version\Change Version\temp\Debug\ComService.dll ....\sbin\Debug 1>C:\Program Files (x86)\MSBuild\Microsoft.Cpp\v4.0\V120\Microsoft.CppCommon.targets(132,5): error MSB3073: :VCEnd”已退出,代码为 1。
VS2015新建空白通用应用,未修改任何内容,直接生成解决方案,报错,请问是什么问题
这是报错信息 1>C:\Program Files\MSBuild\Microsoft\.NetNative\Microsoft.Net.CoreRuntime.targets(135,5): error MSB3774: 找不到 SDK“Microsoft.VCLibs, Version=14.0”。 安装VS的时候我全打勾了 VS版本是Visual Studio 2015 Community With Update 1
VS系统不能正常运行!
业余使用VS系统。2003开始。2015年5月开始遇到新的问题。 VS2012;VS2013;VS2015均安装出现错误。 安装的过程中会出现 microsoft common language runtime native compiler 的错误。 选择关闭程序后。VS能安装 安装完成运行。不能编译。编译的时候非常非常慢。然后就是失败 error MSB4014: 生成已意外停止,因为发生内部故障。 这样的错误提示。 求大神给处理
VS2013编译错误!!!!!!!!!!!!!!!!
1>------ 已启动生成: 项目: Project1, 配置: Debug Win32 ------ 1> TRACKER : 错误 TRK0002: 未能执行命令: “"D:\Program Files (x86)\Microsoft Visual Studio 12.0\VC\bin\CL.exe" @C:\Users\hp\AppData\Local\Temp\tmpeffdf93a59c84ba09104b2fe131a05ed.rsp”。存储控制块地址无效。 1> 1> 1>C:\Program Files (x86)\MSBuild\Microsoft.Cpp\v4.0\V120\Microsoft.CppCommon.targets(341,5): error MSB6006: “CL.exe”已退出,代码为 2。 ========== 生成: 成功 0 个,失败 1 个,最新 0 个,跳过 0 个 ==========
源程序中使用GDI+时出现无法解析的外部指令,求大佬解答
1>------ 已启动生成: 项目: DecCallBack_Demo, 配置: Debug x64 ------ 1>C:\Program Files (x86)\MSBuild\Microsoft.Cpp\v4.0\V140\Microsoft.CppBuild.targets(368,5): warning MSB8004: Output Directory does not end with a trailing slash. This build instance will add the slash as it is required to allow proper evaluation of the Output Directory. 1> DecCallBack_DemoDlg.cpp 1>DecCallBack_DemoDlg.cpp(374): warning C4996: 'sprintf': This function or variable may be unsafe. Consider using sprintf_s instead. To disable deprecation, use _CRT_SECURE_NO_WARNINGS. See online help for details. 1> C:\Program Files (x86)\Windows Kits\10\Include\10.0.10240.0\ucrt\stdio.h(1769): note: 参见“sprintf”的声明 1>DecCallBack_DemoDlg.cpp(375): warning C4996: 'strncpy': This function or variable may be unsafe. Consider using strncpy_s instead. To disable deprecation, use _CRT_SECURE_NO_WARNINGS. See online help for details. 1> C:\Program Files (x86)\Windows Kits\10\Include\10.0.10240.0\ucrt\string.h(346): note: 参见“strncpy”的声明 1>DecCallBack_DemoDlg.cpp(376): warning C4996: 'strncpy': This function or variable may be unsafe. Consider using strncpy_s instead. To disable deprecation, use _CRT_SECURE_NO_WARNINGS. See online help for details. 1> C:\Program Files (x86)\Windows Kits\10\Include\10.0.10240.0\ucrt\string.h(346): note: 参见“strncpy”的声明 1>DecCallBack_DemoDlg.cpp(518): warning C4996: 'sprintf': This function or variable may be unsafe. Consider using sprintf_s instead. To disable deprecation, use _CRT_SECURE_NO_WARNINGS. See online help for details. 1> C:\Program Files (x86)\Windows Kits\10\Include\10.0.10240.0\ucrt\stdio.h(1769): note: 参见“sprintf”的声明 1>DecCallBack_DemoDlg.cpp(519): warning C4996: 'fopen': This function or variable may be unsafe. Consider using fopen_s instead. To disable deprecation, use _CRT_SECURE_NO_WARNINGS. See online help for details. 1> C:\Program Files (x86)\Windows Kits\10\Include\10.0.10240.0\ucrt\stdio.h(205): note: 参见“fopen”的声明 1>DecCallBack_DemoDlg.obj : error LNK2019: 无法解析的外部符号 GdiplusStartup,该符号在函数 "protected: virtual int __cdecl CDecCallBack_DemoDlg::OnInitDialog(void)" (?OnInitDialog@CDecCallBack_DemoDlg@@MEAAHXZ) 中被引用 1>gdiplus.lib : warning LNK4272: 库计算机类型“X86”与目标计算机类型“x64”冲突 1>bin/DecCallBack_Demo.exe : fatal error LNK1120: 1 个无法解析的外部命令 ========== 生成: 成功 0 个,失败 1 个,最新 0 个,跳过 0 个 ==========
初学驱动开发。VS2013编译失败,求大神帮忙看看
除了.inf就只有一段简单的代码如下 #include<ntddk.h> VOID DriverUnload(PDRIVER_OBJECT pDriverObject) { KdPrint(("DriverUnload Routine!\r\n")); } NTSTATUS DriverEntry(PDRIVER_OBJECT pDriverObject,PUNICODE_STRING pRegistryPath) { KdPrint(("%S\r\n", pDriverObject->DriverName.Buffer)); pDriverObject->DriverUnload = DriverUnload; return STATUS_SUCCESS; } 下面是错误 1>------ 已启动生成: 项目: testD, 配置: Win8.1 Debug Win32 ------ 1> Stamping Win8.1Debug\testD.inf [Version] section with DriverVer=09/11/2016,16.43.56.454 1> 源.cpp 1>源.cpp(2): warning C4100: “pDriverObject”: 未引用的形参 1>源.cpp(6): warning C4100: “pRegistryPath”: 未引用的形参 1>BufferOverflowFastFailK.lib(gs_driverentry.obj) : error LNK2019: 无法解析的外部符号 _DriverEntry@8,该符号在函数 _GsDriverEntry@8 中被引用 1>D:\大二代码\testD\Win8.1Debug\testD.sys : fatal error LNK1120: 1 个无法解析的外部命令 2>------ 已启动生成: 项目: testD Package, 配置: Win8.1 Debug Win32 ------ 2>C:\Program Files (x86)\Windows Kits\8.1\build\WindowsDriver.common.targets(1366,5): error MSB3030: 无法复制文件“D:\大二代码\testD\Win8.1Debug\testD.sys”,原因是找不到该文件。 ========== 生成: 成功 0 个,失败 2 个,最新 0 个,跳过 0 个 ========== 求大神帮忙看看
nodejs创建kraken项目报错,使用vs2013
创建一个KRAKEN项目,npm install -g generator-kraken,报错提示node版本过低,手动升级版本0.10.28至4.2.4,继续创建,报错: 在此解决方案中一次生成一个项目。若要启用并行生成,请添加“/m”开关。 C:\Program Files (x86)\MSBuild\Microsoft.Cpp\v4.0\V120\Microsoft.CppBuild.targets(399,5): error MSB3191: 无法创建目录“Release\obj\thread_sleep\thread_sleep.tlog\”。指定的路径或文件名太长,或者两者都太长。完全限定文件名必须少于 260 个字符,并且目录名必须少于 248 个字符。 [C:\Users\liuxiang\AppData\Roaming\npm\node_modules\generator-kraken\node_modules\yeoman-generator\node_modules\cross-spawn\node_modules\spawn-sync\node_modules\try-thread-sleep\node_modules\thread-sleep\build\thread_sleep.vcxproj] gyp ERR! build error gyp ERR! stack Error: `C:\Program Files (x86)\MSBuild\12.0\bin\msbuild.exe` fail ed with exit code: 1 gyp ERR! stack at ChildProcess.onExit (C:\Document\node.js\node_modules\npm\node_modules\node-gyp\lib\build.js:270:23) gyp ERR! stack at emitTwo (events.js:87:13) gyp ERR! stack at ChildProcess.emit (events.js:172:7) gyp ERR! stack at Process.ChildProcess._handle.onexit (internal/child_proces s.js:200:12) gyp ERR! System Windows_NT 6.1.7601 gyp ERR! command "C:\\Document\\node.js\\node.exe" "C:\\Document\\node.js\\node_ modules\\npm\\node_modules\\node-gyp\\bin\\node-gyp.js" "build" "--fallback-to-b uild" "--module=C:\\Users\\liuxiang\\AppData\\Roaming\\npm\\node_modules\\genera tor-kraken\\node_modules\\yeoman-generator\\node_modules\\cross-spawn\\node_modu les\\spawn-sync\\node_modules\\try-thread-sleep\\node_modules\\thread-sleep\\lib \\binding\\Release\\node-v46-win32-x64\\thread_sleep.node" "--module_name=thread _sleep" "--module_path=C:\\Users\\liuxiang\\AppData\\Roaming\\npm\\node_modules\ \generator-kraken\\node_modules\\yeoman-generator\\node_modules\\cross-spawn\\no de_modules\\spawn-sync\\node_modules\\try-thread-sleep\\node_modules\\thread-sle ep\\lib\\binding\\Release\\node-v46-win32-x64" gyp ERR! cwd C:\Users\liuxiang\AppData\Roaming\npm\node_modules\generator-kraken \node_modules\yeoman-generator\node_modules\cross-spawn\node_modules\spawn-sync\ node_modules\try-thread-sleep\node_modules\thread-sleep gyp ERR! node -v v4.2.4 gyp ERR! node-gyp -v v3.0.3 gyp ERR! not ok node-pre-gyp ERR! build error node-pre-gyp ERR! stack Error: Failed to execute 'node-gyp.cmd build --fallback- to-build --module=C:\Users\liuxiang\AppData\Roaming\npm\node_modules\generator-k raken\node_modules\yeoman-generator\node_modules\cross-spawn\node_modules\spawn- sync\node_modules\try-thread-sleep\node_modules\thread-sleep\lib\binding\Release \node-v46-win32-x64\thread_sleep.node --module_name=thread_sleep --module_path=C :\Users\liuxiang\AppData\Roaming\npm\node_modules\generator-kraken\node_modules\ yeoman-generator\node_modules\cross-spawn\node_modules\spawn-sync\node_modules\t ry-thread-sleep\node_modules\thread-sleep\lib\binding\Release\node-v46-win32-x64 ' (1) node-pre-gyp ERR! stack at ChildProcess.<anonymous> (C:\Users\liuxiang\AppDa ta\Roaming\npm\node_modules\generator-kraken\node_modules\yeoman-generator\node_ modules\cross-spawn\node_modules\spawn-sync\node_modules\try-thread-sleep\node_m odules\thread-sleep\node_modules\node-pre-gyp\lib\util\compile.js:83:29) node-pre-gyp ERR! stack at emitTwo (events.js:87:13) node-pre-gyp ERR! stack at ChildProcess.emit (events.js:172:7) node-pre-gyp ERR! stack at maybeClose (internal/child_process.js:818:16) node-pre-gyp ERR! stack at Process.ChildProcess._handle.onexit (internal/chi ld_process.js:211:5) node-pre-gyp ERR! System Windows_NT 6.1.7601 node-pre-gyp ERR! command "C:\\Document\\node.js\\node.exe" "C:\\Users\\liuxiang \\AppData\\Roaming\\npm\\node_modules\\generator-kraken\\node_modules\\yeoman-ge nerator\\node_modules\\cross-spawn\\node_modules\\spawn-sync\\node_modules\\try- thread-sleep\\node_modules\\thread-sleep\\node_modules\\node-pre-gyp\\bin\\node- pre-gyp" "install" "--fallback-to-build" node-pre-gyp ERR! cwd C:\Users\liuxiang\AppData\Roaming\npm\node_modules\generat or-kraken\node_modules\yeoman-generator\node_modules\cross-spawn\node_modules\sp awn-sync\node_modules\try-thread-sleep\node_modules\thread-sleep node-pre-gyp ERR! node -v v4.2.4 node-pre-gyp ERR! node-pre-gyp -v v0.6.9 node-pre-gyp ERR! not ok Failed to execute 'node-gyp.cmd build --fallback-to-build --module=C:\Users\liux iang\AppData\Roaming\npm\node_modules\generator-kraken\node_modules\yeoman-gener ator\node_modules\cross-spawn\node_modules\spawn-sync\node_modules\try-thread-sl eep\node_modules\thread-sleep\lib\binding\Release\node-v46-win32-x64\thread_slee p.node --module_name=thread_sleep --module_path=C:\Users\liuxiang\AppData\Roamin g\npm\node_modules\generator-kraken\node_modules\yeoman-generator\node_modules\c ross-spawn\node_modules\spawn-sync\node_modules\try-thread-sleep\node_modules\th read-sleep\lib\binding\Release\node-v46-win32-x64' (1) npm WARN optional dep failed, continuing thread-sleep@1.0.4 > spawn-sync@1.0.15 postinstall C:\Users\liuxiang\AppData\Roaming\npm\node_modul es\generator-kraken\node_modules\yeoman-generator\node_modules\cross-spawn\node_ modules\spawn-sync > node postinstall generator-kraken@2.2.2 C:\Users\liuxiang\AppData\Roaming\npm\node_modules\genera tor-kraken ├── debuglog@1.0.1 ├── underscore.string@3.2.2 ├── mkdirp@0.5.1 (minimist@0.0.8) ├── chalk@1.1.1 (escape-string-regexp@1.0.4, ansi-styles@2.1.0, supports-colo r@2.0.0, has-ansi@2.0.0, strip-ansi@3.0.0) ├── update-notifier@0.3.2 (is-npm@1.0.0, string-length@1.0.1, semver-diff@2.1 .0, latest-version@1.0.1, configstore@0.3.2) └── yeoman-generator@0.20.3 (detect-conflict@1.0.0, read-chunk@1.0.1, yeoman- assert@2.1.1, path-exists@1.0.0, yeoman-welcome@1.0.1, path-is-absolute@1.0.0, a sync@1.5.2, mime@1.3.4, class-extend@0.1.2, text-table@0.2.0, diff@2.2.1, dargs@ 4.1.0, xdg-basedir@2.0.0, user-home@2.0.0, istextorbinary@1.0.2, shelljs@0.5.3, nopt@3.0.6, debug@2.2.0, run-async@0.1.0, cli-table@0.3.1, through2@2.0.0, glob@ 5.0.15, findup-sync@0.2.1, rimraf@2.5.0, mem-fs-editor@2.1.0, sinon@1.17.2, gith ub-username@2.1.0, dateformat@1.0.12, pretty-bytes@2.0.1, yeoman-environment@1.5 .2, gruntfile-editor@1.1.0, html-wiring@1.2.0, download@4.4.3, lodash@3.10.1, in quirer@0.8.5, cross-spawn@2.1.4)
C++程序编译报错,是软件的问题吗?
1.编译报错如下: 1>------ 已启动生成: 项目: 04带头结点的线性链表, 配置: Debug Win32 ------ 1>生成启动时间为 2019/8/14 22:24:35。 1>C:\Program Files (x86)\MSBuild\Microsoft.Cpp\v4.0\Platforms\Win32\Microsoft.Cpp.Win32.Targets(147,5): error MSB6003: 指定的任务可执行文件“CL.exe”未能运行。文件“C:\Users\erm\AppData\Local\Temp\tmp4e93c8c83e9e4057aa4e2f17f0f92198.rsp”正由另一进程使用,因此该进程无法访问此文件。 1> 1>生成失败。 1> 1>已用时间 00:00:00.37 ========== 生成: 成功 0 个,失败 1 个,最新 0 个,跳过 0 个 ========== 2.调试过程回顾: (1)编译正常,代码运行正常,VS2010 (2)编写子函数模块如下: Status ListTraverse(LinkList L,Status (* visit)(LinkList)) { //依次对L的每个元素调用函数visit().一旦visit()失败,则操作失败 if(!visit) //visit不为空,宏定义#define NULL 0 =》vistit!=NULL return ok; //visit是一个指针变量,可以指向任何函数,注意参数类型 //Status c=(*visit)(L); //指针指向函数 (*visit)(L); return 0; }; (3)修改完成,无语法错误,运行出现报错 3.尝试解决 (1)重新编译,问题未能解决 (2)删除\Users\erm\AppData\Local\Temp\tmp4路径下所有文件,编译,问题未能解决 (3)尝试关闭软件,重新编译,以管理者运行方式打开,重新编译,问题未能解决
vs2010错误机器人足球
最近在学习机器人足球 用的是vs2010运行代码 老是出现错误 3> ------ Building libbhuman (Release) ------ 3> bhuman.cpp 1> Enum.cpp 1> Global.cpp 1> Geometry.cpp 1> Pose2D.cpp 1> OutStreams.cpp 3> ..\..\Src\libbhuman\bhuman.cpp(14) :28: warning: alcore\altypes.h: No such file or directory 3> ..\..\Src\libbhuman\bhuman.cpp(15) :28: warning: alcore\alerror.h: No such file or directory 3> ..\..\Src\libbhuman\bhuman.cpp(16) :31: warning: alcommon\albroker.h: No such file or directory 3> ..\..\Src\libbhuman\bhuman.cpp(17) :30: warning: alcommon\alproxy.h: No such file or directory 3> ..\..\Src\libbhuman\bhuman.cpp(18) :32: warning: alproxies\dcmproxy.h: No such file or directory 3> ..\..\Src\libbhuman\bhuman.cpp(19) :37: warning: alproxies\almemoryproxy.h: No such file or directory 3>..\..\Src\libbhuman\bhuman.cpp(29): error : 'AL' has not been declared 3>..\..\Src\libbhuman\bhuman.cpp(29): error : expected constructor, destructor, or type conversion before '*' token 3>..\..\Src\libbhuman\bhuman.cpp(30): error : 'AL' has not been declared 3>..\..\Src\libbhuman\bhuman.cpp(30): error : expected constructor, destructor, or type conversion before '*' token 3>..\..\Src\libbhuman\bhuman.cpp(31): error : 'AL' has not been declared 3>..\..\Src\libbhuman\bhuman.cpp(31): error : expected constructor, destructor, or type conversion before '*' token 3>..\..\Src\libbhuman\bhuman.cpp(32): error : 'AL' has not been declared 3>..\..\Src\libbhuman\bhuman.cpp(32): error : expected constructor, destructor, or type conversion before '*' token 3>..\..\Src\libbhuman\bhuman.cpp(33): error : 'AL' has not been declared 3>..\..\Src\libbhuman\bhuman.cpp(33): error : expected constructor, destructor, or type conversion before '*' token 3>..\..\Src\libbhuman\bhuman.cpp(34): error : 'AL' has not been declared 3>..\..\Src\libbhuman\bhuman.cpp(34): error : expected constructor, destructor, or type conversion before '*' token 3> ..\..\Src\libbhuman\bhuman.cpp: In function 'void sitDown(float, float*)': 3>..\..\Src\libbhuman\bhuman.cpp(424): error : 'positionRequest' was not declared in this scope 3>..\..\Src\libbhuman\bhuman.cpp(425): error : 'hardnessRequest' was not declared in this scope 3> ..\..\Src\libbhuman\bhuman.cpp: In function 'void standUp(float, float*, float*)': 3>..\..\Src\libbhuman\bhuman.cpp(455): error : 'positionRequest' was not declared in this scope 3> ..\..\Src\libbhuman\bhuman.cpp: In function 'void onPreProcess()': 3>..\..\Src\libbhuman\bhuman.cpp(475): error : 'proxy' was not declared in this scope 3>..\..\Src\libbhuman\bhuman.cpp(475): error : 'positionRequest' was not declared in this scope 3>..\..\Src\libbhuman\bhuman.cpp(475): error : 'hardnessRequest' was not declared in this scope 3>..\..\Src\libbhuman\bhuman.cpp(486): error : 'stderr' was not declared in this scope 3>..\..\Src\libbhuman\bhuman.cpp(486): error : 'fprintf' was not declared in this scope 3>..\..\Src\libbhuman\bhuman.cpp(563): error : 'usRequest' was not declared in this scope 3>..\..\Src\libbhuman\bhuman.cpp(575): error : 'ledRequest' was not declared in this scope 3>..\..\Src\libbhuman\bhuman.cpp(575): error : 'string' is not a member of 'std' 3>..\..\Src\libbhuman\bhuman.cpp(582): error : expected type-specifier before 'AL' 3>..\..\Src\libbhuman\bhuman.cpp(582): error : expected `)' before '::' token 3>..\..\Src\libbhuman\bhuman.cpp(582): error : expected `{' before '::' token 3>..\..\Src\libbhuman\bhuman.cpp(582): error : '::ALError' has not been declared 3>..\..\Src\libbhuman\bhuman.cpp(582): error : 'e' was not declared in this scope 3>..\..\Src\libbhuman\bhuman.cpp(582): error : expected `;' before ')' token 3> ..\..\Src\libbhuman\bhuman.cpp: In function 'void onPostProcess()': 3>..\..\Src\libbhuman\bhuman.cpp(591): error : 'memory' was not declared in this scope 3>..\..\Src\libbhuman\bhuman.cpp(591): error : 'proxy' was not declared in this scope 3>..\..\Src\libbhuman\bhuman.cpp(601): error : 'assert' was not declared in this scope 3>..\..\Src\libbhuman\bhuman.cpp(616): error : 'system' was not declared in this scope 3>..\..\Src\libbhuman\bhuman.cpp(618): error : 'system' was not declared in this scope 3>..\..\Src\libbhuman\bhuman.cpp(622): error : expected type-specifier before 'AL' 3>..\..\Src\libbhuman\bhuman.cpp(622): error : expected `)' before '::' token 3>..\..\Src\libbhuman\bhuman.cpp(622): error : expected `{' before '::' token 3>..\..\Src\libbhuman\bhuman.cpp(622): error : '::ALError' has not been declared 3>..\..\Src\libbhuman\bhuman.cpp(622): error : 'e' was not declared in this scope 3>..\..\Src\libbhuman\bhuman.cpp(622): error : expected `;' before ')' token 3>..\..\Src\libbhuman\bhuman.cpp(641): error : 'stderr' was not declared in this scope 3>..\..\Src\libbhuman\bhuman.cpp(641): error : 'fprintf' was not declared in this scope 3> ..\..\Src\libbhuman\bhuman.cpp: In function 'void close()': 3>..\..\Src\libbhuman\bhuman.cpp(650): error : 'stderr' was not declared in this scope 3>..\..\Src\libbhuman\bhuman.cpp(650): error : 'fprintf' was not declared in this scope 3>..\..\Src\libbhuman\bhuman.cpp(648): error : too many arguments to function 'void close()' 3>..\..\Src\libbhuman\bhuman.cpp(662): error : at this point in file 3>..\..\Src\libbhuman\bhuman.cpp(674): error : 'proxy' was not declared in this scope 3>..\..\Src\libbhuman\bhuman.cpp(676): error : type '<type error>' argument given to 'delete', expected pointer 3>..\..\Src\libbhuman\bhuman.cpp(679): error : 'positionRequest' was not declared in this scope 3>..\..\Src\libbhuman\bhuman.cpp(681): error : type '<type error>' argument given to 'delete', expected pointer 3>..\..\Src\libbhuman\bhuman.cpp(684): error : 'hardnessRequest' was not declared in this scope 3>..\..\Src\libbhuman\bhuman.cpp(686): error : type '<type error>' argument given to 'delete', expected pointer 3>..\..\Src\libbhuman\bhuman.cpp(689): error : 'usRequest' was not declared in this scope 3>..\..\Src\libbhuman\bhuman.cpp(691): error : type '<type error>' argument given to 'delete', expected pointer 3>..\..\Src\libbhuman\bhuman.cpp(694): error : 'ledRequest' was not declared in this scope 3>..\..\Src\libbhuman\bhuman.cpp(696): error : type '<type error>' argument given to 'delete', expected pointer 3>..\..\Src\libbhuman\bhuman.cpp(699): error : 'memory' was not declared in this scope 3>..\..\Src\libbhuman\bhuman.cpp(701): error : type '<type error>' argument given to 'delete', expected pointer 3> ..\..\Src\libbhuman\bhuman.cpp: At global scope: 3>..\..\Src\libbhuman\bhuman.cpp(708): error : 'AL' has not been declared 3>..\..\Src\libbhuman\bhuman.cpp(708): error : 'AL' has not been declared 3>..\..\Src\libbhuman\bhuman.cpp(708): error : 'pBroker' was not declared in this scope 3>..\..\Src\libbhuman\bhuman.cpp(709): error : expected ',' or ';' before '{' token 3> make: *** [../../Build/libbhuman/Linux/Release/bhuman.o] Error 1 3>C:\Program Files\MSBuild\Microsoft.Cpp\v4.0\Microsoft.MakeFile.Targets(43,5): error MSB3073: 命令“bash -c "../../Util/zbuildgen/Win32/bin/zbuildgen.exe ../Linux/libbhuman.make.zbuild && make -f ../Linux/libbhuman.make clean CONFIG=Release SHELLOPTS=igncr && make -j 2 -f ../Linux/libbhuman.make CONFIG=Release SHELLOPTS=igncr"”已退出,代码为 2。 3> 3>生成失败。
vs2017学习汇编,配置出错,我的计算机64位,能否给出详细步骤,具体点,谢谢大佬
------ 已启动生成: 项目: Project2, 配置: Debug x64 ------ 1>Assembling hello.asm... 1>hello.asm(1): error A2008: syntax error : cs 1>C:\Program Files (x86)\Microsoft Visual Studio\2017\Community\Common7\IDE\VC\VCTargets\BuildCustomizations\masm.targets(50,5): error MSB3721: 命令“ml64.exe /c /nologo /Zi /Fo"x64\Debug\hello.obj" /W3 /errorReport:prompt /Tahello.asm”已退出,返回代码为 1。 1>已完成生成项目“Project2.vcxproj”的操作 - 失败。 ========== 生成: 成功 0 个,失败 1 个,最新 0 个,跳过 0 个 ==========
电脑中已经安装了vs2015 还是有问题
在此解决方案中一次生成一个项目。若要启用并行生成,请添加“/m”开关。 MSBUILD : error MSB3411: 未能加载 Visual C++ 组件“VCBuild.exe”。如果未安装该组件 ,请执行下列操作之一: 1) 安装 Microsoft Windows SDK for Windows Server 2008 和 .NET Framework 3.5;或 2) 安装 Microsoft Visual Studio 2008。 [C:\Users\gufan\AppData\Roaming\npm\node_modules\ bcrypt\build\binding.sln] ![图片说明](https://img-ask.csdn.net/upload/201608/16/1471311969_248348.png)
新安装的vc2015编译错误
重装了系统,安装了vc2015,写了个最简单的控制台程序,报如下错误,如何解决,谢谢 1>------ 已启动生成: 项目: sj1, 配置: Debug Win32 ------ 1>C:\Program Files (x86)\MSBuild\14.0\bin\Microsoft.Common.CurrentVersion.targets(96,5): error MSB4184: 无法计算表达式“[Microsoft.Build.Utilities.ToolLocationHelper]::GetPlatformSDKDisplayName(Windows, 8.1)”。没有可用的数据了。 ========== 生成: 成功 0 个,失败 1 个,最新 0 个,跳过 0 个 ==========
vs 202 编译通过,vs2015卡住无法通过,无法解析的外部符号 __vsnwprintf_s,
1>------ 已启动生成: 项目: XuglassForm, 配置: Debug Win32 ------ 1>C:\Program Files (x86)\MSBuild\Microsoft.Cpp\v4.0\V140\Microsoft.CppBuild.targets(1188,5): warning MSB8012: TargetPath(C:\Users\hxy-pc\Desktop\XuglassForm\Debug\XuglassForm.exe) does not match the Linker's OutputFile property value (). This may cause your project to build incorrectly. To correct this, please make sure that $(OutDir), $(TargetName) and $(TargetExt) property values match the value specified in %(Link.OutputFile). 1>odbccp32.lib(dllload.obj) : error LNK2019: 无法解析的外部符号 __vsnwprintf_s,该符号在函数 _StringCchPrintfW 中被引用 1>XuglassForm.exe : fatal error LNK1120: 1 个无法解析的外部命令 ========== 生成: 成功 0 个,失败 1 个,最新 0 个,跳过 0 个 ==========
动态规划入门到熟悉,看不懂来打我啊
持续更新。。。。。。 2.1斐波那契系列问题 2.2矩阵系列问题 2.3跳跃系列问题 3.1 01背包 3.2 完全背包 3.3多重背包 3.4 一些变形选讲 2.1斐波那契系列问题 在数学上,斐波纳契数列以如下被以递归的方法定义:F(0)=0,F(1)=1, F(n)=F(n-1)+F(n-2)(n&gt;=2,n∈N*)根据定义,前十项为1, 1, 2, 3...
130 个相见恨晚的超实用网站,一次性分享出来
相见恨晚的超实用网站 持续更新中。。。
Java学习的正确打开方式
在博主认为,对于入门级学习java的最佳学习方法莫过于视频+博客+书籍+总结,前三者博主将淋漓尽致地挥毫于这篇博客文章中,至于总结在于个人,实际上越到后面你会发现学习的最好方式就是阅读参考官方文档其次就是国内的书籍,博客次之,这又是一个层次了,这里暂时不提后面再谈。博主将为各位入门java保驾护航,各位只管冲鸭!!!上天是公平的,只要不辜负时间,时间自然不会辜负你。 何谓学习?博主所理解的学习,它是一个过程,是一个不断累积、不断沉淀、不断总结、善于传达自己的个人见解以及乐于分享的过程。
程序员必须掌握的核心算法有哪些?
由于我之前一直强调数据结构以及算法学习的重要性,所以就有一些读者经常问我,数据结构与算法应该要学习到哪个程度呢?,说实话,这个问题我不知道要怎么回答你,主要取决于你想学习到哪些程度,不过针对这个问题,我稍微总结一下我学过的算法知识点,以及我觉得值得学习的算法。这些算法与数据结构的学习大多数是零散的,并没有一本把他们全部覆盖的书籍。下面是我觉得值得学习的一些算法以及数据结构,当然,我也会整理一些看过...
Python——画一棵漂亮的樱花树(不同种樱花+玫瑰+圣诞树喔)
最近翻到一篇知乎,上面有不少用Python(大多是turtle库)绘制的树图,感觉很漂亮,我整理了一下,挑了一些我觉得不错的代码分享给大家(这些我都测试过,确实可以生成) one 樱花树 动态生成樱花 效果图(这个是动态的): 实现代码 import turtle as T import random import time # 画樱花的躯干(60,t) def Tree(branch, ...
大学四年自学走来,这些私藏的实用工具/学习网站我贡献出来了
大学四年,看课本是不可能一直看课本的了,对于学习,特别是自学,善于搜索网上的一些资源来辅助,还是非常有必要的,下面我就把这几年私藏的各种资源,网站贡献出来给你们。主要有:电子书搜索、实用工具、在线视频学习网站、非视频学习网站、软件下载、面试/求职必备网站。 注意:文中提到的所有资源,文末我都给你整理好了,你们只管拿去,如果觉得不错,转发、分享就是最大的支持了。 一、电子书搜索 对于大部分程序员...
为啥国人偏爱Mybatis,而老外喜欢Hibernate/JPA呢?
关于SQL和ORM的争论,永远都不会终止,我也一直在思考这个问题。昨天又跟群里的小伙伴进行了一番讨论,感触还是有一些,于是就有了今天这篇文。 声明:本文不会下关于Mybatis和JPA两个持久层框架哪个更好这样的结论。只是摆事实,讲道理,所以,请各位看官勿喷。 一、事件起因 关于Mybatis和JPA孰优孰劣的问题,争论已经很多年了。一直也没有结论,毕竟每个人的喜好和习惯是大不相同的。我也看...
我在支付宝花了1分钟,查到了女朋友的开房记录!
在大数据时代下,不管你做什么都会留下蛛丝马迹,只要学会把各种软件运用到极致,捉奸简直轻而易举。今天就来给大家分享一下,什么叫大数据抓出轨。据史料证明,马爸爸年轻时曾被...
shell脚本:备份数据库、代码上线
备份MySQL数据库 场景: 一台MySQL服务器,跑着5个数据库,在没有做主从的情况下,需要对这5个库进行备份 需求: 1)每天备份一次,需要备份所有的库 2)把备份数据存放到/data/backup/下 3)备份文件名称格式示例:dbname-2019-11-23.sql 4)需要对1天以前的所有sql文件压缩,格式为gzip 5)本地数据保留1周 6)需要把备份的数据同步到远程备份中心,假如...
聊聊C语言和指针的本质
坐着绿皮车上海到杭州,24块钱,很宽敞,在火车上非正式地聊几句。 很多编程语言都以 “没有指针” 作为自己的优势来宣传,然而,对于C语言,指针却是与生俱来的。 那么,什么是指针,为什么大家都想避开指针。 很简单, 指针就是地址,当一个地址作为一个变量存在时,它就被叫做指针,该变量的类型,自然就是指针类型。 指针的作用就是,给出一个指针,取出该指针指向地址处的值。为了理解本质,我们从计算机模型说起...
为什么你学不过动态规划?告别动态规划,谈谈我的经验
动态规划难吗?说实话,我觉得很难,特别是对于初学者来说,我当时入门动态规划的时候,是看 0-1 背包问题,当时真的是一脸懵逼。后来,我遇到动态规划的题,看的懂答案,但就是自己不会做,不知道怎么下手。就像做递归的题,看的懂答案,但下不了手,关于递归的,我之前也写过一篇套路的文章,如果对递归不大懂的,强烈建议看一看:为什么你学不会递归,告别递归,谈谈我的经验 对于动态规划,春招秋招时好多题都会用到动态...
程序员一般通过什么途径接私活?
二哥,你好,我想知道一般程序猿都如何接私活,我也想接,能告诉我一些方法吗? 上面是一个读者“烦不烦”问我的一个问题。其实不止是“烦不烦”,还有很多读者问过我类似这样的问题。 我接的私活不算多,挣到的钱也没有多少,加起来不到 20W。说实话,这个数目说出来我是有点心虚的,毕竟太少了,大家轻喷。但我想,恰好配得上“一般程序员”这个称号啊。毕竟苍蝇再小也是肉,我也算是有经验的人了。 唾弃接私活、做外...
字节跳动面试官这样问消息队列:分布式事务、重复消费、顺序消费,我整理了一下
你知道的越多,你不知道的越多 点赞再看,养成习惯 GitHub上已经开源 https://github.com/JavaFamily 有一线大厂面试点脑图、个人联系方式和人才交流群,欢迎Star和完善 前言 消息队列在互联网技术存储方面使用如此广泛,几乎所有的后端技术面试官都要在消息队列的使用和原理方面对小伙伴们进行360°的刁难。 作为一个在互联网公司面一次拿一次Offer的面霸...
2020年大前端发展趋势
迅速发展的前端开发,在每⼀年,都为开发者带来了新的关键词。2019 年已步⼊尾声,2020 年前端发展的关键词⼜将有哪些呢?发展的方向又会是什么呢?参考2019年大前端的发展,不出意外,前端依旧会围绕⼩程序、超级APP、跨端开发、前端⼯程化以及新技术运用等几个方面进行展开(可以参考2019年大前端技术趋势深度解读)。 小程序 在⼩程序⽅⾯,今年仍然是⼩程序突⻜猛进的⼀年,各⼤主流的 App 都上线...
如何安装 IntelliJ IDEA 最新版本——详细教程
IntelliJ IDEA 简称 IDEA,被业界公认为最好的 Java 集成开发工具,尤其在智能代码助手、代码自动提示、代码重构、代码版本管理(Git、SVN、Maven)、单元测试、代码分析等方面有着亮眼的发挥。IDEA 产于捷克,开发人员以严谨著称的东欧程序员为主。IDEA 分为社区版和付费版两个版本。 我呢,一直是 Eclipse 的忠实粉丝,差不多十年的老用户了。很早就接触到了 IDEA...
1个月时间整理了2019年上千道Java面试题,近500页文档!
Spring 面试题 1、一般问题 1.1、不同版本的 spring Framework 有哪些主要功能? 1.2、什么是 spring Framework? 1.3、列举 spring Framework 的优点。 1.4、spring Framework 有哪些不同的功能? 1.5、spring Framework 中有多少个模块,它们分别是什么? 1.6、什么是 spring ...
面试还搞不懂redis,快看看这40道面试题(含答案和思维导图)
Redis 面试题 1、什么是 Redis?. 2、Redis 的数据类型? 3、使用 Redis 有哪些好处? 4、Redis 相比 Memcached 有哪些优势? 5、Memcache 与 Redis 的区别都有哪些? 6、Redis 是单进程单线程的? 7、一个字符串类型的值能存储最大容量是多少? 8、Redis 的持久化机制是什么?各自的优缺点? 9、Redis 常见性...
为什么要推荐大家学习字节码?
配套视频: 为什么推荐大家学习Java字节码 https://www.bilibili.com/video/av77600176/ 一、背景 本文主要探讨:为什么要学习 JVM 字节码? 可能很多人会觉得没必要,因为平时开发用不到,而且不学这个也没耽误学习。 但是这里分享一点感悟,即人总是根据自己已经掌握的知识和技能来解决问题的。 这里有个悖论,有时候你觉得有些技术没用恰恰是...
在阿里,40岁的奋斗姿势
在阿里,40岁的奋斗姿势 在阿里,什么样的年纪可以称为老呢?35岁? 在云网络,有这样一群人,他们的平均年龄接近40,却刚刚开辟职业生涯的第二战场。 他们的奋斗姿势是什么样的呢? 洛神赋 “翩若惊鸿,婉若游龙。荣曜秋菊,华茂春松。髣髴兮若轻云之蔽月,飘飖兮若流风之回雪。远而望之,皎若太阳升朝霞;迫而察之,灼若芙蕖出渌波。” 爱洛神,爱阿里云 2018年,阿里云网络产品部门启动洛神2.0升...
【超详细分析】关于三次握手与四次挥手面试官想考我们什么?
在面试中,三次握手和四次挥手可以说是问的最频繁的一个知识点了,我相信大家也都看过很多关于三次握手与四次挥手的文章,今天的这篇文章,重点是围绕着面试,我们应该掌握哪些比较重要的点,哪些是比较被面试官给问到的,我觉得如果你能把我下面列举的一些点都记住、理解,我想就差不多了。 三次握手 当面试官问你为什么需要有三次握手、三次握手的作用、讲讲三次三次握手的时候,我想很多人会这样回答: 首先很多人会先讲下握...
压测学习总结(1)——高并发性能指标:QPS、TPS、RT、吞吐量详解
一、QPS,每秒查询 QPS:Queries Per Second意思是“每秒查询率”,是一台服务器每秒能够相应的查询次数,是对一个特定的查询服务器在规定时间内所处理流量多少的衡量标准。互联网中,作为域名系统服务器的机器的性能经常用每秒查询率来衡量。 二、TPS,每秒事务 TPS:是TransactionsPerSecond的缩写,也就是事务数/秒。它是软件测试结果的测量单位。一个事务是指一...
新程序员七宗罪
当我发表这篇文章《为什么每个工程师都应该开始考虑开发中的分析和编程技能呢?》时,我从未想到它会对读者产生如此积极的影响。那些想要开始探索编程和数据科学领域的人向我寻求建议;还有一些人问我下一篇文章的发布日期;还有许多人询问如何顺利过渡到这个职业。我非常鼓励大家继续分享我在这个旅程的经验,学习,成功和失败,以帮助尽可能多的人过渡到一个充满无数好处和机会的职业生涯。亲爱的读者,谢谢你。 -罗伯特。 ...
活到老,学到老,程序员也该如此
全文共2763字,预计学习时长8分钟 图片来源:Pixabay 此前,“网传阿里巴巴要求尽快实现P8全员35周岁以内”的消息闹得沸沸扬扬。虽然很快被阿里辟谣,但苍蝇不叮无缝的蛋,无蜜不招彩蝶蜂。消息从何而来?真相究竟怎样?我们无从而知。我们只知道一个事实:不知从何时开始,程序猿也被划在了“吃青春饭”行业之列。 饱受“996ICU”摧残后,好不容易“头秃了变强了”,即将步入为“高...
Vue快速实现通用表单验证
本文开篇第一句话,想引用鲁迅先生《祝福》里的一句话,那便是:“我真傻,真的,我单单知道后端整天都是CRUD,我没想到前端整天都是Form表单”。这句话要从哪里说起呢?大概要从最近半个月的“全栈工程师”说起。项目上需要做一个城市配载的功能,顾名思义,就是通过框选和拖拽的方式在地图上完成配载。博主选择了前后端分离的方式,在这个过程中发现:首先,只要有依赖jQuery的组件,譬如Kendoui,即使使用...
2019年Spring Boot面试都问了什么?快看看这22道面试题!
Spring Boot 面试题 1、什么是 Spring Boot? 2、Spring Boot 有哪些优点? 3、什么是 JavaConfig? 4、如何重新加载 Spring Boot 上的更改,而无需重新启动服务器? 5、Spring Boot 中的监视器是什么? 6、如何在 Spring Boot 中禁用 Actuator 端点安全性? 7、如何在自定义端口上运行 Sprin...
Unity项目在pc和ios设备上黑屏的原因探究
0x00 由于项目上线了windows平台的项目(别问我为什么,咱也不敢说,咱也不敢问),由Unity5.4.6升级到Unity2018的过程中,遇到了各种各样的坑,本文为避坑指南1。本项目没有使用HDR和抗锯齿,由于查这几个问题查到吐血,前后用了3天的时间,本文充满了怨气,行文非常啰嗦,需要快速解决问题的,可以直接拉到最后看结论。 0x01 法线贴图 项目在unity2018出了新的androi...
关于裁员几点看法及建议
最近网易裁员事件引起广泛关注,昨天网易针对此事,也发了声明,到底谁对谁错,孰是孰非?我们作为吃瓜观众实在是知之甚少,所以不敢妄下定论。身处软件开发这个行业,近一两年来,对...
面试官:关于Java性能优化,你有什么技巧
通过使用一些辅助性工具来找到程序中的瓶颈,然后就可以对瓶颈部分的代码进行优化。 一般有两种方案:即优化代码或更改设计方法。我们一般会选择后者,因为不去调用以下代码要比调用一些优化的代码更能提高程序的性能。而一个设计良好的程序能够精简代码,从而提高性能。 下面将提供一些在JAVA程序的设计和编码中,为了能够提高JAVA程序的性能,而经常采用的一些方法和技巧。 1.对象的生成和大小的调整。 J...
【图解算法面试】记一次面试:说说游戏中的敏感词过滤是如何实现的?
版权声明:本文为苦逼的码农原创。未经同意禁止任何形式转载,特别是那些复制粘贴到别的平台的,否则,必定追究。欢迎大家多多转发,谢谢。 小秋今天去面试了,面试官问了一个与敏感词过滤算法相关的问题,然而小秋对敏感词过滤算法一点也没听说过。于是,有了下下事情的发生… 面试官开怼 面试官:玩过王者荣耀吧?了解过敏感词过滤吗?,例如在游戏里,如果我们发送“你在干嘛?麻痹演员啊你?”,由于“麻痹”是一个敏感词,...
相关热词 c# id读写器 c#俄罗斯方块源码 c# linq原理 c# 装箱有什么用 c#集合 复制 c# 一个字符串分组 c++和c#哪个就业率高 c# 批量动态创建控件 c# 模块和程序集的区别 c# gmap 截图
立即提问