conda安装python-graphviz报错:

用conda安装python-graphviz时报错:CondaError: Cannot link a source that does not exist. C:\ProgramData\Anaconda3\Scripts\conda.exe

代码片段如下

pip-19.1.1-py3 100% |###############################| Time: 0:00:03 590.55 kB/s
ERROR conda.core.link:_execute_actions(337): An error occurred while installing package 'defaults::tqdm-4.32.1-py_0'.
CondaError: Cannot link a source that does not exist. C:\ProgramData\Anaconda3\Scripts\conda.exe
Attempting to roll back.


CondaError: Cannot link a source that does not exist. C:\ProgramData\Anaconda3\Scripts\conda.exe

求助如何解决

Csdn user default icon
上传中...
上传图片
插入图片
抄袭、复制答案,以达到刷声望分或其他目的的行为,在CSDN问答是严格禁止的,一经发现立刻封号。是时候展现真正的技术了!
其他相关推荐
conda安装librosa报错LinkError: post-link script failed for package conda-forge::qt?
(tensorflow-gpu) C:\Users\AnnJune>conda install -c conda-forge librosa Collecting package metadata: done Solving environment: \ The environment is inconsistent, please check the package plan carefully The following packages are causing the inconsistency: - conda-forge/noarch::librosa==0.6.3=py_0 - conda-forge/win-64::matplotlib==3.1.0=py36_1 - conda-forge/win-64::matplotlib-base==3.1.0=py36h2852a4a_1 - defaults/win-64::numba==0.39.0=py36h830ac7b_0 - conda-forge/win-64::pyqt==5.6.0=py36h764d66f_1008 - conda-forge/noarch::resampy==0.2.1=py_1 - conda-forge/win-64::scikit-learn==0.21.2=py36h0ff8352_0 - defaults/win-64::scipy==1.2.1=py36h29ff71c_0 done ## Package Plan ## environment location: C:\Users\AnnJune\Anaconda3\envs\tensorflow-gpu added / updated specs: - librosa The following packages will be downloaded: package | build ---------------------------|----------------- certifi-2019.3.9 | py36_0 149 KB conda-forge icu-58.1 | vc14_0 11.3 MB conda-forge llvmlite-0.28.0 | py36_0 12.5 MB conda-forge numba-0.43.1 | py36hf9181ef_0 2.8 MB defaults openssl-1.1.1b | hfa6e2cd_2 4.8 MB conda-forge pyqt-5.9.2 | py36h6538335_0 4.3 MB conda-forge qt-5.9.7 | hc6833c9_1 91.1 MB conda-forge sip-4.19.8 |py36h6538335_1000 281 KB conda-forge ------------------------------------------------------------ Total: 127.1 MB The following NEW packages will be INSTALLED: audioread conda-forge/win-64::audioread-2.1.6-py36_0 blas pkgs/main/win-64::blas-1.0-mkl ca-certificates conda-forge/win-64::ca-certificates-2019.3.9-hecc5488_0 cycler conda-forge/noarch::cycler-0.10.0-py_1 decorator conda-forge/noarch::decorator-4.4.0-py_0 freetype conda-forge/win-64::freetype-2.10.0-h5db478b_0 icc_rt pkgs/main/win-64::icc_rt-2019.0.0-h0cc432a_1 icu conda-forge/win-64::icu-58.1-vc14_0 intel-openmp pkgs/main/win-64::intel-openmp-2019.3-203 joblib conda-forge/noarch::joblib-0.13.2-py_0 jpeg conda-forge/win-64::jpeg-9c-hfa6e2cd_1001 kiwisolver conda-forge/win-64::kiwisolver-1.1.0-py36he980bc4_0 libblas conda-forge/win-64::libblas-3.8.0-10_mkl libcblas conda-forge/win-64::libcblas-3.8.0-10_mkl liblapack conda-forge/win-64::liblapack-3.8.0-10_mkl libpng conda-forge/win-64::libpng-1.6.37-h7602738_0 llvmlite conda-forge/win-64::llvmlite-0.28.0-py36_0 mkl pkgs/main/win-64::mkl-2019.3-203 numpy conda-forge/win-64::numpy-1.16.3-py36h873a0b8_0 openssl conda-forge/win-64::openssl-1.1.1b-hfa6e2cd_2 pyparsing conda-forge/noarch::pyparsing-2.4.0-py_0 python-dateutil conda-forge/noarch::python-dateutil-2.8.0-py_0 qt conda-forge/win-64::qt-5.9.7-hc6833c9_1 sip conda-forge/win-64::sip-4.19.8-py36h6538335_1000 six conda-forge/win-64::six-1.12.0-py36_1000 tornado conda-forge/win-64::tornado-6.0.2-py36hfa6e2cd_0 zlib conda-forge/win-64::zlib-1.2.11-h2fa13f4_1004 The following packages will be UPDATED: numba 0.39.0-py36h830ac7b_0 --> 0.43.1-py36hf9181ef_0 pyqt 5.6.0-py36h764d66f_1008 --> 5.9.2-py36h6538335_0 The following packages will be SUPERSEDED by a higher-priority channel: certifi pkgs/main --> conda-forge Proceed ([y]/n)? y Downloading and Extracting Packages openssl-1.1.1b | 4.8 MB | ############################################################################ | 100% numba-0.43.1 | 2.8 MB | ############################################################################ | 100% pyqt-5.9.2 | 4.3 MB | ############################################################################ | 100% llvmlite-0.28.0 | 12.5 MB | ############################################################################ | 100% qt-5.9.7 | 91.1 MB | ############################################################################ | 100% certifi-2019.3.9 | 149 KB | ############################################################################ | 100% icu-58.1 | 11.3 MB | ############################################################################ | 100% sip-4.19.8 | 281 KB | ############################################################################ | 100% Preparing transaction: done Verifying transaction: done Executing transaction: \ ERROR conda.core.link:_execute_post_link_actions(658): An error occurred while installing package 'conda-forge::qt-5.9.7-hc6833c9_1'. LinkError: post-link script failed for package conda-forge::qt-5.9.7-hc6833c9_1 running your command again with `-v` will provide additional information location of failed script: C:\Users\AnnJune\Anaconda3\envs\tensorflow-gpu\Scripts\.qt-post-link.bat ==> script messages <== <None> Attempting to roll back. failed ERROR conda.core.link:_execute(568): An error occurred while installing package 'conda-forge::qt-5.9.7-hc6833c9_1'. LinkError: post-link script failed for package conda-forge::qt-5.9.7-hc6833c9_1 running your command again with `-v` will provide additional information location of failed script: C:\Users\AnnJune\Anaconda3\envs\tensorflow-gpu\Scripts\.qt-post-link.bat ==> script messages <== <None> Attempting to roll back. Rolling back transaction: done LinkError: post-link script failed for package conda-forge::qt-5.9.7-hc6833c9_1 running your command again with `-v` will provide additional information location of failed script: C:\Users\AnnJune\Anaconda3\envs\tensorflow-gpu\Scripts\.qt-post-link.bat ==> script messages <== <None>
conda update --all 失败
我想升级numpy,原先先后尝试conda update --all 以及conda update numpy,是可以的,但都因为网络还是什么原因中断了,两个命令都尝试了两次,都中断了。 后来过了一会,我再尝试conda update --all 以及conda update numpy,失败了,报错,报错原因都差不多,以下是conda update --all的报错代码,请各位大佬救救我,小白我万分感谢 ``` (base) C:\Users\RZW>conda update --all # >>>>>>>>>>>>>>>>>>>>>> ERROR REPORT <<<<<<<<<<<<<<<<<<<<<< Traceback (most recent call last): File "D:\Program files\Anaconda\lib\site-packages\libarchive\ffi.py", line 55, in <module> libarchive = ctypes.cdll.LoadLibrary(libarchive_path) File "D:\Program files\Anaconda\lib\ctypes\__init__.py", line 434, in LoadLibrary return self._dlltype(name) File "D:\Program files\Anaconda\lib\ctypes\__init__.py", line 356, in __init__ self._handle = _dlopen(self._name, mode) OSError: [WinError 126] 找不到指定的模块。 During handling of the above exception, another exception occurred: Traceback (most recent call last): File "D:\Program files\Anaconda\lib\site-packages\conda\exceptions.py", line 1062, in __call__ return func(*args, **kwargs) File "D:\Program files\Anaconda\lib\site-packages\conda\cli\main.py", line 84, in _main exit_code = do_call(args, p) File "D:\Program files\Anaconda\lib\site-packages\conda\cli\conda_argparse.py", line 82, in do_call exit_code = getattr(module, func_name)(args, parser) File "D:\Program files\Anaconda\lib\site-packages\conda\cli\main_update.py", line 20, in execute install(args, parser, 'update') File "D:\Program files\Anaconda\lib\site-packages\conda\cli\install.py", line 116, in install if context.use_only_tar_bz2: File "D:\Program files\Anaconda\lib\site-packages\conda\base\context.py", line 664, in use_only_tar_bz2 import conda_package_handling.api File "D:\Program files\Anaconda\lib\site-packages\conda_package_handling\api.py", line 3, in <module> from libarchive.exception import ArchiveError as _LibarchiveArchiveError File "D:\Program files\Anaconda\lib\site-packages\libarchive\__init__.py", line 1, in <module> from .entry import ArchiveEntry File "D:\Program files\Anaconda\lib\site-packages\libarchive\entry.py", line 6, in <module> from . import ffi File "D:\Program files\Anaconda\lib\site-packages\libarchive\ffi.py", line 57, in <module> raise ImportError("Failed to load libarchive library from %s - are any dependencies missing?" ImportError: Failed to load libarchive library from %s - are any dependencies missing?Is your environment activated? `$ D:\Program files\Anaconda\Scripts\conda-script.py update --all` environment variables: CIO_TEST=<not set> CONDA_DEFAULT_ENV=base CONDA_EXE=D:\Program files\Anaconda\condabin\..\Scripts\conda.exe CONDA_EXES="D:\Program files\Anaconda\condabin\..\Scripts\conda.exe" CONDA_PREFIX=D:\Program files\Anaconda CONDA_PROMPT_MODIFIER=(base) CONDA_PYTHON_EXE=D:\Program files\Anaconda\python.exe CONDA_ROOT=D:\Program files\Anaconda CONDA_SHLVL=1 HOMEPATH=\Users\RZW MOZ_PLUGIN_PATH=D:\Program files\Zeon\Gaaiho\Gaaiho Reader\Bin PATH=D:\Program files\Anaconda\Library\bin;D:\Program files\Anaconda;D:\Program files\Anaconda\Library\mingw-w64\bin;D:\Program files\Anaconda\Library\usr\bin;D:\Program files\Anaconda\Library\bin;D:\Program files\Anaconda\Scripts;D:\Program files\Anaconda\bin;D:\Program files\Anaconda;D:\Program files\Anaconda\Library\mingw-w64\bin;D:\Program files\Anaconda\Library\usr\bin;D:\Program files\Anaconda\Library\bin;D:\Program files\Anaconda\Scripts;D:\Program files\Anaconda\bin;D:\Program files\ Anaconda\condabin;C:\Windows\system32;C:\Windows;C:\Windows\System32\W bem;C:\Windows\System32\WindowsPowerShell\v1.0\锛汥:\Program files\Anaconda锛汥:\Program files\Anaconda\Scripts锛汥:\Program files\Anaconda\envs\tensorflow\Lib\site-packages;D:\Program files\Anaconda\Library\bin;D:\Program files\Anaconda;D:\Program files\Anaconda\Library\mingw-w64\bin;D:\Program files\Anaconda\Library\usr\bin;D:\Program files\Anaconda\Library\bin;D:\Program files\Anaconda\Scripts;D:\Program files PSMODULEPATH=C:\Windows\system32\WindowsPowerShell\v1.0\Modules\ REQUESTS_CA_BUNDLE=<not set> SSL_CERT_FILE=<not set> active environment : base active env location : D:\Program files\Anaconda shell level : 1 user config file : C:\Users\RZW\.condarc populated config files : C:\Users\RZW\.condarc conda version : 4.7.11 conda-build version : 3.18.8 python version : 3.7.3.final.0 virtual packages : base environment : D:\Program files\Anaconda (writable) channel URLs : https://mirrors.tuna.tsinghua.edu.cn/anaconda/cloud/msys2/win-64 https://mirrors.tuna.tsinghua.edu.cn/anaconda/cloud/msys2/noarch https://mirrors.tuna.tsinghua.edu.cn/anaconda/cloud/conda-forge/win-64 https://mirrors.tuna.tsinghua.edu.cn/anaconda/cloud/conda-forge/noarch https://mirrors.tuna.tsinghua.edu.cn/anaconda/pkgs/free/win-64 https://mirrors.tuna.tsinghua.edu.cn/anaconda/pkgs/free/noarch https://repo.anaconda.com/pkgs/main/win-64 https://repo.anaconda.com/pkgs/main/noarch https://repo.anaconda.com/pkgs/r/win-64 https://repo.anaconda.com/pkgs/r/noarch https://repo.anaconda.com/pkgs/msys2/win-64 https://repo.anaconda.com/pkgs/msys2/noarch package cache : D:\Program files\Anaconda\pkgs C:\Users\RZW\.conda\pkgs C:\Users\RZW\AppData\Local\conda\conda\pkgs envs directories : D:\Program files\Anaconda\envs C:\Users\RZW\.conda\envs C:\Users\RZW\AppData\Local\conda\conda\envs platform : win-64 user-agent : conda/4.7.11 requests/2.22.0 CPython/3.7.3 Windows/10 Windows/10.0.10240 administrator : False netrc file : None offline mode : False An unexpected error has occurred. Conda has prepared the above report. If submitted, this report will be used by core maintainers to improve future releases of conda. Would you like conda to send this report to the core maintainers? [y/N]: ```
更新conda update scikit-learn的问题
各位,我想请教下,我在更新conda update scikit-learn的时候出错了: ERROR conda.core.link:_execute_actions(337): An error occurred while installing package 'defaults::tqdm-4.40.0-py_0'. CondaError: Cannot link a source that does not exist. C:\Users\86186\Anaconda3\Scripts\conda.exe Running `conda clean --packages` may resolve your problem. Attempting to roll back. CondaError: Cannot link a source that does not exist. C:\Users\86186\Anaconda3\Scripts\conda.exe Running `conda clean --packages` may resolve your problem. 请问如何解决呢,感谢!感谢!
Mac 系统安装anaconda+pycharm相关问题
系统:Mac10.15.2 软件:anaconda+pycharm,通过下载软件包拖拽安装 问题: 1.每次在终端中直接运行: conda --version 都会显示: command not found: conda 2.运行 source .bash_profile 再运行 conda --version 又会提示: __add_sys_prefix_to_path:6: command not found: dirname __add_sys_prefix_to_path:7: command not found: dirname conda 4.8.0 求大神指导这是怎么了?
安装anaconda后输入conda info 报错求解
想问下这个administrator : false; offline mode : false是什么问题怎么解决. 并且输入python后显示是环境变量但未激活。并且安装后桌面找不到anaconda的图标。望大神救救我!!! active environment : base active env location : D:\anaconda shell level : 1 user config file : C:\Users\Katharine\.condarc populated config files : conda version : 4.7.10 conda-build version : 3.18.8 python version : 3.7.3.final.0 virtual packages : __cuda=10.0 base environment : D:\anaconda (writable) channel URLs : https://repo.anaconda.com/pkgs/main/win-64 https://repo.anaconda.com/pkgs/main/noarch https://repo.anaconda.com/pkgs/r/win-64 https://repo.anaconda.com/pkgs/r/noarch https://repo.anaconda.com/pkgs/msys2/win-64 https://repo.anaconda.com/pkgs/msys2/noarch package cache : D:\anaconda\pkgs C:\Users\Katharine\.conda\pkgs C:\Users\Katharine\AppData\Local\conda\conda\pkgs envs directories : D:\anaconda\envs C:\Users\Katharine\.conda\envs C:\Users\Katharine\AppData\Local\conda\conda\envs platform : win-64 user-agent : conda/4.7.10 requests/2.22.0 CPython/3.7.3 Windows/10 Windows/10.0.17134 administrator : False netrc file : None offline mode : False
ubuntu系统,pip install conda后报错
1.在ubuntu系统下,安装了anaconda,然后在ubuntu系统下打开命令窗,输入conda,一切正常。 2.但是打开anaconda平台,进入其中一个环境(environment),右键打开terminal,输入conda,报错:The install method you used for conda--probably either `pip install conda` or `easy_install conda`--is not compatible with using conda as an application.
Anaconda使用conda更新或安装报错
Win10,Anaconda3,python3.6,使用conda或者pip命令upgrade或者install都会报错 以为是因为版本冲突,Anaconda重装了也没有用,帮忙看看是什么错误啦谢谢~ ``` --conda upgrade conda Fetching package metadata ...An unexpected error has occurred. Please consider posting the following information to the conda GitHub issue tracker at: https://github.com/conda/conda/issues Current conda install: platform : win-64 conda version : 4.3.27 conda is private : False conda-env version : 4.3.27 conda-build version : 3.0.22 python version : 3.6.2.final.0 requests version : 2.18.4 root environment : C:\Anaconda3 (writable) default environment : C:\Anaconda3 envs directories : C:\Anaconda3\envs C:\Users\Yvette~1\AppData\Local\conda\conda\envs C:\Users\Yvette\.conda\envs package cache : C:\Anaconda3\pkgs C:\Users\Yvette~1\AppData\Local\conda\conda\pkgs channel URLs : https://mirrors.tuna.tsinghua.edu.cn/anaconda/pkgs/free/win-64 https://mirrors.tuna.tsinghua.edu.cn/anaconda/pkgs/free/noarch https://repo.continuum.io/pkgs/main/win-64 https://repo.continuum.io/pkgs/main/noarch https://repo.continuum.io/pkgs/free/win-64 https://repo.continuum.io/pkgs/free/noarch https://repo.continuum.io/pkgs/r/win-64 https://repo.continuum.io/pkgs/r/noarch https://repo.continuum.io/pkgs/pro/win-64 https://repo.continuum.io/pkgs/pro/noarch https://repo.continuum.io/pkgs/msys2/win-64 https://repo.continuum.io/pkgs/msys2/noarch config file : C:\Users\陈惠宇宝宝\.condarc netrc file : None offline mode : False user-agent : conda/4.3.27 requests/2.18.4 CPython/3.6.2 Windows/10 Windows/10.0.15063 administrator : False `$ C:\Anaconda3\Scripts\conda upgrade conda` Traceback (most recent call last): File "C:\Anaconda3\lib\site-packages\conda\exceptions.py", line 640, in conda_exception_handler return_value = func(*args, **kwargs) File "C:\Anaconda3\lib\site-packages\conda\cli\main.py", line 140, in _main exit_code = args.func(args, p) File "C:\Anaconda3\lib\site-packages\conda\cli\main_update.py", line 65, in execute install(args, parser, 'update') File "C:\Anaconda3\lib\site-packages\conda\cli\install.py", line 231, in install unknown=index_args['unknown'], prefix=prefix) File "C:\Anaconda3\lib\site-packages\conda\core\index.py", line 101, in get_index index = fetch_index(channel_priority_map, use_cache=use_cache) File "C:\Anaconda3\lib\site-packages\conda\core\index.py", line 120, in fetch_index repodatas = collect_all_repodata(use_cache, tasks) File "C:\Anaconda3\lib\site-packages\conda\core\repodata.py", line 75, in collect_all_repodata repodatas = _collect_repodatas_serial(use_cache, tasks) File "C:\Anaconda3\lib\site-packages\conda\core\repodata.py", line 485, in _collect_repodatas_serial for url, schan, pri in tasks] File "C:\Anaconda3\lib\site-packages\conda\core\repodata.py", line 485, in <listcomp> for url, schan, pri in tasks] File "C:\Anaconda3\lib\site-packages\conda\core\repodata.py", line 115, in func res = f(*args, **kwargs) File "C:\Anaconda3\lib\site-packages\conda\core\repodata.py", line 464, in fetch_repodata mod_etag_headers.get('_mod')) File "C:\Anaconda3\lib\site-packages\conda\core\repodata.py", line 144, in fetch_repodata_remote_request timeout=timeout) File "C:\Anaconda3\lib\site-packages\requests\sessions.py", line 521, in get return self.request('GET', url, **kwargs) File "C:\Anaconda3\lib\site-packages\requests\sessions.py", line 508, in request resp = self.send(prep, **send_kwargs) File "C:\Anaconda3\lib\site-packages\requests\sessions.py", line 618, in send r = adapter.send(request, **kwargs) File "C:\Anaconda3\lib\site-packages\requests\adapters.py", line 440, in send timeout=timeout File "C:\Anaconda3\lib\site-packages\urllib3\connectionpool.py", line 595, in urlopen self._prepare_proxy(conn) File "C:\Anaconda3\lib\site-packages\urllib3\connectionpool.py", line 816, in _prepare_proxy conn.connect() File "C:\Anaconda3\lib\site-packages\urllib3\connection.py", line 284, in connect conn = self._new_conn() File "C:\Anaconda3\lib\site-packages\urllib3\connection.py", line 141, in _new_conn (self.host, self.port), self.timeout, **extra_kw) File "C:\Anaconda3\lib\site-packages\urllib3\util\connection.py", line 51, in create_connection if host.startswith('['): AttributeError: 'NoneType' object has no attribute 'startswith' ```
用conda安装pytorch时出现以下错误,该怎么改吖
Collecting package metadata (current_repodata.json): done Solving environment: / The environment is inconsistent, please check the package plan carefully The following packages are causing the inconsistency: - defaults/win-64::tensorflow==1.14.0=gpu_py37h5512b17_0 - defaults/noarch::tensorflow-estimator==1.14.0=py_0 - defaults/win-64::tensorflow-gpu==1.14.0=h0d30ee6_0 failed with initial frozen solve. Retrying with flexible solve. Solving environment: failed with repodata from current_repodata.json, will retry with next repodata source.
如何从conda-forge清单中安装的指定Python扩展?
我想用 conda 命令安装 numpy, 首先我搜一下版本列表: ``` conda search numpy -c conda-forge ``` 然后我想安装这个列表中的: ``` numpy 1.15.4 py36_blas_openblash442142e_1000 conda-forge ``` 用这个命令: ``` conda install numpy=1.15.4 -c conda-forge ``` 是可以的 但是我想安装这个带OpenBLAS的, 请问指令如何写?
如何在anconda show +package name 的结果中选择安装包的版本?
我最近想学习hmm,在安装hmmlearn包时,我使用了anaconda show conda-forge/hmmlearn 得到它的下载途径,见下图 ![图片说明](https://img-ask.csdn.net/upload/201906/25/1561430116_882949.jpg) 下面的提示说,只要把run下面的语句: ``` conda install --channel https://conda.anaconda.org/conda-forge hmmlearn ```运行即可,但它安装完之后的hmmlearn版本是0.2.1的。我想安装0.2.0版本的,需要怎么改写这条语句呢?
Anaconda navigator打开的时候没有反应?更新的时候报错
刚刚安装了Anaconda,点Anaconda navigator没反应,用conda update anaconda-navigator 升级,又有下报错,该怎么办,总是在说qt什么错了,这个qt是什么意思? ![图片说明](https://img-ask.csdn.net/upload/201904/19/1555604081_157881.png) ERROR conda.core.link:_execute_actions(318): An error occurred while installing package 'https://mirrors.tuna.tsinghua.edu.cn/anaconda/pkgs/free::qt-5.6.2-vc9_6'. LinkError: Link error: Error: post-link failed for: https://mirrors.tuna.tsinghua.edu.cn/anaconda/pkgs/free::qt-5.6.2-vc9_6 Attempting to roll back. LinkError: Link error: Error: post-link failed for: https://mirrors.tuna.tsinghua.edu.cn/anaconda/pkgs/free::qt-5.6.2-vc9_6
利用conda install TensorFlow-gpu在win7上conda3.7版本上安装tensorflow后,测试时出现下面的问题
在测试import TensorFlow as tf print('hello'),出现下列问题,请问这是什么原因造成的,如何改? ``` Traceback (most recent call last): File "D:\ProgramData\Anaconda3\lib\site-packages\tensorflow\python\pywrap_tensorflow.py", line 58, in <module> from tensorflow.python.pywrap_tensorflow_internal import * File "D:\Program Files\JetBrains\PyCharm 2019.1.3\helpers\pydev\_pydev_bundle\pydev_import_hook.py", line 21, in do_import module = self._system_import(name, *args, **kwargs) File "D:\ProgramData\Anaconda3\lib\site-packages\tensorflow\python\pywrap_tensorflow_internal.py", line 28, in <module> _pywrap_tensorflow_internal = swig_import_helper() File "D:\ProgramData\Anaconda3\lib\site-packages\tensorflow\python\pywrap_tensorflow_internal.py", line 24, in swig_import_helper _mod = imp.load_module('_pywrap_tensorflow_internal', fp, pathname, description) File "D:\ProgramData\Anaconda3\lib\imp.py", line 242, in load_module return load_dynamic(name, filename, file) File "D:\ProgramData\Anaconda3\lib\imp.py", line 342, in load_dynamic return _load(spec) ImportError: DLL load failed: 找不到指定的程序。 During handling of the above exception, another exception occurred: Traceback (most recent call last): File "D:\ProgramData\Anaconda3\lib\site-packages\IPython\core\interactiveshell.py", line 3296, in run_code exec(code_obj, self.user_global_ns, self.user_ns) File "<ipython-input-2-d1ce02c95f3b>", line 1, in <module> runfile('C:/Users/jianjiu17/Desktop/deep-learning-from-scratch-master/uittle.py', wdir='C:/Users/jianjiu17/Desktop/deep-learning-from-scratch-master') File "D:\Program Files\JetBrains\PyCharm 2019.1.3\helpers\pydev\_pydev_bundle\pydev_umd.py", line 197, in runfile pydev_imports.execfile(filename, global_vars, local_vars) # execute the script File "D:\Program Files\JetBrains\PyCharm 2019.1.3\helpers\pydev\_pydev_imps\_pydev_execfile.py", line 18, in execfile exec(compile(contents+"\n", file, 'exec'), glob, loc) File "C:/Users/jianjiu17/Desktop/deep-learning-from-scratch-master/uittle.py", line 1, in <module> import tensorflow as tf File "D:\Program Files\JetBrains\PyCharm 2019.1.3\helpers\pydev\_pydev_bundle\pydev_import_hook.py", line 21, in do_import module = self._system_import(name, *args, **kwargs) File "D:\ProgramData\Anaconda3\lib\site-packages\tensorflow\__init__.py", line 24, in <module> from tensorflow.python import pywrap_tensorflow # pylint: disable=unused-import File "D:\Program Files\JetBrains\PyCharm 2019.1.3\helpers\pydev\_pydev_bundle\pydev_import_hook.py", line 21, in do_import module = self._system_import(name, *args, **kwargs) File "D:\ProgramData\Anaconda3\lib\site-packages\tensorflow\python\__init__.py", line 49, in <module> from tensorflow.python import pywrap_tensorflow File "D:\Program Files\JetBrains\PyCharm 2019.1.3\helpers\pydev\_pydev_bundle\pydev_import_hook.py", line 21, in do_import module = self._system_import(name, *args, **kwargs) File "D:\ProgramData\Anaconda3\lib\site-packages\tensorflow\python\pywrap_tensorflow.py", line 74, in <module> raise ImportError(msg) ImportError: Traceback (most recent call last): File "D:\ProgramData\Anaconda3\lib\site-packages\tensorflow\python\pywrap_tensorflow.py", line 58, in <module> from tensorflow.python.pywrap_tensorflow_internal import * File "D:\Program Files\JetBrains\PyCharm 2019.1.3\helpers\pydev\_pydev_bundle\pydev_import_hook.py", line 21, in do_import module = self._system_import(name, *args, **kwargs) File "D:\ProgramData\Anaconda3\lib\site-packages\tensorflow\python\pywrap_tensorflow_internal.py", line 28, in <module> _pywrap_tensorflow_internal = swig_import_helper() File "D:\ProgramData\Anaconda3\lib\site-packages\tensorflow\python\pywrap_tensorflow_internal.py", line 24, in swig_import_helper _mod = imp.load_module('_pywrap_tensorflow_internal', fp, pathname, description) File "D:\ProgramData\Anaconda3\lib\imp.py", line 242, in load_module return load_dynamic(name, filename, file) File "D:\ProgramData\Anaconda3\lib\imp.py", line 342, in load_dynamic return _load(spec) ImportError: DLL load failed: 找不到指定的程序。 Failed to load the native TensorFlow runtime. See https://www.tensorflow.org/install/errors for some common reasons and solutions. Include the entire stack trace above this error message when asking for help. ```
如图 运行conda create -n py27 python=2.7 报错 该如何解决呢
Traceback (most recent call last): File "E:\Anaconda3\lib\site-packages\conda\exceptions.py", line 1074, in __call__ return func(*args, **kwargs) File "E:\Anaconda3\lib\site-packages\conda\cli\main.py", line 84, in _main exit_code = do_call(args, p) File "E:\Anaconda3\lib\site-packages\conda\cli\conda_argparse.py", line 82, in do_call exit_code = getattr(module, func_name)(args, parser) File "E:\Anaconda3\lib\site-packages\conda\cli\main_create.py", line 37, in execute install(args, parser, 'create') File "E:\Anaconda3\lib\site-packages\conda\cli\install.py", line 116, in install if context.use_only_tar_bz2: File "E:\Anaconda3\lib\site-packages\conda\base\context.py", line 666, in use_only_tar_bz2 import conda_package_handling.api File "E:\Anaconda3\lib\site-packages\conda_package_handling\api.py", line 3, in <module> from libarchive.exception import ArchiveError as _LibarchiveArchiveError File "E:\Anaconda3\lib\site-packages\libarchive\__init__.py", line 1, in <module> from .entry import ArchiveEntry File "E:\Anaconda3\lib\site-packages\libarchive\entry.py", line 6, in <module> from . import ffi File "E:\Anaconda3\lib\site-packages\libarchive\ffi.py", line 48, in <module> libarchive = ctypes.cdll.LoadLibrary(libarchive_path) File "E:\Anaconda3\lib\ctypes\__init__.py", line 434, in LoadLibrary return self._dlltype(name) File "E:\Anaconda3\lib\ctypes\__init__.py", line 356, in __init__ self._handle = _dlopen(self._name, mode) OSError: [WinError 126] 找不到指定的模块。
安装pytorch后使用conda出现报错不知怎么解决
安装了pytorch在一个新建环境后conda不知怎么就崩了 ![图片说明](https://img-ask.csdn.net/upload/202001/18/1579314770_106086.png) 一直是这个样子输入conda命令就这样 打开anaconda prompt也报这个错
python conda install xxx 报错 找不到指定模块
(HelloWorld) C:\Users\justin>conda install cv2 # >>>>>>>>>>>>>>>>>>>>>> ERROR REPORT <<<<<<<<<<<<<<<<<<<<<< Traceback (most recent call last): File "F:\Miniconda3\envs\HelloWorld\lib\site-packages\conda\exceptions.py", line 1062, in __call__ return func(*args, **kwargs) File "F:\Miniconda3\envs\HelloWorld\lib\site-packages\conda\cli\main.py", line 84, in _main exit_code = do_call(args, p) File "F:\Miniconda3\envs\HelloWorld\lib\site-packages\conda\cli\conda_argparse.py", line 82, in do_call exit_code = getattr(module, func_name)(args, parser) File "F:\Miniconda3\envs\HelloWorld\lib\site-packages\conda\cli\main_install.py", line 20, in execute install(args, parser, 'install') File "F:\Miniconda3\envs\HelloWorld\lib\site-packages\conda\cli\install.py", line 116, in install if context.use_only_tar_bz2: File "F:\Miniconda3\envs\HelloWorld\lib\site-packages\conda\base\context.py", line 664, in use_only_tar_bz2 import conda_package_handling.api File "F:\Miniconda3\envs\HelloWorld\lib\site-packages\conda_package_handling\api.py", line 12, in <module> from .tarball import CondaTarBZ2 as _CondaTarBZ2, libarchive_enabled File "F:\Miniconda3\envs\HelloWorld\lib\site-packages\conda_package_handling\tarball.py", line 11, in <module> import libarchive File "F:\Miniconda3\envs\HelloWorld\lib\site-packages\libarchive\__init__.py", line 1, in <module> from .entry import ArchiveEntry File "F:\Miniconda3\envs\HelloWorld\lib\site-packages\libarchive\entry.py", line 6, in <module> from . import ffi File "F:\Miniconda3\envs\HelloWorld\lib\site-packages\libarchive\ffi.py", line 27, in <module> libarchive = ctypes.cdll.LoadLibrary(libarchive_path) File "F:\Miniconda3\envs\HelloWorld\lib\ctypes\__init__.py", line 442, in LoadLibrary return self._dlltype(name) File "F:\Miniconda3\envs\HelloWorld\lib\ctypes\__init__.py", line 364, in __init__ self._handle = _dlopen(self._name, mode) OSError: [WinError 126] 找不到指定的模块。 `$ F:\Miniconda3\envs\HelloWorld\Scripts\conda-script.py install cv2` ``` ```
如何创建一个带有指定版本Python和JupyterLab的环境?
&emsp;&emsp;请问要如何在Anaconda中创建一个同时拥有Python 3.7.4与JupyterLab 1.1.4的环境? &emsp;&emsp;我在cmd中通过以下命令创建了一个Python 3.7.4环境: ```batch D:\Anaconda3\envs>conda create -n dp python=3.7 WARNING: A directory already exists at the target location 'D:\Anaconda3\envs\dp' but it is not a conda environment. Continue creating environment (y/[n])? y Collecting package metadata (current_repodata.json): done Solving environment: done ## Package Plan ## environment location: D:\Anaconda3\envs\dp added / updated specs: - python=3.7 The following NEW packages will be INSTALLED: ca-certificates anaconda/pkgs/main/win-64::ca-certificates-2019.8.28-0 certifi anaconda/pkgs/main/win-64::certifi-2019.9.11-py37_0 openssl anaconda/pkgs/main/win-64::openssl-1.1.1d-he774522_2 pip anaconda/pkgs/main/win-64::pip-19.2.3-py37_0 python anaconda/pkgs/main/win-64::python-3.7.4-h5263a28_0 setuptools anaconda/pkgs/main/win-64::setuptools-41.4.0-py37_0 sqlite anaconda/pkgs/main/win-64::sqlite-3.30.0-he774522_0 vc anaconda/pkgs/main/win-64::vc-14.1-h0510ff6_4 vs2015_runtime anaconda/pkgs/main/win-64::vs2015_runtime-14.16.27012-hf0eaf9b_0 wheel anaconda/pkgs/main/win-64::wheel-0.33.6-py37_0 wincertstore anaconda/pkgs/main/win-64::wincertstore-0.2-py37_0 ``` &emsp;&emsp;Python 3.7.4被成功安装,但当继续安装JupyterLab时,会出现以下问题: ```batch D:\Anaconda3\envs>activate dp D:\Anaconda3\envs>conda.bat activate dp (dp) D:\Anaconda3\envs>conda install jupyterlab Collecting package metadata (current_repodata.json): done Solving environment: failed with initial frozen solve. Retrying with flexible solve. Solving environment: failed with repodata from current_repodata.json, will retry with next repodata source. Collecting package metadata (repodata.json): done Solving environment: failed with initial frozen solve. Retrying with flexible solve. Solving environment: | Found conflicts! Looking for incompatible packages. ... UnsatisfiableError: The following specifications were found to be incompatible with each other: Package tornado conflicts for: jupyterlab -> tornado[version='!=6.0.0,!=6.0.1,!=6.0.2'] Package jinja2 conflicts for: jupyterlab -> jinja2[version='>=2.10'] Package notebook conflicts for: jupyterlab -> notebook[version='>=4.3|>=4.3.1'] Package nodejs conflicts for: jupyterlab -> nodejs[version='<10'] Package sqlite conflicts for: python=3.7 -> sqlite[version='>=3.25.3,<4.0a0|>=3.26.0,<4.0a0|>=3.27.2,<4.0a0|>=3.28.0,<4.0a0|>=3.29.0,<4.0a0'] Package openssl conflicts for: python=3.7 -> openssl[version='>=1.1.1a,<1.1.2a|>=1.1.1b,<1.1.2a|>=1.1.1c,<1.1.2a'] Package pip conflicts for: python=3.7 -> pip Package jupyterlab_launcher conflicts for: jupyterlab -> jupyterlab_launcher[version='>=0.10.0,<0.11.0|>=0.11.0,<0.12.0|>=0.11.2,<0.12.0|>=0.13.1,<0.14.0|>=0.4.0|>=0.6.0,<0.7.0'] Package subprocess32 conflicts for: jupyterlab -> subprocess32 Package futures conflicts for: jupyterlab -> futures Package jupyterlab_server conflicts for: jupyterlab -> jupyterlab_server[version='>=0.2.0,<0.3.0|>=1.0.0,<2.0.0'] Package vc conflicts for: python=3.7 -> vc[version='14.*|>=14.1,<15.0a0'] ``` &emsp;&emsp;这个是什么问题?如何解决?感觉默认的base环境很庞大,很多东西用不到。但想要使用JupyterLab又不得不安装……
anaconda 安装已经下载好的包 如何安装
anaconda 安装已经下载好的包 如何安装? conda install --user-local jdk-7u79-linux-x64.tar.gz 提示找不到包
Python全局环境下sklearn包中缺失Imputer函数
系统win10 64位,python版本3.7.4。 全局环境下,在我输入下载sklearn包的代码后,显示结果如下,包已经安装: ``` pip install sklearn Requirement already satisfied: sklearn in e:\python\lib\site-packages (0.0) Requirement already satisfied: scikit-learn in e:\python\lib\site-packages (from sklearn) (0.22) Requirement already satisfied: numpy>=1.11.0 in e:\python\lib\site-packages (from scikit-learn->sklearn) (1.17.4) Requirement already satisfied: scipy>=0.17.0 in e:\python\lib\site-packages (from scikit-learn->sklearn) (1.3.3) Requirement already satisfied: joblib>=0.11 in e:\python\lib\site-packages (from scikit-learn->sklearn) (0.14.1) ``` 然而在使用sklearn中的Imputer函数时,会出现报错: ``` >>> import numpy as np >>> import sklearn >>> from sklearn import preprocessing >>> from sklearn.preprocessing import Imputer Traceback (most recent call last): File "<stdin>", line 1, in <module> ImportError: cannot import name 'Imputer' from 'sklearn.preprocessing' (E:\python\lib\site-packages\sklearn\preprocessing\__init__.py) ``` 利用dir()查看包内的函数,发现没有Imputer: ``` >>> dir(sklearn.preprocessing) ['Binarizer', 'FunctionTransformer', 'KBinsDiscretizer', 'KernelCenterer', 'LabelBinarizer', 'LabelEncoder', 'MaxAbsScaler', 'MinMaxScaler', 'MultiLabelBinarizer', 'Normalizer', 'OneHotEncoder', 'OrdinalEncoder', 'PolynomialFeatures', 'PowerTransformer', 'QuantileTransformer', 'RobustScaler', 'StandardScaler', '__all__', '__builtins__', '__cached__', '__doc__', '__file__', '__loader__', '__name__', '__package__', '__path__', '__spec__', '_csr_polynomial_expansion', '_data', '_discretization', '_encoders', '_function_transformer', '_label', 'add_dummy_feature', 'binarize', 'label_binarize', 'maxabs_scale', 'minmax_scale', 'normalize', 'power_transform', 'quantile_transform', 'robust_scale', 'scale'] ``` 但是在conda的base环境下,陆续安装numpy、scipy、matplotlib后,安装 scikit-learn包,就可以使用这个函数了。 我寻找了很久的解决方案,网上说的路径和Imputer相同的情况没有发生,请问大佬们这究竟是怎么回事儿啊
pip / conda install 报 SSLError
# 我想安装 pycurl 库一直报ssl的错 **安装其他库也报这个错 我python 和 anacoda 卸载重装还是这样** ![图片说明](https://img-ask.csdn.net/upload/201912/29/1577603682_113807.png) ![图片说明](https://img-ask.csdn.net/upload/201912/29/1577603787_388466.png) **网上查到说添加环境变量 添加了但还是不行** anacoda 安装文件夹是anacode (新建文件夹的时候打错了) Python 3.7.6 windows 10 系统 大佬们知道什么原因吗? ``` 错误文本: pip install pycurl WARNING: pip is configured with locations that require TLS/SSL, however the ssl module in Python is not available. Requirement already satisfied: pycurl in d:\anacode\lib\site-packages (7.43.0.3) WARNING: pip is configured with locations that require TLS/SSL, however the ssl module in Python is not available. Could not fetch URL https://pypi.org/simple/pip/: There was a problem confirming the ssl certificate: HTTPSConnectionPool(host='pypi.org', port=443): Max retries exceeded with url: /simple/pip/ (Caused by SSLError("Can't connect to HTTPS URL because the SSL module is not available.")) - skipping C:\Users\Enz>conda install scrapy Collecting package metadata (current_repodata.json): failed CondaHTTPError: HTTP 000 CONNECTION FAILED for url <https://repo.anaconda.com/pkgs/main/win-64/current_repodata.json> Elapsed: - An HTTP error occurred when trying to retrieve this URL. HTTP errors are often intermittent, and a simple retry will get you on your way. If your current network has https://www.anaconda.com blocked, please file a support request with your network engineering team. SSLError(MaxRetryError('HTTPSConnectionPool(host=\'repo.anaconda.com\', port=443): Max retries exceeded with url: /pkgs/main/win-64/current_repodata.json (Caused by SSLError("Can\'t connect to HTTPS URL because the SSL module is not available."))')) ```
终于明白阿里百度这样的大公司,为什么面试经常拿ThreadLocal考验求职者了
点击上面↑「爱开发」关注我们每晚10点,捕获技术思考和创业资源洞察什么是ThreadLocalThreadLocal是一个本地线程副本变量工具类,各个线程都拥有一份线程私...
程序员必须掌握的核心算法有哪些?
由于我之前一直强调数据结构以及算法学习的重要性,所以就有一些读者经常问我,数据结构与算法应该要学习到哪个程度呢?,说实话,这个问题我不知道要怎么回答你,主要取决于你想学习到哪些程度,不过针对这个问题,我稍微总结一下我学过的算法知识点,以及我觉得值得学习的算法。这些算法与数据结构的学习大多数是零散的,并没有一本把他们全部覆盖的书籍。下面是我觉得值得学习的一些算法以及数据结构,当然,我也会整理一些看过...
Linux(服务器编程):15---两种高效的事件处理模式(reactor模式、proactor模式)
前言 同步I/O模型通常用于实现Reactor模式 异步I/O模型则用于实现Proactor模式 最后我们会使用同步I/O方式模拟出Proactor模式 一、Reactor模式 Reactor模式特点 它要求主线程(I/O处理单元)只负责监听文件描述符上是否有事件发生,有的话就立即将时间通知工作线程(逻辑单元)。除此之外,主线程不做任何其他实质性的工作 读写数据,接受新的连接,以及处...
阿里面试官问我:如何设计秒杀系统?我的回答让他比起大拇指
你知道的越多,你不知道的越多 点赞再看,养成习惯 GitHub上已经开源 https://github.com/JavaFamily 有一线大厂面试点脑图和个人联系方式,欢迎Star和指教 前言 Redis在互联网技术存储方面使用如此广泛,几乎所有的后端技术面试官都要在Redis的使用和原理方面对小伙伴们进行360°的刁难。 作为一个在互联网公司面一次拿一次Offer的面霸,打败了...
五年程序员记流水账式的自白。
不知觉已中码龄已突破五年,一路走来从起初铁憨憨到现在的十九线程序员,一路成长,虽然不能成为高工,但是也能挡下一面,从15年很火的android开始入坑,走过java、.Net、QT,目前仍处于android和.net交替开发中。 毕业到现在一共就职过两家公司,目前是第二家,公司算是半个创业公司,所以基本上都会身兼多职。比如不光要写代码,还要写软著、软著评测、线上线下客户对接需求收集...
C语言魔塔游戏
很早就很想写这个,今天终于写完了。 游戏截图: 编译环境: VS2017 游戏需要一些图片,如果有想要的或者对游戏有什么看法的可以加我的QQ 2985486630 讨论,如果暂时没有回应,可以在博客下方留言,到时候我会看到。 下面我来介绍一下游戏的主要功能和实现方式 首先是玩家的定义,使用结构体,这个名字是可以自己改变的 struct gamerole { char n...
一文详尽系列之模型评估指标
点击上方“Datawhale”,选择“星标”公众号第一时间获取价值内容在机器学习领域通常会根据实际的业务场景拟定相应的不同的业务指标,针对不同机器学习问题如回归、分类、排...
究竟你适不适合买Mac?
我清晰的记得,刚买的macbook pro回到家,开机后第一件事情,就是上了淘宝网,花了500元钱,找了一个上门维修电脑的师傅,上门给我装了一个windows系统。。。。。。 表砍我。。。 当时买mac的初衷,只是想要个固态硬盘的笔记本,用来运行一些复杂的扑克软件。而看了当时所有的SSD笔记本后,最终决定,还是买个好(xiong)看(da)的。 已经有好几个朋友问我mba怎么样了,所以今天尽量客观...
程序员一般通过什么途径接私活?
二哥,你好,我想知道一般程序猿都如何接私活,我也想接,能告诉我一些方法吗? 上面是一个读者“烦不烦”问我的一个问题。其实不止是“烦不烦”,还有很多读者问过我类似这样的问题。 我接的私活不算多,挣到的钱也没有多少,加起来不到 20W。说实话,这个数目说出来我是有点心虚的,毕竟太少了,大家轻喷。但我想,恰好配得上“一般程序员”这个称号啊。毕竟苍蝇再小也是肉,我也算是有经验的人了。 唾弃接私活、做外...
压测学习总结(1)——高并发性能指标:QPS、TPS、RT、吞吐量详解
一、QPS,每秒查询 QPS:Queries Per Second意思是“每秒查询率”,是一台服务器每秒能够相应的查询次数,是对一个特定的查询服务器在规定时间内所处理流量多少的衡量标准。互联网中,作为域名系统服务器的机器的性能经常用每秒查询率来衡量。 二、TPS,每秒事务 TPS:是TransactionsPerSecond的缩写,也就是事务数/秒。它是软件测试结果的测量单位。一个事务是指一...
Python爬虫爬取淘宝,京东商品信息
小编是一个理科生,不善长说一些废话。简单介绍下原理然后直接上代码。 使用的工具(Python+pycharm2019.3+selenium+xpath+chromedriver)其中要使用pycharm也可以私聊我selenium是一个框架可以通过pip下载 pip installselenium -ihttps://pypi.tuna.tsinghua.edu.cn/simple/ ...
阿里程序员写了一个新手都写不出的低级bug,被骂惨了。
这种新手都不会范的错,居然被一个工作好几年的小伙子写出来,差点被当场开除了。
Java工作4年来应聘要16K最后没要,细节如下。。。
前奏: 今天2B哥和大家分享一位前几天面试的一位应聘者,工作4年26岁,统招本科。 以下就是他的简历和面试情况。 基本情况: 专业技能: 1、&nbsp;熟悉Sping了解SpringMVC、SpringBoot、Mybatis等框架、了解SpringCloud微服务 2、&nbsp;熟悉常用项目管理工具:SVN、GIT、MAVEN、Jenkins 3、&nbsp;熟悉Nginx、tomca...
2020年,冯唐49岁:我给20、30岁IT职场年轻人的建议
点击“技术领导力”关注∆每天早上8:30推送 作者|Mr.K 编辑| Emma 来源|技术领导力(ID:jishulingdaoli) 前天的推文《冯唐:职场人35岁以后,方法论比经验重要》,收到了不少读者的反馈,觉得挺受启发。其实,冯唐写了不少关于职场方面的文章,都挺不错的。可惜大家只记住了“春风十里不如你”、“如何避免成为油腻腻的中年人”等不那么正经的文章。 本文整理了冯...
程序员该看的几部电影
1、骇客帝国(1999) 概念:在线/离线,递归,循环,矩阵等 剧情简介: 不久的将来,网络黑客尼奥对这个看似正常的现实世界产生了怀疑。 他结识了黑客崔妮蒂,并见到了黑客组织的首领墨菲斯。 墨菲斯告诉他,现实世界其实是由一个名叫“母体”的计算机人工智能系统控制,人们就像他们饲养的动物,没有自由和思想,而尼奥就是能够拯救人类的救世主。 可是,救赎之路从来都不会一帆风顺,到底哪里才是真实的世界?如何...
Python绘图,圣诞树,花,爱心 | Turtle篇
每周每日,分享Python实战代码,入门资料,进阶资料,基础语法,爬虫,数据分析,web网站,机器学习,深度学习等等。 公众号回复【进群】沟通交流吧,QQ扫码进群学习吧 微信群 QQ群 1.画圣诞树 import turtle screen = turtle.Screen() screen.setup(800,600) circle = turtle.Turtle()...
作为一个程序员,CPU的这些硬核知识你必须会!
CPU对每个程序员来说,是个既熟悉又陌生的东西? 如果你只知道CPU是中央处理器的话,那可能对你并没有什么用,那么作为程序员的我们,必须要搞懂的就是CPU这家伙是如何运行的,尤其要搞懂它里面的寄存器是怎么一回事,因为这将让你从底层明白程序的运行机制。 随我一起,来好好认识下CPU这货吧 把CPU掰开来看 对于CPU来说,我们首先就要搞明白它是怎么回事,也就是它的内部构造,当然,CPU那么牛的一个东...
还记得那个提速8倍的IDEA插件吗?VS Code版本也发布啦!!
去年,阿里云发布了本地 IDE 插件 Cloud Toolkit,仅 IntelliJ IDEA 一个平台,就有 15 万以上的开发者进行了下载,体验了一键部署带来的开发便利。时隔一年的今天,阿里云正式发布了 Visual Studio Code 版本,全面覆盖前端开发者,帮助前端实现一键打包部署,让开发提速 8 倍。 VSCode 版本的插件,目前能做到什么? 安装插件之后,开发者可以立即体验...
破14亿,Python分析我国存在哪些人口危机!
一、背景 二、爬取数据 三、数据分析 1、总人口 2、男女人口比例 3、人口城镇化 4、人口增长率 5、人口老化(抚养比) 6、各省人口 7、世界人口 四、遇到的问题 遇到的问题 1、数据分页,需要获取从1949-2018年数据,观察到有近20年参数:LAST20,由此推测获取近70年的参数可设置为:LAST70 2、2019年数据没有放上去,可以手动添加上去 3、将数据进行 行列转换 4、列名...
2019年除夕夜的有感而发
天气:小雨(加小雪) 温度:3摄氏度 空气:严重污染(399) 风向:北风 风力:微风 现在是除夕夜晚上十点钟,再有两个小时就要新的一年了; 首先要说的是我没患病,至少现在是没有患病;但是心情确像患了病一样沉重; 现在这个时刻应该大部分家庭都在看春晚吧,或许一家人团团圆圆的坐在一起,或许因为某些特殊原因而不能团圆;但不管是身在何处,身处什么境地,我都想对每一个人说一句:新年快乐! 不知道csdn这...
听说想当黑客的都玩过这个Monyer游戏(1~14攻略)
第零关 进入传送门开始第0关(游戏链接) 请点击链接进入第1关: 连接在左边→ ←连接在右边 看不到啊。。。。(只能看到一堆大佬做完的留名,也能看到菜鸡的我,在后面~~) 直接fn+f12吧 &lt;span&gt;连接在左边→&lt;/span&gt; &lt;a href="first.php"&gt;&lt;/a&gt; &lt;span&gt;←连接在右边&lt;/span&gt; o...
在家远程办公效率低?那你一定要收好这个「在家办公」神器!
相信大家都已经收到国务院延长春节假期的消息,接下来,在家远程办公可能将会持续一段时间。 但是问题来了。远程办公不是人在电脑前就当坐班了,相反,对于沟通效率,文件协作,以及信息安全都有着极高的要求。有着非常多的挑战,比如: 1在异地互相不见面的会议上,如何提高沟通效率? 2文件之间的来往反馈如何做到及时性?如何保证信息安全? 3如何规划安排每天工作,以及如何进行成果验收? ...... ...
作为一个程序员,内存和磁盘的这些事情,你不得不知道啊!!!
截止目前,我已经分享了如下几篇文章: 一个程序在计算机中是如何运行的?超级干货!!! 作为一个程序员,CPU的这些硬核知识你必须会! 作为一个程序员,内存的这些硬核知识你必须懂! 这些知识可以说是我们之前都不太重视的基础知识,可能大家在上大学的时候都学习过了,但是嘞,当时由于老师讲解的没那么有趣,又加上这些知识本身就比较枯燥,所以嘞,大家当初几乎等于没学。 再说啦,学习这些,也看不出来有什么用啊!...
2020年的1月,我辞掉了我的第一份工作
其实,这篇文章,我应该早点写的,毕竟现在已经2月份了。不过一些其它原因,或者是我的惰性、还有一些迷茫的念头,让自己迟迟没有试着写一点东西,记录下,或者说是总结下自己前3年的工作上的经历、学习的过程。 我自己知道的,在写自己的博客方面,我的文笔很一般,非技术类的文章不想去写;另外我又是一个还比较热衷于技术的人,而平常复杂一点的东西,如果想写文章写的清楚点,是需要足够...
别低估自己的直觉,也别高估自己的智商
所有群全部吵翻天,朋友圈全部沦陷,公众号疯狂转发。这两周没怎么发原创,只发新闻,可能有人注意到了。我不是懒,是文章写了却没发,因为大家的关注力始终在这次的疫情上面,发了也没人看。当然,我...
这个世界上人真的分三六九等,你信吗?
偶然间,在知乎上看到一个问题 一时间,勾起了我深深的回忆。 以前在厂里打过两次工,做过家教,干过辅导班,做过中介。零下几度的晚上,贴过广告,满脸、满手地长冻疮。 再回首那段岁月,虽然苦,但让我学会了坚持和忍耐。让我明白了,在这个世界上,无论环境多么的恶劣,只要心存希望,星星之火,亦可燎原。 下文是原回答,希望能对你能有所启发。 如果我说,这个世界上人真的分三六九等,...
节后首个工作日,企业们集体开晨会让钉钉挂了
By 超神经场景描述:昨天 2 月 3 日,是大部分城市号召远程工作的第一天,全国有接近 2 亿人在家开始远程办公,钉钉上也有超过 1000 万家企业活跃起来。关键词:十一出行 人脸...
Java基础知识点梳理
虽然已经在实际工作中经常与java打交道,但是一直没系统地对java这门语言进行梳理和总结,掌握的知识也比较零散。恰好利用这段时间重新认识下java,并对一些常见的语法和知识点做个总结与回顾,一方面为了加深印象,方便后面查阅,一方面为了掌握好Android打下基础。
2020年全新Java学习路线图,含配套视频,学完即为中级Java程序员!!
新的一年来临,突如其来的疫情打破了平静的生活! 在家的你是否很无聊,如果无聊就来学习吧! 世上只有一种投资只赚不赔,那就是学习!!! 传智播客于2020年升级了Java学习线路图,硬核升级,免费放送! 学完你就是中级程序员,能更快一步找到工作! 一、Java基础 JavaSE基础是Java中级程序员的起点,是帮助你从小白到懂得编程的必经之路。 在Java基础板块中有6个子模块的学...
B 站上有哪些很好的学习资源?
哇说起B站,在小九眼里就是宝藏般的存在,放年假宅在家时一天刷6、7个小时不在话下,更别提今年的跨年晚会,我简直是跪着看完的!! 最早大家聚在在B站是为了追番,再后来我在上面刷欧美新歌和漂亮小姐姐的舞蹈视频,最近两年我和周围的朋友们已经把B站当作学习教室了,而且学习成本还免费,真是个励志的好平台ヽ(.◕ฺˇд ˇ◕ฺ;)ノ 下面我们就来盘点一下B站上优质的学习资源: 综合类 Oeasy: 综合...
相关热词 c#如何定义数组列表 c#倒序读取txt文件 java代码生成c# c# tcp发送数据 c#解决时间格式带星期 c#类似hashmap c#设置istbox的值 c#获取多线程返回值 c# 包含数字 枚举 c# timespan
立即提问