CentOS编译LLVM遇到的HOST GCC版本问题

操作系统原来自带的gcc版本是4.8.5,因为安装llvm要求是5.1以上版
本,所以后来正常安装了GCC8.3.0,CMAKE 3.12.1,然后下载llvm-project,按照如下链接指示安装:
http://llvm.org/docs/CMake.html
发现执行到"cmake path/to/llvm/source/root"时报错。错误信息如下:
[root@jzl-cloud-01 llvm]# cmake -DCMAKE_BUILD_TYPE=Release -DLLVM_TARGETS_TO_BUILD=X86 /home/falcon/h265/llvm-project/llvm
-- Could NOT find Z3: Found unsuitable version "0.0.0", but required is at least "4.7.1" (found Z3_LIBRARIES-NOTFOUND)
CMake Error at cmake/modules/CheckCompilerVersion.cmake:38 (message):
Host GCC version must be at least 5.1, your version is 4.8.5.
Call Stack (most recent call first):
cmake/modules/CheckCompilerVersion.cmake:48 (check_compiler_version)
cmake/config-ix.cmake:13 (include)
CMakeLists.txt:624 (include)

-- Configuring incomplete, errors occurred!
See also "/home/falcon/h265/llvm/CMakeFiles/CMakeOutput.log".
[root@jzl-cloud-01 llvm]# cmake /home/falcon/h265/llvm-project/llvm
-- Could NOT find Z3: Found unsuitable version "0.0.0", but required is at least "4.7.1" (found Z3_LIBRARIES-NOTFOUND)
CMake Error at cmake/modules/CheckCompilerVersion.cmake:38 (message):
Host GCC version must be at least 5.1, your version is 4.8.5.
Call Stack (most recent call first):
cmake/modules/CheckCompilerVersion.cmake:48 (check_compiler_version)
cmake/config-ix.cmake:13 (include)
CMakeLists.txt:624 (include)

-- Configuring incomplete, errors occurred!
See also "/home/falcon/h265/llvm/CMakeFiles/CMakeOutput.log".

请问上面提到的HOST GCC版本过低的问题该如何解决?

1个回答

Csdn user default icon
上传中...
上传图片
插入图片
抄袭、复制答案,以达到刷声望分或其他目的的行为,在CSDN问答是严格禁止的,一经发现立刻封号。是时候展现真正的技术了!
其他相关推荐
安装LLVM过程中提示gcc版本低,但是系统中默认的gcc版本就是7.3.0,如何解决?谢谢!!!

![图片说明](https://img-ask.csdn.net/upload/201912/06/1575600474_141765.png)

关于centos卸载gcc的问题?

linux 3.10 centos 7系统,默认安装的gcc版本为4.8.5。因为跑程序要用到4.9以上的gcc版本,所以安装了gcc-8.3.0。 安装完成后,使用cat /proc/version命令只能看到gcc4.8.5,使用gcc -v命令只能看到gcc8.3.0。 运行程序时,又提示gcc版本不能高于gcc7.0,所以想卸载gcc8.3.0。但是利用rpm -q gcc 只能找到gcc-4.8.5,求问该怎么办?

交叉编译如何判断host和tatget

我在交叉编译,用交叉编译链mips-linux-gcc 主机是centos,编译的程序是openresty,进行./congfigure 时怎写host和target,求解决

用gcc编译之后scanf和printf问题

我先写了一个printf(“XXXXX”);在写了一个scanf(“%d”,&a),运行之后不会打印出printf的内容,只有当我输入一个值之后才打印出printf的内容,请问这是怎么回事?但在vs2015和linux系统下显示就正确,gcc版本为5.3.0。

6.8版本CentOS 下编译java程序出3个错误

![图片说明](https://img-ask.csdn.net/upload/201703/21/1490055346_34788.png) ![图片说明](https://img-ask.csdn.net/upload/201703/21/1490055366_574467.png) ![图片说明](https://img-ask.csdn.net/upload/201703/21/1490055390_87270.png) 我 是6.8版本 的centos 运行在虚拟机上

CentOS安装gcc-c++出现错误

在Centos中安装gcc gcc-c++总是出现Connot find a valid baseurl for repo : base的错误,怎样解决?

centos7 SMBus Host Controller not enabled

各位大神,我给虚拟机添加了1g内存,然后再启动就出现assuming drive cache write through 和SMBus Host Controller not enabled,然后一直卡在那里,修改了blacklist.conf后,还是不起作用,该怎么办?

编译llvm出现链接错误怎么办?

1,编译llvm,在编译进度100%时出现链接错误。 2,错误提示: ``` [100%] Building CXX object tools/clang/tools/libclang/CMakeFiles/libclang.dir/Indexing.cpp.o [100%] Linking CXX executable ../../../../bin/lldb-vscode [100%] Built target lldb-vscode [100%] Building CXX object tools/lldb/tools/driver/CMakeFiles/lldb.dir/Driver.cpp.o [100%] Linking CXX executable ../../../../bin/lldb [100%] Built target lldb [100%] Linking CXX shared library ../../../../lib/libclang.so ../../../../lib/libclangTidyAbseilModule.a(DurationAdditionCheck.cpp.o):在函数‘clang::tidy::abseil::DurationAdditionCheck::check(clang::ast_matchers::MatchFinder::MatchResult const&)’中: DurationAdditionCheck.cpp:(.text._ZN5clang4tidy6abseil21DurationAdditionCheck5checkERKNS_12ast_matchers11MatchFinder11MatchResultE+0x362):对‘clang::tidy::abseil::getScaleForTimeInverse(llvm::StringRef)’未定义的引用 DurationAdditionCheck.cpp:(.text._ZN5clang4tidy6abseil21DurationAdditionCheck5checkERKNS_12ast_matchers11MatchFinder11MatchResultE+0x37f):对‘clang::tidy::abseil::getTimeInverseForScale(clang::tidy::abseil::DurationScale)’未定义的引用 DurationAdditionCheck.cpp:(.text._ZN5clang4tidy6abseil21DurationAdditionCheck5checkERKNS_12ast_matchers11MatchFinder11MatchResultE+0x485):对‘clang::tidy::abseil::rewriteExprFromNumberToDuration[abi:cxx11](clang::ast_matchers::MatchFinder::MatchResult const&, clang::tidy::abseil::DurationScale, clang::Expr const*)’未定义的引用 DurationAdditionCheck.cpp:(.text._ZN5clang4tidy6abseil21DurationAdditionCheck5checkERKNS_12ast_matchers11MatchFinder11MatchResultE+0xa91):对‘clang::tidy::abseil::rewriteExprFromNumberToDuration[abi:cxx11](clang::ast_matchers::MatchFinder::MatchResult const&, clang::tidy::abseil::DurationScale, clang::Expr const*)’未定义的引用 ../../../../lib/libclangTidyAbseilModule.a(DurationComparisonCheck.cpp.o):在函数‘clang::tidy::abseil::DurationComparisonCheck::check(clang::ast_matchers::MatchFinder::MatchResult const&)’中: DurationComparisonCheck.cpp:(.text._ZN5clang4tidy6abseil23DurationComparisonCheck5checkERKNS_12ast_matchers11MatchFinder11MatchResultE+0x1ab):对‘clang::tidy::abseil::getScaleForDurationInverse(llvm::StringRef)’未定义的引用 DurationComparisonCheck.cpp:(.text._ZN5clang4tidy6abseil23DurationComparisonCheck5checkERKNS_12ast_matchers11MatchFinder11MatchResultE+0x1bf):对‘clang::tidy::abseil::isInMacro(clang::ast_matchers::MatchFinder::MatchResult const&, clang::Expr const*)’未定义的引用 DurationComparisonCheck.cpp:(.text._ZN5clang4tidy6abseil23DurationComparisonCheck5checkERKNS_12ast_matchers11MatchFinder11MatchResultE+0x1cf):对‘clang::tidy::abseil::isInMacro(clang::ast_matchers::MatchFinder::MatchResult const&, clang::Expr const*)’未定义的引用 DurationComparisonCheck.cpp:(.text._ZN5clang4tidy6abseil23DurationComparisonCheck5checkERKNS_12ast_matchers11MatchFinder11MatchResultE+0x2fd):对‘clang::tidy::abseil::rewriteExprFromNumberToDuration[abi:cxx11](clang::ast_matchers::MatchFinder::MatchResult const&, clang::tidy::abseil::DurationScale, clang::Expr const*)’未定义的引用 DurationComparisonCheck.cpp:(.text._ZN5clang4tidy6abseil23DurationComparisonCheck5checkERKNS_12ast_matchers11MatchFinder11MatchResultE+0x315):对‘clang::tidy::abseil::rewriteExprFromNumberToDuration[abi:cxx11](clang::ast_matchers::MatchFinder::MatchResult const&, clang::tidy::abseil::DurationScale, clang::Expr const*)’未定义的引用 ../../../../lib/libclangTidyAbseilModule.a(DurationFactoryFloatCheck.cpp.o):在函数‘clang::tidy::abseil::DurationFactoryFloatCheck::check(clang::ast_matchers::MatchFinder::MatchResult const&)’中: DurationFactoryFloatCheck.cpp:(.text._ZN5clang4tidy6abseil25DurationFactoryFloatCheck5checkERKNS_12ast_matchers11MatchFinder11MatchResultE+0x157):对‘clang::tidy::abseil::stripFloatCast[abi:cxx11](clang::ast_matchers::MatchFinder::MatchResult const&, clang::Expr const&)’未定义的引用 DurationFactoryFloatCheck.cpp:(.text._ZN5clang4tidy6abseil25DurationFactoryFloatCheck5checkERKNS_12ast_matchers11MatchFinder11MatchResultE+0x4a7):对‘clang::tidy::abseil::stripFloatLiteralFraction[abi:cxx11](clang::ast_matchers::MatchFinder::MatchResult const&, clang::Expr const&)’未定义的引用 ../../../../lib/libclangTidyAbseilModule.a(DurationFactoryScaleCheck.cpp.o):在函数‘clang::tidy::abseil::DurationFactoryScaleCheck::check(clang::ast_matchers::MatchFinder::MatchResult const&)’中: DurationFactoryScaleCheck.cpp:(.text._ZN5clang4tidy6abseil25DurationFactoryScaleCheck5checkERKNS_12ast_matchers11MatchFinder11MatchResultE+0x10a):对‘clang::tidy::abseil::IsLiteralZero(clang::ast_matchers::MatchFinder::MatchResult const&, clang::Expr const&)’未定义的引用 DurationFactoryScaleCheck.cpp:(.text._ZN5clang4tidy6abseil25DurationFactoryScaleCheck5checkERKNS_12ast_matchers11MatchFinder11MatchResultE+0x497):对‘clang::tidy::abseil::getDurationFactoryForScale(clang::tidy::abseil::DurationScale)’未定义的引用 DurationFactoryScaleCheck.cpp:(.text._ZN5clang4tidy6abseil25DurationFactoryScaleCheck5checkERKNS_12ast_matchers11MatchFinder11MatchResultE+0xde5):对‘clang::tidy::abseil::getDurationFactoryForScale(clang::tidy::abseil::DurationScale)’未定义的引用 ../../../../lib/libclangTidyAbseilModule.a(TimeComparisonCheck.cpp.o):在函数‘clang::tidy::abseil::TimeComparisonCheck::check(clang::ast_matchers::MatchFinder::MatchResult const&)’中: TimeComparisonCheck.cpp:(.text._ZN5clang4tidy6abseil19TimeComparisonCheck5checkERKNS_12ast_matchers11MatchFinder11MatchResultE+0x1ab):对‘clang::tidy::abseil::getScaleForTimeInverse(llvm::StringRef)’未定义的引用 TimeComparisonCheck.cpp:(.text._ZN5clang4tidy6abseil19TimeComparisonCheck5checkERKNS_12ast_matchers11MatchFinder11MatchResultE+0x1bf):对‘clang::tidy::abseil::isInMacro(clang::ast_matchers::MatchFinder::MatchResult const&, clang::Expr const*)’未定义的引用 TimeComparisonCheck.cpp:(.text._ZN5clang4tidy6abseil19TimeComparisonCheck5checkERKNS_12ast_matchers11MatchFinder11MatchResultE+0x1cf):对‘clang::tidy::abseil::isInMacro(clang::ast_matchers::MatchFinder::MatchResult const&, clang::Expr const*)’未定义的引用 TimeComparisonCheck.cpp:(.text._ZN5clang4tidy6abseil19TimeComparisonCheck5checkERKNS_12ast_matchers11MatchFinder11MatchResultE+0x2fd):对‘clang::tidy::abseil::rewriteExprFromNumberToTime[abi:cxx11](clang::ast_matchers::MatchFinder::MatchResult const&, clang::tidy::abseil::DurationScale, clang::Expr const*)’未定义的引用 TimeComparisonCheck.cpp:(.text._ZN5clang4tidy6abseil19TimeComparisonCheck5checkERKNS_12ast_matchers11MatchFinder11MatchResultE+0x315):对‘clang::tidy::abseil::rewriteExprFromNumberToTime[abi:cxx11](clang::ast_matchers::MatchFinder::MatchResult const&, clang::tidy::abseil::DurationScale, clang::Expr const*)’未定义的引用 ../../../../lib/libclangTidyAndroidModule.a(AndroidTidyModule.cpp.o):在函数‘std::_Function_handler<clang::tidy::ClangTidyCheck* (llvm::StringRef, clang::tidy::ClangTidyContext*), void clang::tidy::ClangTidyCheckFactories::registerCheck<clang::tidy::android::CloexecOpenCheck>(llvm::StringRef)::{lambda(llvm::StringRef, clang::tidy::ClangTidyContext*)#1}>::_M_invoke(std::_Any_data const&, llvm::StringRef&&, clang::tidy::ClangTidyContext*&&)’中: AndroidTidyModule.cpp:(.text._ZNSt17_Function_handlerIFPN5clang4tidy14ClangTidyCheckEN4llvm9StringRefEPNS1_16ClangTidyContextEEZNS1_23ClangTidyCheckFactories13registerCheckINS1_7android16CloexecOpenCheckEEEvS5_EUlS5_S7_E_E9_M_invokeERKSt9_Any_dataOS5_OS7_[_ZNSt17_Function_handlerIFPN5clang4tidy14ClangTidyCheckEN4llvm9StringRefEPNS1_16ClangTidyContextEEZNS1_23ClangTidyCheckFactories13registerCheckINS1_7android16CloexecOpenCheckEEEvS5_EUlS5_S7_E_E9_M_invokeERKSt9_Any_dataOS5_OS7_]+0x36):对‘vtable for clang::tidy::android::CloexecOpenCheck’未定义的引用 ../../../../lib/libclangTidyBugproneModule.a(BugproneTidyModule.cpp.o):在函数‘std::_Function_handler<clang::tidy::ClangTidyCheck* (llvm::StringRef, clang::tidy::ClangTidyContext*), void clang::tidy::ClangTidyCheckFactories::registerCheck<clang::tidy::bugprone::BoolPointerImplicitConversionCheck>(llvm::StringRef)::{lambda(llvm::StringRef, clang::tidy::ClangTidyContext*)#1}>::_M_invoke(std::_Any_data const&, llvm::StringRef&&, clang::tidy::ClangTidyContext*&&)’中: BugproneTidyModule.cpp:(.text._ZNSt17_Function_handlerIFPN5clang4tidy14ClangTidyCheckEN4llvm9StringRefEPNS1_16ClangTidyContextEEZNS1_23ClangTidyCheckFactories13registerCheckINS1_8bugprone34BoolPointerImplicitConversionCheckEEEvS5_EUlS5_S7_E_E9_M_invokeERKSt9_Any_dataOS5_OS7_[_ZNSt17_Function_handlerIFPN5clang4tidy14ClangTidyCheckEN4llvm9StringRefEPNS1_16ClangTidyContextEEZNS1_23ClangTidyCheckFactories13registerCheckINS1_8bugprone34BoolPointerImplicitConversionCheckEEEvS5_EUlS5_S7_E_E9_M_invokeERKSt9_Any_dataOS5_OS7_]+0x36):对‘vtable for clang::tidy::bugprone::BoolPointerImplicitConversionCheck’未定义的引用 ../../../../lib/libclangTidyAbseilModule.a(DurationConversionCastCheck.cpp.o):在函数‘clang::tidy::abseil::DurationConversionCastCheck::check(clang::ast_matchers::MatchFinder::MatchResult const&)’中: DurationConversionCastCheck.cpp:(.text._ZN5clang4tidy6abseil27DurationConversionCastCheck5checkERKNS_12ast_matchers11MatchFinder11MatchResultE+0xcf):对‘clang::tidy::abseil::isInMacro(clang::ast_matchers::MatchFinder::MatchResult const&, clang::Expr const*)’未定义的引用 DurationConversionCastCheck.cpp:(.text._ZN5clang4tidy6abseil27DurationConversionCastCheck5checkERKNS_12ast_matchers11MatchFinder11MatchResultE+0x279):对‘clang::tidy::abseil::getScaleForDurationInverse(llvm::StringRef)’未定义的引用 DurationConversionCastCheck.cpp:(.text._ZN5clang4tidy6abseil27DurationConversionCastCheck5checkERKNS_12ast_matchers11MatchFinder11MatchResultE+0x564):对‘clang::tidy::abseil::getDurationInverseForScale(clang::tidy::abseil::DurationScale)’未定义的引用 DurationConversionCastCheck.cpp:(.text._ZN5clang4tidy6abseil27DurationConversionCastCheck5checkERKNS_12ast_matchers11MatchFinder11MatchResultE+0x924):对‘clang::tidy::abseil::getDurationInverseForScale(clang::tidy::abseil::DurationScale)’未定义的引用 ../../../../lib/libclangTidyAbseilModule.a(DurationSubtractionCheck.cpp.o):在函数‘clang::tidy::abseil::DurationSubtractionCheck::check(clang::ast_matchers::MatchFinder::MatchResult const&)’中: DurationSubtractionCheck.cpp:(.text._ZN5clang4tidy6abseil24DurationSubtractionCheck5checkERKNS_12ast_matchers11MatchFinder11MatchResultE+0x191):对‘clang::tidy::abseil::getScaleForDurationInverse(llvm::StringRef)’未定义的引用 DurationSubtractionCheck.cpp:(.text._ZN5clang4tidy6abseil24DurationSubtractionCheck5checkERKNS_12ast_matchers11MatchFinder11MatchResultE+0x1c2):对‘clang::tidy::abseil::rewriteExprFromNumberToDuration[abi:cxx11](clang::ast_matchers::MatchFinder::MatchResult const&, clang::tidy::abseil::DurationScale, clang::Expr const*)’未定义的引用 ../../../../lib/libclangTidyAbseilModule.a(DurationUnnecessaryConversionCheck.cpp.o):在函数‘clang::tidy::abseil::DurationUnnecessaryConversionCheck::check(clang::ast_matchers::MatchFinder::MatchResult const&)’中: DurationUnnecessaryConversionCheck.cpp:(.text._ZN5clang4tidy6abseil34DurationUnnecessaryConversionCheck5checkERKNS_12ast_matchers11MatchFinder11MatchResultE+0x1af):对‘clang::tidy::abseil::isInMacro(clang::ast_matchers::MatchFinder::MatchResult const&, clang::Expr const*)’未定义的引用 ../../../../lib/libclangTidyAbseilModule.a(TimeSubtractionCheck.cpp.o):在函数‘clang::tidy::abseil::TimeSubtractionCheck::registerMatchers(clang::ast_matchers::MatchFinder*)’中: TimeSubtractionCheck.cpp:(.text._ZN5clang4tidy6abseil20TimeSubtractionCheck16registerMatchersEPNS_12ast_matchers11MatchFinderE+0x208):对‘clang::tidy::abseil::getScaleForTimeInverse(llvm::StringRef)’未定义的引用 TimeSubtractionCheck.cpp:(.text._ZN5clang4tidy6abseil20TimeSubtractionCheck16registerMatchersEPNS_12ast_matchers11MatchFinderE+0x89c):对‘clang::tidy::abseil::getDurationFactoryForScale(clang::tidy::abseil::DurationScale)’未定义的引用 ../../../../lib/libclangTidyAbseilModule.a(TimeSubtractionCheck.cpp.o):在函数‘clang::tidy::abseil::TimeSubtractionCheck::check(clang::ast_matchers::MatchFinder::MatchResult const&)’中: TimeSubtractionCheck.cpp:(.text._ZN5clang4tidy6abseil20TimeSubtractionCheck5checkERKNS_12ast_matchers11MatchFinder11MatchResultE+0x1a4):对‘clang::tidy::abseil::getScaleForTimeInverse(llvm::StringRef)’未定义的引用 TimeSubtractionCheck.cpp:(.text._ZN5clang4tidy6abseil20TimeSubtractionCheck5checkERKNS_12ast_matchers11MatchFinder11MatchResultE+0x26a):对‘clang::tidy::abseil::getDurationFactoryForScale(clang::tidy::abseil::DurationScale)’未定义的引用 TimeSubtractionCheck.cpp:(.text._ZN5clang4tidy6abseil20TimeSubtractionCheck5checkERKNS_12ast_matchers11MatchFinder11MatchResultE+0x732):对‘clang::tidy::abseil::rewriteExprFromNumberToTime[abi:cxx11](clang::ast_matchers::MatchFinder::MatchResult const&, clang::tidy::abseil::DurationScale, clang::Expr const*)’未定义的引用 TimeSubtractionCheck.cpp:(.text._ZN5clang4tidy6abseil20TimeSubtractionCheck5checkERKNS_12ast_matchers11MatchFinder11MatchResultE+0x782):对‘clang::tidy::abseil::rewriteExprFromNumberToTime[abi:cxx11](clang::ast_matchers::MatchFinder::MatchResult const&, clang::tidy::abseil::DurationScale, clang::Expr const*)’未定义的引用 TimeSubtractionCheck.cpp:(.text._ZN5clang4tidy6abseil20TimeSubtractionCheck5checkERKNS_12ast_matchers11MatchFinder11MatchResultE+0xd0a):对‘clang::tidy::abseil::rewriteExprFromNumberToTime[abi:cxx11](clang::ast_matchers::MatchFinder::MatchResult const&, clang::tidy::abseil::DurationScale, clang::Expr const*)’未定义的引用 TimeSubtractionCheck.cpp:(.text._ZN5clang4tidy6abseil20TimeSubtractionCheck5checkERKNS_12ast_matchers11MatchFinder11MatchResultE+0xd51):对‘clang::tidy::abseil::rewriteExprFromNumberToTime[abi:cxx11](clang::ast_matchers::MatchFinder::MatchResult const&, clang::tidy::abseil::DurationScale, clang::Expr const*)’未定义的引用 TimeSubtractionCheck.cpp:(.text._ZN5clang4tidy6abseil20TimeSubtractionCheck5checkERKNS_12ast_matchers11MatchFinder11MatchResultE+0xd89):对‘clang::tidy::abseil::getDurationInverseForScale(clang::tidy::abseil::DurationScale)’未定义的引用 TimeSubtractionCheck.cpp:(.text._ZN5clang4tidy6abseil20TimeSubtractionCheck5checkERKNS_12ast_matchers11MatchFinder11MatchResultE+0x1061):对‘clang::tidy::abseil::rewriteExprFromNumberToTime[abi:cxx11](clang::ast_matchers::MatchFinder::MatchResult const&, clang::tidy::abseil::DurationScale, clang::Expr const*)’未定义的引用 TimeSubtractionCheck.cpp:(.text._ZN5clang4tidy6abseil20TimeSubtractionCheck5checkERKNS_12ast_matchers11MatchFinder11MatchResultE+0x10aa):对‘clang::tidy::abseil::rewriteExprFromNumberToTime[abi:cxx11](clang::ast_matchers::MatchFinder::MatchResult const&, clang::tidy::abseil::DurationScale, clang::Expr const*)’未定义的引用 collect2: 错误:ld 返回 1 make[2]: *** [lib/libclang.so.10] 错误 1 make[1]: *** [tools/clang/tools/libclang/CMakeFiles/libclang.dir/all] 错误 2 make: *** [all] 错误 2 ``` 求救

CentOS环境中ping 出现Destination Host Unreachable

我配置了5台虚拟机,分别由各自的网卡,拓扑如下: ![图片说明](https://img-ask.csdn.net/upload/202003/28/1585387916_542861.png) 这个是华为虚拟机画的,方便你们了解,这里的IP地址我是配置完成,并且自己也操作了,发现都是可以ping通的,但是在虚拟机上出现了问题。下面是我的虚拟机的配置: ![图片说明](https://img-ask.csdn.net/upload/202003/28/1585387939_88837.png) ![图片说明](https://img-ask.csdn.net/upload/202003/28/1585387947_300882.png) ![图片说明](https://img-ask.csdn.net/upload/202003/28/1585387955_632614.png) ![图片说明](https://img-ask.csdn.net/upload/202003/28/1585387981_921000.png) ![图片说明](https://img-ask.csdn.net/upload/202003/28/1585387996_566725.png) 下面是PC1的ping192.168.1.3和172.16.0.3 ![图片说明](https://ucc.alicdn.com/pic/developer-ecology/1efe47edc9de4eb48bf689df8a267124.png) 和PC1是可以ping通的,但是R1就是不能ping通R2 ![图片说明](https://ucc.alicdn.com/pic/developer-ecology/6fd3e28a7b5a4dcb92bd08c5081cb41c.png) 以下是各个设备的路由表 ![图片说明](https://ucc.alicdn.com/pic/developer-ecology/5de1d6d25752491ca8e36842a5c6c3e4.png) ![图片说明](https://ucc.alicdn.com/pic/developer-ecology/9155e0b9e5b3494f8302dae5c61acdc0.png) ![图片说明](https://ucc.alicdn.com/pic/developer-ecology/e4a48772e1d84a589b2571c4eb742f56.png) ![图片说明](https://ucc.alicdn.com/pic/developer-ecology/94ecb493c3204badb200399bb9fe91d3.png) ![图片说明](https://ucc.alicdn.com/pic/developer-ecology/d8c225f9039a49f3bc5c4195c809d7c4.png) 防火墙和iptables关闭和/proc/sys/net/ipv4/ip_forward开启 ![图片说明](https://ucc.alicdn.com/pic/developer-ecology/e84a2dbd5f174723b2c433220be22212.png) ![图片说明](https://ucc.alicdn.com/pic/developer-ecology/2eeecf5b24d54c55b81f84ad74da81b2.png) ![图片说明](https://ucc.alicdn.com/pic/developer-ecology/d42a5316f09c4f70a9014fe2a47bee8d.png) 有需要我贴上去的请告诉我,希望各位大佬可以帮助我解决这个问题。

Zookeeper在Centos下编译C客户端./configure出现失败,

hecking for gethostbyname... yes checking for gethostname... yes checking for getlogin... yes checking for getpwuid_r... yes checking for gettimeofday... yes checking for getuid... yes checking for memmove... yes checking for memset... yes checking for poll... yes checking for socket... yes checking for strchr... yes checking for strdup... yes checking for strerror... yes checking for strtol... yes configure: creating ./config.status ./config.status: line 331: syntax error near unexpected token `newline' ./config.status: line 331: `"'

centos编译内核时出现这样的错误 请问如何解决

百度的解决方案是配置kernel feature 可是我无法找到这个选项 ![图片说明](https://img-ask.csdn.net/upload/201604/10/1460292428_599120.png)

gcc编译出错提示怎么设置成中文

gcc编译出错提示要怎样设置才会中文显示?各位大佬帮帮忙。小弟感激不尽

求大神 如何在vmware虚拟机下centos操作系统搭建交叉编译环境 详细一点 急需!!!

centos操作系统下如何安装交叉编译环境 专业基础较差 望解释的详细一下 万分感谢!!!

在CentOS6.5装redis时候报错,是不是gcc问题,的错误困扰我好久啦?

make[2]: Leaving directory `/usr/local/redis-3.2.3/deps' CC adlist.o CC quicklist.o CC ae.o In file included from ae.c:53: ae_epoll.c: 在函数‘aeApiAddEvent’中: ae_epoll.c:75: 警告:缺少初始值设定 ae_epoll.c:75: 警告:(在‘ee.data’的初始化附近) ae_epoll.c: 在函数‘aeApiDelEvent’中: ae_epoll.c:92: 警告:缺少初始值设定 ae_epoll.c:92: 警告:(在‘ee.data’的初始化附近) CC anet.o anet.c: 在函数‘anetSockName’中: anet.c:640: 警告:dereferencing pointer ‘s’ does break strict-aliasing rules anet.c:638: 附注:initialized from here anet.c:644: 警告:dereferencing pointer ‘s’ does break strict-aliasing rules anet.c:642: 附注:initialized from here anet.c: 在函数‘anetPeerToString’中: anet.c:584: 警告:dereferencing pointer ‘s’ does break strict-aliasing rules anet.c:582: 附注:initialized from here anet.c:588: 警告:dereferencing pointer ‘s’ does break strict-aliasing rules anet.c:586: 附注:initialized from here anet.c: 在函数‘anetTcpAccept’中: anet.c:555: 警告:dereferencing pointer ‘s’ does break strict-aliasing rules anet.c:553: 附注:initialized from here anet.c:559: 警告:dereferencing pointer ‘s’ does break strict-aliasing rules anet.c:557: 附注:initialized from here /tmp/ccMyxAR8.s: Assembler messages: /tmp/ccMyxAR8.s:3732: Error: symbol `fstatat64' is already defined /tmp/ccMyxAR8.s:3755: Error: symbol `fstat64' is already defined /tmp/ccMyxAR8.s:3774: Error: symbol `lstat64' is already defined /tmp/ccMyxAR8.s:3793: Error: symbol `stat64' is already defined make[1]: *** [anet.o] 错误 1

ubuntu ping虚拟机中的centos显示host unreachable

宿主机ubuntu用wifi上网,给eth0设置ip为10.12.70.1,子网掩码为255.255.255.0。虚拟机centos的eth2为桥接模式,ip为10.12.70.2,netmask为255.255.255.0。不论从哪边ping另一边,都是显示host unreachable

CentOS 编译出来的.so文件,在别人的虚拟机上动态加载报错(自己虚拟机可以被正常加载) 什么原因?

CentOS 编译出来的.so文件,用我的.out在别人的虚拟机上动态加载报错,如下图: ![图片说明](https://img-ask.csdn.net/upload/202004/25/1587806546_463803.png) tgcclient是.out文件,需要动态加载libqaxtgs.so文件并访问其接口。但加载失败,自己环境加载没有问题(别人环境也试了装相同版本的GCC也不行)

CentOS下编译openjdk7出错,怎么解决?

![图片说明](https://img-ask.csdn.net/upload/201612/20/1482219938_130413.png) 报错信息如图,没有明显的报错位置,我该怎么解决? 求助大神!

小白请求Centos6编译安装的程序如何设置开机启动启动

如下: 我编译安装了一个apache,每次启动都需要 /usr/local/httpd/bin/apachectl start。 我怎么设置成 service httpd start。 怎么设置成开机自动启动。 求大神指教一下。

centos7编译安装openvpn错误

运行 [root@MyCloudServer openvpn-2.3.4]# ./configure 末尾出现这个错误 前半部分省略 checking that generated files are newer than configure... done configure: creating ./config.status config.status: creating version.sh config.status: creating Makefile config.status: creating build/Makefile config.status: creating build/msvc/Makefile config.status: creating build/msvc/msvc-generate/Makefile config.status: creating distro/Makefile config.status: creating distro/rpm/Makefile config.status: creating distro/rpm/openvpn.spec config.status: creating include/Makefile config.status: creating src/Makefile config.status: creating src/compat/Makefile config.status: creating src/openvpn/Makefile config.status: creating src/openvpnserv/Makefile config.status: creating src/plugins/Makefile config.status: creating src/plugins/auth-pam/Makefile config.status: creating src/plugins/down-root/Makefile config.status: creating tests/Makefile config.status: creating sample/Makefile config.status: creating doc/Makefile config.status: creating tests/t_client.sh config.status: creating config.h config.status: config.h is unchanged config.status: executing depfiles commands config.status: executing libtool commands [root@MyCloudServer openvpn-2.3.4]#

C/C++学习指南全套教程

C/C++学习的全套教程,从基本语法,基本原理,到界面开发、网络开发、Linux开发、安全算法,应用尽用。由毕业于清华大学的业内人士执课,为C/C++编程爱好者的教程。

定量遥感中文版 梁顺林著 范闻捷译

这是梁顺林的定量遥感的中文版,由范闻捷等翻译的,是电子版PDF,解决了大家看英文费时费事的问题,希望大家下载看看,一定会有帮助的

YOLOv3目标检测实战:训练自己的数据集

YOLOv3是一种基于深度学习的端到端实时目标检测方法,以速度快见长。本课程将手把手地教大家使用labelImg标注和使用YOLOv3训练自己的数据集。课程分为三个小项目:足球目标检测(单目标检测)、梅西目标检测(单目标检测)、足球和梅西同时目标检测(两目标检测)。 本课程的YOLOv3使用Darknet,在Ubuntu系统上做项目演示。包括:安装Darknet、给自己的数据集打标签、整理自己的数据集、修改配置文件、训练自己的数据集、测试训练出的网络模型、性能统计(mAP计算和画出PR曲线)和先验框聚类。 Darknet是使用C语言实现的轻型开源深度学习框架,依赖少,可移植性好,值得深入探究。 除本课程《YOLOv3目标检测实战:训练自己的数据集》外,本人推出了有关YOLOv3目标检测的系列课程,请持续关注该系列的其它课程视频,包括: 《YOLOv3目标检测实战:交通标志识别》 《YOLOv3目标检测:原理与源码解析》 《YOLOv3目标检测:网络模型改进方法》 敬请关注并选择学习!

sql语句 异常 Err] 1064 - You have an error in your SQL syntax; check the manual that corresponds to your

在我们开发的工程中,有时候会报 [Err] 1064 - You have an error in your SQL syntax; check the manual that corresponds to your MySQL server version for the right syntax to use near ------ 这种异常 不用多想,肯定是我们的sql语句出现问题,下面...

浪潮集团 往年的软件类 笔试题 比较详细的哦

浪潮集团 往年的软件类 笔试题 比较详细的哦

2019 AI开发者大会

2019 AI开发者大会(AI ProCon 2019)是由中国IT社区CSDN主办的AI技术与产业年度盛会。多年经验淬炼,如今蓄势待发:2019年9月6-7日,大会将有近百位中美顶尖AI专家、知名企业代表以及千余名AI开发者齐聚北京,进行技术解读和产业论证。我们不空谈口号,只谈技术,诚挚邀请AI业内人士一起共铸人工智能新篇章!

I2c串口通信实现加速度传感器和FPGA的交流

此代码能实现加速度传感器与FPGA之间的交流,从而测出运动物体的加速度。

Python可以这样学(第一季:Python内功修炼)

董付国系列教材《Python程序设计基础》、《Python程序设计(第2版)》、《Python可以这样学》配套视频,讲解Python 3.5.x和3.6.x语法、内置对象用法、选择与循环以及函数设计与使用、lambda表达式用法、字符串与正则表达式应用、面向对象编程、文本文件与二进制文件操作、目录操作与系统运维、异常处理结构。

微信公众平台开发入门

本套课程的设计完全是为初学者量身打造,课程内容由浅入深,课程讲解通俗易懂,代码实现简洁清晰。通过本课程的学习,学员能够入门微信公众平台开发,能够胜任企业级的订阅号、服务号、企业号的应用开发工作。 通过本课程的学习,学员能够对微信公众平台有一个清晰的、系统性的认识。例如,公众号是什么,它有什么特点,它能做什么,怎么开发公众号。 其次,通过本课程的学习,学员能够掌握微信公众平台开发的方法、技术和应用实现。例如,开发者文档怎么看,开发环境怎么搭建,基本的消息交互如何实现,常用的方法技巧有哪些,真实应用怎么开发。

机器学习初学者必会的案例精讲

通过六个实际的编码项目,带领同学入门人工智能。这些项目涉及机器学习(回归,分类,聚类),深度学习(神经网络),底层数学算法,Weka数据挖掘,利用Git开源项目实战等。

eclipseme 1.7.9

eclipse 出了新的eclipseme插件,官方有下载,但特慢,我都下了大半天(可能自己网速差)。有急需要的朋友可以下哦。。。

Spring Boot -01- 快速入门篇(图文教程)

Spring Boot -01- 快速入门篇 今天开始不断整理 Spring Boot 2.0 版本学习笔记,大家可以在博客看到我的笔记,然后大家想看视频课程也可以到【慕课网】手机 app,去找【Spring Boot 2.0 深度实践】的课程,令人开心的是,课程完全免费! 什么是 Spring Boot? Spring Boot 是由 Pivotal 团队提供的全新框架。Spring Boot...

HoloLens2开发入门教程

本课程为HoloLens2开发入门教程,讲解部署开发环境,安装VS2019,Unity版本,Windows SDK,创建Unity项目,讲解如何使用MRTK,编辑器模拟手势交互,打包VS工程并编译部署应用到HoloLens上等。

最简单的倍频verilog程序(Quartus II)

一个工程文件 几段简单的代码 一个输入一个输出(50Mhz倍频到100Mhz)

计算机组成原理实验教程

西北工业大学计算机组成原理实验课唐都仪器实验帮助,同实验指导书。分为运算器,存储器,控制器,模型计算机,输入输出系统5个章节

4小时玩转微信小程序——基础入门与微信支付实战

这是一个门针对零基础学员学习微信小程序开发的视频教学课程。课程采用腾讯官方文档作为教程的唯一技术资料来源。杜绝网络上质量良莠不齐的资料给学员学习带来的障碍。 视频课程按照开发工具的下载、安装、使用、程序结构、视图层、逻辑层、微信小程序等几个部分组织课程,详细讲解整个小程序的开发过程

面试了一个 31 岁程序员,让我有所触动,30岁以上的程序员该何去何从?

最近面试了一个31岁8年经验的程序猿,让我有点感慨,大龄程序猿该何去何从。

基于RSA通信密钥分发的加密通信

基于RSA通信密钥分发的加密通信,采用pycrypto中的RSA、AES模块实现

不同变质程度煤尘爆炸残留气体特征研究

为分析不同变质程度煤尘爆炸残留气体成分的特征规律,利用水平管道煤尘爆炸实验装置进行了贫瘦煤、肥煤、气煤、长焰煤4种不同变质程度的煤尘爆炸实验,研究了不同变质程度煤尘爆炸后气体残留物含量的差异,并对气体

设计模式(JAVA语言实现)--20种设计模式附带源码

课程亮点: 课程培训详细的笔记以及实例代码,让学员开始掌握设计模式知识点 课程内容: 工厂模式、桥接模式、组合模式、装饰器模式、外观模式、享元模式、原型模型、代理模式、单例模式、适配器模式 策略模式、模板方法模式、观察者模式、迭代器模式、责任链模式、命令模式、备忘录模式、状态模式、访问者模式 课程特色: 笔记设计模式,用笔记串连所有知识点,让学员从一点一滴积累,学习过程无压力 笔记标题采用关键字标识法,帮助学员更加容易记住知识点 笔记以超链接形式让知识点关联起来,形式知识体系 采用先概念后实例再应用方式,知识点深入浅出 提供授课内容笔记作为课后复习以及工作备查工具 部分图表(电脑PC端查看):

MySQL数据库面试题(2020最新版)

文章目录数据库基础知识为什么要使用数据库什么是SQL?什么是MySQL?数据库三大范式是什么mysql有关权限的表都有哪几个MySQL的binlog有有几种录入格式?分别有什么区别?数据类型mysql有哪些数据类型引擎MySQL存储引擎MyISAM与InnoDB区别MyISAM索引与InnoDB索引的区别?InnoDB引擎的4大特性存储引擎选择索引什么是索引?索引有哪些优缺点?索引使用场景(重点)...

软件测试2小时入门

本课程内容系统、全面、简洁、通俗易懂,通过2个多小时的介绍,让大家对软件测试有个系统的理解和认识,具备基本的软件测试理论基础。 主要内容分为5个部分: 1 软件测试概述,了解测试是什么、测试的对象、原则、流程、方法、模型;&nbsp; 2.常用的黑盒测试用例设计方法及示例演示;&nbsp; 3 常用白盒测试用例设计方法及示例演示;&nbsp; 4.自动化测试优缺点、使用范围及示例‘;&nbsp; 5.测试经验谈。

几率大的Redis面试题(含答案)

本文的面试题如下: Redis 持久化机制 缓存雪崩、缓存穿透、缓存预热、缓存更新、缓存降级等问题 热点数据和冷数据是什么 Memcache与Redis的区别都有哪些? 单线程的redis为什么这么快 redis的数据类型,以及每种数据类型的使用场景,Redis 内部结构 redis的过期策略以及内存淘汰机制【~】 Redis 为什么是单线程的,优点 如何解决redis的并发竞争key问题 Red...

手把手实现Java图书管理系统(附源码)

【超实用课程内容】 本课程演示的是一套基于Java的SSM框架实现的图书管理系统,主要针对计算机相关专业的正在做毕设的学生与需要项目实战练习的java人群。详细介绍了图书管理系统的实现,包括:环境搭建、系统业务、技术实现、项目运行、功能演示、系统扩展等,以通俗易懂的方式,手把手的带你从零开始运行本套图书管理系统,该项目附带全部源码可作为毕设使用。 【课程如何观看?】 PC端:https://edu.csdn.net/course/detail/27513 移动端:CSDN 学院APP(注意不是CSDN APP哦) 本课程为录播课,课程2年有效观看时长,大家可以抓紧时间学习后一起讨论哦~ 【学员专享增值服务】 源码开放 课件、课程案例代码完全开放给你,你可以根据所学知识,自行修改、优化

jsp+servlet入门项目实例

jsp+servlet实现班级信息管理项目

winfrom中嵌套html,跟html的交互

winfrom中嵌套html,跟html的交互,源码就在里面一看就懂,很简单

Java面试题大全(2020版)

发现网上很多Java面试题都没有答案,所以花了很长时间搜集整理出来了这套Java面试题大全,希望对大家有帮助哈~ 本套Java面试题大全,全的不能再全,哈哈~ 一、Java 基础 1. JDK 和 JRE 有什么区别? JDK:Java Development Kit 的简称,java 开发工具包,提供了 java 的开发环境和运行环境。 JRE:Java Runtime Environ...

python实现数字水印添加与提取及鲁棒性测试(GUI,基于DCT,含测试图片)

由python写的GUI,可以实现数字水印的添加与提取,提取是根据添加系数的相关性,实现了盲提取。含有两种攻击测试方法(高斯低通滤波、高斯白噪声)。基于python2.7,watermark.py为主

Xshell6完美破解版,亲测可用

Xshell6破解版,亲测可用,分享给大家。直接解压即可使用

你连存活到JDK8中著名的Bug都不知道,我怎么敢给你加薪

CopyOnWriteArrayList.java和ArrayList.java,这2个类的构造函数,注释中有一句话 1 2 3 4 5 6 7 8 9 10 11 12 13 14 15 public ArrayList(Collection&lt;? ...

相关热词 c#分级显示数据 c# 不区分大小写替换 c#中调用就java c#正则表达式 验证小数 c# vscode 配置 c#三维数组能存多少数据 c# 新建excel c#多个文本框 c#怎么创建tcp通讯 c# mvc 电子病例
立即提问