NPM错误There is likely additional logging output above.怎么解决

0 info it worked if it ends with ok
1 verbose cli [ 'D:\Program Files\nodejs\node.exe',
1 verbose cli 'D:\Program Files\nodejs\node_modules\npm\bin\npm-cli.js',
1 verbose cli 'run',
1 verbose cli 'build' ]
2 info using npm@6.9.0
3 info using node@v10.16.3
4 verbose run-script [ 'prebuild', 'build', 'postbuild' ]
5 info lifecycle 08cms@1.0.0~prebuild: 08cms@1.0.0
6 info lifecycle 08cms@1.0.0~build: 08cms@1.0.0
7 verbose lifecycle 08cms@1.0.0~build: unsafe-perm in lifecycle true
8 verbose lifecycle 08cms@1.0.0~build: PATH: D:\Program Files\nodejs\node_modules\npm\node_modules\npm-lifecycle\node-gyp-bin;c:\av\houses\node_modules.bin;C:\Program Files (x86)\NetSarang\Xshell 6\;C:\Windows\system32;C:\Windows;C:\Windows\System32\Wbem;C:\Windows\System32\WindowsPowerShell\v1.0\;C:\Program Files (x86)\Microsoft SQL Server\80\Tools\BINN;d:\Program Files\OpenVPN\bin;D:\py;D:\Program Files\nodejs\;C:\Program Files (x86)\Nmap;C:\Users\Administrator\AppData\Roaming\npm
9 verbose lifecycle 08cms@1.0.0~build: CWD: c:\av\houses
10 silly lifecycle 08cms@1.0.0~build: Args: [ '/d /s /c', 'node build/build.js' ]
11 silly lifecycle 08cms@1.0.0~build: Returned: code: 1 signal: null
12 info lifecycle 08cms@1.0.0~build: Failed to exec build script
13 verbose stack Error: 08cms@1.0.0 build: node build/build.js
13 verbose stack Exit status 1
13 verbose stack at EventEmitter. (D:\Program Files\nodejs\node_modules\npm\node_modules\npm-lifecycle\index.js:301:16)
13 verbose stack at EventEmitter.emit (events.js:198:13)
13 verbose stack at ChildProcess. (D:\Program Files\nodejs\node_modules\npm\node_modules\npm-lifecycle\lib\spawn.js:55:14)
13 verbose stack at ChildProcess.emit (events.js:198:13)
13 verbose stack at maybeClose (internal/child_process.js:982:16)
13 verbose stack at Process.ChildProcess._handle.onexit (internal/child_process.js:259:5)
14 verbose pkgid 08cms@1.0.0
15 verbose cwd c:\av\houses
16 verbose Windows_NT 6.1.7601
17 verbose argv "D:\Program Files\nodejs\node.exe" "D:\Program Files\nodejs\node_modules\npm\bin\npm-cli.js" "run" "build"
18 verbose node v10.16.3
19 verbose npm v6.9.0
20 error code ELIFECYCLE
21 error errno 1
22 error 08cms@1.0.0 build: node build/build.js
22 error Exit status 1
23 error Failed at the 08cms@1.0.0 build script.
23 error This is probably not a problem with npm. There is likely additional logging output above.
24 verbose exit [ 1, true ]

1个回答

Csdn user default icon
上传中...
上传图片
插入图片
抄袭、复制答案,以达到刷声望分或其他目的的行为,在CSDN问答是严格禁止的,一经发现立刻封号。是时候展现真正的技术了!
其他相关推荐
npm start : npm ERR! code ELIFECYCLE
npm ERR! code ELIFECYCLE npm ERR! errno 1 npm ERR! DYWL@0.0.3 start: `node node_modules/react-native/local-cli/cli.js start` npm ERR! Exit status 1 npm ERR! npm ERR! Failed at the DYWL@0.0.3 start script. npm ERR! This is probably not a problem with npm. There is likely additional logging output above. npm ERR! A complete log of this run can be found in: npm ERR! E:\software\Node\node_cache\_logs\2019-11-28T05_26_03_049Z-debug.log 运行npm start 报错 按照网上找到的资料 卸载完之后重新安装还是不行 请各路大神赐教.![图片说明](https://img-ask.csdn.net/upload/201911/28/1574919020_342811.png)
Vue启动 npm run dev之后报错!!!!!!!!!!!!!!!!!!!!!!!!!!!
npm ERR! code ELIFECYCLE npm ERR! errno 1 npm ERR! vue_demo01@1.0.0 dev: `webpack-dev-server --inline --progr ess --config build/webpack.dev.conf.js` npm ERR! Exit status 1 npm ERR! npm ERR! Failed at the vue_demo01@1.0.0 dev script. npm ERR! This is probably not a problem with npm. There is likely additional logging output above. npm ERR! A complete log of this run can be found in: npm ERR! C:\Users\apple\AppData\Roaming\npm-cache\_logs\2019-03-23T08_47_19_392Z-debug.log ``` ```
解決 vue code ELIFECYCLE 的方法
![图片说明](https://img-ask.csdn.net/upload/201911/28/1574908016_151108.jpg) ![图片说明](https://img-ask.csdn.net/upload/201911/28/1574909752_15853.png) 環境 npm -v 6.12.0 node -v -->v8.16.1 npm ERR! code ELIFECYCLE npm ERR! errno 1 npm ERR! tabbar@1.0.0 dev: `webpack-dev-server --inline --progress --config build/webpack.dev.conf.js` npm ERR! Exit status 1 npm ERR! npm ERR! Failed at the tabbar@1.0.0 dev script. npm ERR! This is probably not a problem with npm. There is likely additional logging output above. google 百度查找方法一(不ok) ``` rm -rf node_modules rm package-lock.json npm cache clear --force npm install ``` 方法二(還是不OK) ``` npm uninstall webpack-dev-server npm install webpack-dev-server@2.9.1 ``` vue版本和webpack-dev-server版本不匹配導致
我在文件夹下执行npm run dev出现错误,该如何解决?
我先执行以下命令,没有出现问题 ``` cd web/ npm install cd client/ npm install ``` 但是当我执行 ``` cd ../ npm run dev ``` 发生错误,我不知道如何解决, ``` zcy@ubuntu:~/new project/blockchain-document-management/web$ npm run dev > nykredit-network@0.0.1 dev /home/zcy/new project/blockchain-document-management/web > concurrently --kill-others-on-fail "npm run server" "npm run client" [0] [0] > nykredit-network@0.0.1 server /home/zcy/new project/blockchain-document-management/web [0] > nodemon app.js [0] [1] [1] > nykredit-network@0.0.1 client /home/zcy/new project/blockchain-document-management/web [1] > cd client && npm run start [1] [0] sh: 1: nodemon: not found [0] npm ERR! file sh [0] npm ERR! code ELIFECYCLE [0] npm ERR! errno ENOENT [0] npm ERR! syscall spawn [0] npm ERR! nykredit-network@0.0.1 server: `nodemon app.js` [0] npm ERR! spawn ENOENT [0] npm ERR! [0] npm ERR! Failed at the nykredit-network@0.0.1 server script. [0] npm ERR! This is probably not a problem with npm. There is likely additional logging output above. [0] [0] npm ERR! A complete log of this run can be found in: [0] npm ERR! /home/zcy/.npm/_logs/2018-12-17T02_31_36_271Z-debug.log [0] npm run server exited with code 1 --> Sending SIGTERM to other processes.. [1] npm run client exited with code SIGTERM npm ERR! code ELIFECYCLE npm ERR! errno 1 npm ERR! nykredit-network@0.0.1 dev: `concurrently --kill-others-on-fail "npm run server" "npm run client"` npm ERR! Exit status 1 npm ERR! npm ERR! Failed at the nykredit-network@0.0.1 dev script. npm ERR! This is probably not a problem with npm. There is likely additional logging output above. npm ERR! A complete log of this run can be found in: npm ERR! /home/zcy/.npm/_logs/2018-12-17T02_31_36_412Z-debug.log ```
webpack 打包报错,怎么解决,大神帮忙看一下 多谢
ERROR in ./node_modules/_css-loader@0.28.11@css-loader!./src/assets/vendor/mui/css/mui.css Module build failed: @ ./src/assets/vendor/mui/css/mui.css 2:14-104 @ ./src/main.js npm ERR! code ELIFECYCLE npm ERR! errno 2 npm ERR! y@1.0.0 build: `cross-env NODE_ENV=production webpack --progress --hide-modules` npm ERR! Exit status 2 npm ERR! npm ERR! Failed at the y@1.0.0 build script. npm ERR! This is probably not a problem with npm. There is likely additional logging output above. npm ERR! A complete log of this run can be found in:
react-native配置 求助
**npm install --global expo-cli** envsub@3.1.0 postinstall C:\Users\y8378\AppData\Roaming\npm\node_modules\expo-cli\node_modules\envsub > test -d .git && cp gitHookPrePush.sh .git/hooks/pre-push || true 'test' 不是内部或外部命令,也不是可运行的程序 或批处理文件。 'true' 不是内部或外部命令,也不是可运行的程序 或批处理文件。 ELIFECYCLE npm ERR! errno 1 npm ERR! envsub@3.1.0 postinstall: `test -d .git && cp gitHookPrePush.sh .git/hooks/pre-push || true` npm ERR! Exit status 1 npm ERR! npm ERR! Failed at the envsub@3.1.0 postinstall script. npm ERR! This is probably not a problem with npm. There is likely additional logging output above. npm ERR! A complete log of this run can be found in: npm ERR! C:\Users\y8378\AppData\Roaming\npm-cache\_logs\2019-12-06T18_38_13_543Z-debug.log 如何解决这个错误
ubuntu node 安装 canvas不成功
用npm安装canvas用的这两句代码sudo apt-get install libcairo2-dev和npm install canvas 出现错误 sh: 1: node-waf: not found npm ERR! canvas@0.10.2 preinstall: `node-waf configure build` npm ERR! Exit status 127 npm ERR! npm ERR! Failed at the canvas@0.10.2 preinstall script. npm ERR! This is most likely a problem with the canvas package, npm ERR! not with npm itself. npm ERR! Tell the author that this fails on your system: npm ERR! node-waf configure build npm ERR! You can get their info via: npm ERR! npm owner ls canvas npm ERR! There is likely additional logging output above. npm ERR! System Linux 3.8.0-29-generic npm ERR! command "/usr/local/bin/node" "/usr/local/bin/npm" "install" "canvas" npm ERR! cwd /home/baobao/baobao/spriter npm ERR! node -v v0.10.33 npm ERR! npm -v 1.4.28 npm ERR! code ELIFECYCLE npm ERR! not ok code 0 root@ubuntu:/home/baobao/baobao/spriter# 已经好几天,在线等,希望有懂的人告诉我
在安装yeoman时出现如下提示错误,怎么解决
E:\node-v8.4.0-win-x64\node-v8.4.0-win-x64>npm install -g yo E:\node-v8.4.0-win-x64\node-v8.4.0-win-x64\yo -> E:\node-v8.4.0-win-x64\node-v8.4.0-win-x64\node_modules\yo\lib\cli.js E:\node-v8.4.0-win-x64\node-v8.4.0-win-x64\yo-complete -> E:\node-v8.4.0-win-x64\node-v8.4.0-win-x64\node_modules\yo\lib\completion\index.js > spawn-sync@1.0.15 postinstall E:\node-v8.4.0-win-x64\node-v8.4.0-win-x64\node_modules\yo\node_modules\spawn-sync > node postinstall 'node' 不是内部或外部命令,也不是可运行的程序 或批处理文件。 npm ERR! code ELIFECYCLE npm ERR! errno 1 npm ERR! spawn-sync@1.0.15 postinstall: `node postinstall` npm ERR! Exit status 1 npm ERR! npm ERR! Failed at the spawn-sync@1.0.15 postinstall script. npm ERR! This is probably not a problem with npm. There is likely additional logging output above. npm ERR! A complete log of this run can be found in: npm ERR! C:\Users\lenovo\AppData\Roaming\npm-cache\_logs\2017-09-22T08_40_14_944Z-debug.log E:\node-v8.4.0-win-x64\node-v8.4.0-win-x64>
npm问题'Path must be a string
> app@1.0.0 dev D:\work\qk\app > node build/dev-server.js [HPM] Proxy created: /api -> http://xxx.xxx.x.xxx [HPM] Proxy rewrite rule created: "^/api" ~> "/api" path.js:7 throw new TypeError('Path must be a string. Received ' + inspect(path)); ^ TypeError: Path must be a string. Received undefined at assertPath (path.js:7:11) at Object.join (path.js:1211:7) at Object.<anonymous> (D:\work\qk\app\build\dev-server.js:57:29) at Module._compile (module.js:541:32) at Object.Module._extensions..js (module.js:550:10) at Module.load (module.js:458:32) at tryModuleLoad (module.js:417:12) at Function.Module._load (module.js:409:3) at Function.Module.runMain (module.js:575:10) at startup (node.js:160:18) at node.js:449:3 npm ERR! Windows_NT 10.0.14393 npm ERR! argv "C:\\Program Files\\nodejs\\node.exe" "C:\\Program Files\\nodejs\\node_modules\\npm\\bin\\npm-cli.js" "run" "dev" npm ERR! node v6.2.0 npm ERR! npm v3.8.9 npm ERR! code ELIFECYCLE npm ERR! app@1.0.0 dev: `node build/dev-server.js` npm ERR! Exit status 1 npm ERR! npm ERR! Failed at the app@1.0.0 dev script 'node build/dev-server.js'. npm ERR! Make sure you have the latest version of node.js and npm installed. npm ERR! If you do, this is most likely a problem with the app package, npm ERR! not with npm itself. npm ERR! Tell the author that this fails on your system: npm ERR! node build/dev-server.js npm ERR! You can get information on how to open an issue for this project with: npm ERR! npm bugs app npm ERR! Or if that isn't available, you can get their info via: npm ERR! npm owner ls app npm ERR! There is likely additional logging output above. npm ERR! Please include the following file with any support request: npm ERR! D:\work\qk\app\npm-debug.log
npm run build 时出错
https://github.com/greggman/webgl-fundamentals 在git下载了这个项目,想要在本地运行,结果在执行 npm run build 时出错。请大佬帮忙看一下。 **控制台:** ``` Running "buildlessons" task Warning: requires at least node: 11 Use --force to continue. Aborted due to warnings. npm ERR! code ELIFECYCLE npm ERR! errno 3 npm ERR! webgl-fundamentals@0.0.0 build: `grunt` npm ERR! Exit status 3 npm ERR! npm ERR! Failed at the webgl-fundamentals@0.0.0 build script. npm ERR! This is probably not a problem with npm. There is likely additional logging output above. npm ERR! A complete log of this run can be found in: npm ERR! C:\Users\56386\AppData\Roaming\npm-cache\_logs\2019-04-26T02_09_33_735Z-debug.log ``` **日志:** ``` 0 info it worked if it ends with ok 1 verbose cli [ 'C:\\Program Files\\nodejs\\node.exe', 1 verbose cli 'C:\\Program Files\\nodejs\\node_modules\\npm\\bin\\npm-cli.js', 1 verbose cli 'run', 1 verbose cli 'build' ] 2 info using npm@6.4.1 3 info using node@v10.15.3 4 verbose run-script [ 'prebuild', 'build', 'postbuild' ] 5 info lifecycle webgl-fundamentals@0.0.0~prebuild: webgl-fundamentals@0.0.0 6 info lifecycle webgl-fundamentals@0.0.0~build: webgl-fundamentals@0.0.0 7 verbose lifecycle webgl-fundamentals@0.0.0~build: unsafe-perm in lifecycle true 8 verbose lifecycle webgl-fundamentals@0.0.0~build: PATH: C:\Program Files\nodejs\node_modules\npm\node_modules\npm-lifecycle\node-gyp-bin;C:\WorkLibo\webgl-fundamentals\node_modules\.bin;C:\WINDOWS\system32;C:\WINDOWS;C:\WINDOWS\System32\Wbem;C:\WINDOWS\System32\WindowsPowerShell\v1.0\;C:\WINDOWS\System32\OpenSSH\;C:\Program Files\Microsoft SQL Server\110\DTS\Binn\;C:\Program Files (x86)\Microsoft SQL Server\110\Tools\Binn\;C:\Program Files\Microsoft SQL Server\110\Tools\Binn\;C:\Program Files (x86)\Microsoft SQL Server\110\Tools\Binn\ManagementStudio\;C:\Program Files (x86)\Microsoft Visual Studio 10.0\Common7\IDE\PrivateAssemblies\;C:\Program Files (x86)\Microsoft SQL Server\110\DTS\Binn\;C:\Program Files\TortoiseSVN\bin;C:\Users\56386\.dnx\bin;C:\Program Files\Microsoft DNX\Dnvm\;C:\Program Files\Microsoft SQL Server\130\Tools\Binn\;C:\Program Files (x86)\Windows Kits\8.1\Windows Performance Toolkit\;C:\Program Files\nodejs\;C:\Program Files\Git\cmd;C:\Users\56386\AppData\Local\Microsoft\WindowsApps;;C:\Fiddler;C:\Users\56386\AppData\Local\Microsoft\WindowsApps;C:\Program Files\JetBrains\WebStorm 2019.1\bin;;C:\Users\56386\AppData\Roaming\npm 9 verbose lifecycle webgl-fundamentals@0.0.0~build: CWD: C:\WorkLibo\webgl-fundamentals 10 silly lifecycle webgl-fundamentals@0.0.0~build: Args: [ '/d /s /c', 'grunt' ] 11 silly lifecycle webgl-fundamentals@0.0.0~build: Returned: code: 3 signal: null 12 info lifecycle webgl-fundamentals@0.0.0~build: Failed to exec build script 13 verbose stack Error: webgl-fundamentals@0.0.0 build: `grunt` 13 verbose stack Exit status 3 13 verbose stack at EventEmitter.<anonymous> (C:\Program Files\nodejs\node_modules\npm\node_modules\npm-lifecycle\index.js:301:16) 13 verbose stack at EventEmitter.emit (events.js:189:13) 13 verbose stack at ChildProcess.<anonymous> (C:\Program Files\nodejs\node_modules\npm\node_modules\npm-lifecycle\lib\spawn.js:55:14) 13 verbose stack at ChildProcess.emit (events.js:189:13) 13 verbose stack at maybeClose (internal/child_process.js:970:16) 13 verbose stack at Process.ChildProcess._handle.onexit (internal/child_process.js:259:5) 14 verbose pkgid webgl-fundamentals@0.0.0 15 verbose cwd C:\WorkLibo\webgl-fundamentals 16 verbose Windows_NT 10.0.17763 17 verbose argv "C:\\Program Files\\nodejs\\node.exe" "C:\\Program Files\\nodejs\\node_modules\\npm\\bin\\npm-cli.js" "run" "build" 18 verbose node v10.15.3 19 verbose npm v6.4.1 20 error code ELIFECYCLE 21 error errno 3 22 error webgl-fundamentals@0.0.0 build: `grunt` 22 error Exit status 3 23 error Failed at the webgl-fundamentals@0.0.0 build script. 23 error This is probably not a problem with npm. There is likely additional logging output above. 24 verbose exit [ 3, true ] ```
运行Vue项目时,报错npm ERR! errno 1 npm ERR! Failed at the single@1.0.0 dev script.
运行Vue项目时,报错,不清楚是哪里出了问题 ``` Error: Cannot find module 'webpack-cli/bin/config-yargs' at Function.Module._resolveFilename (internal/modules/cjs/loader.js:636:15) at Function.Module._load (internal/modules/cjs/loader.js:562:25) at Module.require (internal/modules/cjs/loader.js:690:17) at require (internal/modules/cjs/helpers.js:25:18) at Object.<anonymous> (E:\HBuilderProjects\Vue\single\node_modules\_webpack-dev-server@3.7.1@webpack-dev-server\bin\webpack-dev-server.js:60:1) at Module._compile (internal/modules/cjs/loader.js:776:30) at Object.Module._extensions..js (internal/modules/cjs/loader.js:787:10) at Module.load (internal/modules/cjs/loader.js:653:32) at tryModuleLoad (internal/modules/cjs/loader.js:593:12) at Function.Module._load (internal/modules/cjs/loader.js:585:3) npm ERR! code ELIFECYCLE npm ERR! errno 1 npm ERR! single@1.0.0 dev: `webpack-dev-server --open --hot --port 8020` npm ERR! Exit status 1 npm ERR! npm ERR! Failed at the single@1.0.0 dev script. npm ERR! This is probably not a problem with npm. There is likely additional logging output above. npm ERR! A complete log of this run can be found in: npm ERR! C:\Users\asus\AppData\Roaming\npm-cache\_logs\2019-06-15T16_43_01_654Z-debug.log ``` ``` ``` 这个是package.json文件 ``` { "name": "single", "version": "1.0.0", "description": "", "main": "main.js", "scripts": { "dev": "webpack-dev-server --open --hot --port 8020" }, "keywords": [], "author": "", "license": "ISC", "dependencies": { "vue": "^2.6.10" }, "devDependencies": { "babel-core": "^6.26.3", "babel-loader": "^8.0.6", "babel-preset-env": "^1.7.0", "css-loader": "^3.0.0", "file-loader": "^4.0.0", "vue-html-loader": "^1.2.4", "vue-loader": "^15.7.0", "vue-style-loader": "^4.1.2", "vue-template-compiler": "^2.6.10", "webpack": "^4.34.0", "webpack-dev-server": "^3.7.1" } } ```
vue+vux 项目依赖丢失
项目已经发布,因为要加功能跑了dev后报了依赖丢失,可以肯定不是手动删的,求问为什么会出现这种状况,以及如何避免 To debug the "dev" script, make sure the %NODE_DEBUG_OPTION% string is specified as the first argument for the node command you'd like to debug. For example: "scripts": { "start": "node %NODE_DEBUG_OPTION% server.js" } > member@1.0.0 dev D:\member\member > webpack-dev-server --inline --progress --config build/webpack.dev.conf.js module.js:550 throw err; ^ Error: Cannot find module 'vux-loader' at Function.Module._resolveFilename (module.js:548:15) at Function.Module._load (module.js:475:25) at Module.require (module.js:597:17) at require (internal/module.js:11:18) at Object.<anonymous> (D:\member\member\build\vue-loader.conf.js:4:19) at Module._compile (module.js:653:30) at Object.Module._extensions..js (module.js:664:10) at Module.load (module.js:566:32) at tryModuleLoad (module.js:506:12) at Function.Module._load (module.js:498:3) npm ERR! code ELIFECYCLE npm ERR! errno 1 npm ERR! member@1.0.0 dev: `webpack-dev-server --inline --progress --config build/webpack.dev.conf.js` npm ERR! Exit status 1 npm ERR! npm ERR! Failed at the member@1.0.0 dev script. npm ERR! This is probably not a problem with npm. There is likely additional logging output above. npm ERR! A complete log of this run can be found in: npm ERR! C:\Users\DELL\AppData\Roaming\npm-cache\_logs\2018-11-24T03_14_53_401Z-debug.log Process finished with exit code 1
npm run dev 报错求助啊
C:\Users\lyx\Desktop\eyed\frontend>npm run dev > eyed@1.0.0 dev C:\Users\lyx\Desktop\eyed\frontend > node build/dev-server.js module.js:471 throw err; ^ Error: Cannot find module 'semver' at Function.Module._resolveFilename (module.js:469:15) at Function.Module._load (module.js:417:25) at Module.require (module.js:497:17) at require (internal/module.js:20:19) at Object.<anonymous> (C:\Users\lyx\Desktop\eyed\frontend\build\check-versions.js:1:76) at Module._compile (module.js:570:32) at Object.Module._extensions..js (module.js:579:10) at Module.load (module.js:487:32) at tryModuleLoad (module.js:446:12) at Function.Module._load (module.js:438:3) npm ERR! Windows_NT 10.0.14393 npm ERR! argv "C:\\Program Files\\nodejs\\node.exe" "C:\\Program Files\\nodejs\\node_modules\\npm\\bin\\npm-cli.js" "run" "dev" npm ERR! node v6.10.1 npm ERR! npm v3.10.10 npm ERR! code ELIFECYCLE npm ERR! eyed@1.0.0 dev: `node build/dev-server.js` npm ERR! Exit status 1 npm ERR! npm ERR! Failed at the eyed@1.0.0 dev script 'node build/dev-server.js'. npm ERR! Make sure you have the latest version of node.js and npm installed. npm ERR! If you do, this is most likely a problem with the eyed package, npm ERR! not with npm itself. npm ERR! Tell the author that this fails on your system: npm ERR! node build/dev-server.js npm ERR! You can get information on how to open an issue for this project with: npm ERR! npm bugs eyed npm ERR! Or if that isn't available, you can get their info via: npm ERR! npm owner ls eyed npm ERR! There is likely additional logging output above. npm ERR! Please include the following file with any support request: npm ERR! C:\Users\lyx\Desktop\eyed\frontend\npm-debug.log C:\Users\lyx\Desktop\eyed\frontend>
使用npm 执行package.json 里面的脚本报错,但是 脚本单独拿出来执行不报错
# package.json { "name": "fe", "version": "1.0.0", "description": "前端代码", "main": "index.js", "scripts": { "test": "echo \"Error: no test specified\" && exit 1", "dev" : "WEBPACK_ENV=dev webpack-dev-server --inline --port 8088" }, "repository": { "type": "git", "url": "git@gitee.com:。。。。。。" }, "author": "tomxfei", "license": "ISC", "devDependencies": { "css-loader": "^0.28.7", "extract-text-webpack-plugin": "^3.0.2", "file-loader": "^1.1.5", "html-loader": "^0.5.1", "html-webpack-plugin": "^2.30.1", "style-loader": "^0.19.0", "url-loader": "^0.6.2", "webpack": "^3.8.1", "webpack-dev-server": "^2.9.4" }, "dependencies": {} } # 执行 npm run dev报如下错误 ```Liuxf@DESKTOP-D3UCHLD MINGW64 /d/fe (fe_v1.0) $ npm run dev > fe@1.0.0 dev D:\fe > WEBPACK_ENV=dev webpack-dev-server --inline --port 8088 'WEBPACK_ENV' ▒▒▒▒▒ڲ▒▒▒▒ⲿ▒▒▒Ҳ▒▒▒ǿ▒▒▒▒еij▒▒▒ ▒▒▒▒▒▒▒▒▒ļ▒▒▒ npm ERR! code ELIFECYCLE npm ERR! errno 1 npm ERR! fe@1.0.0 dev: `WEBPACK_ENV=dev webpack-dev-server --inline --port 8088` npm ERR! Exit status 1 npm ERR! npm ERR! Failed at the fe@1.0.0 dev script. npm ERR! This is probably not a problem with npm. There is likely additional logging output above. npm ERR! A complete log of this run can be found in: npm ERR! C:\Users\75056\AppData\Roaming\npm-cache\_logs\2017-11-25T12_16_13_958Z-debug.log # 直接执行 WEBPACK_ENV=dev webpack-dev-server --inline --port 8088` 没有问题``` ``` ```
gulp . watch出现的问题
<--- JS stacktrace ---> Cannot get stack trace in GC. FATAL ERROR: MarkCompactCollector: semi-space copy, fallback in old gen Allocation failed - JavaScript heap out of memory sh: line 1: 35606 Abort trap: 6 NODE_ENV=localWillclass supervisor -i ./public,./build ./bin/twww npm ERR! Darwin 16.4.0 npm ERR! argv "/usr/local/bin/node" "/usr/local/bin/npm" "run" "localWillclass" npm ERR! node v6.1.0 npm ERR! npm v3.8.6 npm ERR! code ELIFECYCLE npm ERR! willclass@4.2.20170901 localWillclass: `NODE_ENV=localWillclass supervisor -i ./public,./build ./bin/twww && gulp deploy --silent` npm ERR! Exit status 134 npm ERR! npm ERR! Failed at the willclass@4.2.20170901 localWillclass script 'NODE_ENV=localWillclass supervisor -i ./public,./build ./bin/twww && gulp deploy --silent'. npm ERR! Make sure you have the latest version of node.js and npm installed. npm ERR! If you do, this is most likely a problem with the willclass package, npm ERR! not with npm itself. npm ERR! Tell the author that this fails on your system: npm ERR! NODE_ENV=localWillclass supervisor -i ./public,./build ./bin/twww && gulp deploy --silent npm ERR! You can get information on how to open an issue for this project with: npm ERR! npm bugs willclass npm ERR! Or if that isn't available, you can get their info via: npm ERR! npm owner ls willclass npm ERR! There is likely additional logging output above. npm ERR! Please include the following file with any support request: npm ERR! /Users/shuai/huitong/willclass/npm-debug.log
webpack build报错 ERROR in 1.ea409344b3c6c7fd1ccf.chunk.js from UglifyJs
项目可以正常运行,突然打包报错,有没有大神指点一下 ``` ERROR in 1.ea409344b3c6c7fd1ccf.chunk.js from UglifyJs Unexpected token: operator (>) [1.ea409344b3c6c7fd1ccf.chunk.js:4739,34] Child html-webpack-plugin for "..\index.html": 1 asset Child extract-text-webpack-plugin node_modules/_extract-text-webpack-plugin@3.0.2@extract-text-webpack-plugin/dist node_modules/_css-loader@0.28.11@css-loader/index.js?minimize!node_modules/_autoprefixer-loader@3.2.0@autoprefixer-loader/index.js!node_modules/_iview@3.3.3@iview/dist/styles/iview.css: 3 assets Child extract-text-webpack-plugin node_modules/_extract-text-webpack-plugin@3.0.2@extract-text-webpack-plugin/dist node_modules/_css-loader@0.28.11@css-loader/index.js?minimize!node_modules/_autoprefixer-loader@3.2.0@autoprefixer-loader/index.js!node_modules/_less-loader@4.1.0@less-loader/dist/cjs.js!src/styles/my-theme.less: Asset Size Chunks Chunk Names d535a25a79fb1365ae814b61e88fae71.ttf 198 kB [emitted] 99ac3308dd8ee14f749f51538d0d5b9e.woff 198 kB [emitted] a2c4a261a239aa84463dc70e4bac9b9a.svg 555 kB [emitted] [big] npm ERR! code ELIFECYCLE npm ERR! errno 2 npm ERR! smart-lock@1.2.3 build: `webpack --progress --hide-modules --config build/webpack.prod.config.js` npm ERR! Exit status 2 npm ERR! npm ERR! Failed at the smart-lock@1.2.3 build script. npm ERR! This is probably not a problem with npm. There is likely additional logging output above. ```
npm run dev啟動項目時報錯 `webpack-dev-server --inline --progress --config build/webpack.dev.conf.js`
uotation@1.0.0 dev: `webpack-dev-server --inline --progress --config build/webpack.dev.conf.js` npm ERR! Exit status 1 npm ERR! npm ERR! Failed at the quotation@1.0.0 dev script. npm ERR! This is probably not a problem with npm. There is likely additional logging output above. ``` //webpack.dev.conf.js 'use strict' const utils = require('./utils') const webpack = require('webpack') const config = require('../config') const merge = require('webpack-merge') const path = require('path') const baseWebpackConfig = require('./webpack.base.conf') const CopyWebpackPlugin = require('copy-webpack-plugin') const HtmlWebpackPlugin = require('html-webpack-plugin') const FriendlyErrorsPlugin = require('friendly-errors-webpack-plugin') const portfinder = require('portfinder') const HOST = process.env.HOST const PORT = process.env.PORT && Number(process.env.PORT) const devWebpackConfig = merge(baseWebpackConfig, { module: { rules: utils.styleLoaders({ sourceMap: config.dev.cssSourceMap, usePostCSS: true }) }, // cheap-module-eval-source-map is faster for development devtool: config.dev.devtool, // these devServer options should be customized in /config/index.js devServer: { clientLogLevel: 'warning', historyApiFallback: { rewrites: [ { from: /.*/, to: path.posix.join(config.dev.assetsPublicPath, 'index.html') }, ], }, hot: true, contentBase: false, // since we use CopyWebpackPlugin. compress: true, host: HOST || config.dev.host, port: PORT || config.dev.port, open: config.dev.autoOpenBrowser, overlay: config.dev.errorOverlay ? { warnings: false, errors: true } : false, publicPath: config.dev.assetsPublicPath, proxy: config.dev.proxyTable, quiet: true, // necessary for FriendlyErrorsPlugin watchOptions: { poll: config.dev.poll, } }, plugins: [ new webpack.DefinePlugin({ 'process.env': require('../config/dev.env') }), new webpack.HotModuleReplacementPlugin(), new webpack.NamedModulesPlugin(), // HMR shows correct file names in console on update. new webpack.NoEmitOnErrorsPlugin(), // https://github.com/ampedandwired/html-webpack-plugin new HtmlWebpackPlugin({ filename: 'index.html', template: 'index.html', inject: true }), // copy custom static assets new CopyWebpackPlugin([ { from: path.resolve(__dirname, '../static'), to: config.dev.assetsSubDirectory, ignore: ['.*'] } ]) ] }) module.exports = new Promise((resolve, reject) => { portfinder.basePort = process.env.PORT || config.dev.port portfinder.getPort((err, port) => { if (err) { reject(err) } else { // publish the new Port, necessary for e2e tests process.env.PORT = port // add port to devServer config devWebpackConfig.devServer.port = port // Add FriendlyErrorsPlugin devWebpackConfig.plugins.push(new FriendlyErrorsPlugin({ compilationSuccessInfo: { messages: [`Your application is running here: http://${devWebpackConfig.devServer.host}:${port}`], }, onErrors: config.dev.notifyOnErrors ? utils.createNotifierCallback() : undefined })) resolve(devWebpackConfig) } }) }) ``` ``` //webpack.base.conf.js 'use strict' const path = require('path') const utils = require('./utils') const config = require('../config') const vueLoaderConfig = require('./vue-loader.conf') function resolve (dir) { return path.join(__dirname, '..', dir) } module.exports = { context: path.resolve(__dirname, '../'), entry: { app: './src/main.js' }, output: { path: config.build.assetsRoot, filename: '[name].js', publicPath: process.env.NODE_ENV === 'production' ? config.build.assetsPublicPath : config.dev.assetsPublicPath }, resolve: { extensions: ['.js', '.vue', '.json'], alias: { 'vue$': 'vue/dist/vue.esm.js', '@': resolve('src'), } }, module: { rules: [ { test: /\.vue$/, loader: 'vue-loader', options: vueLoaderConfig }, { test: /\.js$/, loader: 'babel-loader', include: [resolve('src'), resolve('test'), resolve('node_modules/webpack-dev-server/client')] }, { test: /\.(png|jpe?g|gif|svg)(\?.*)?$/, loader: 'url-loader', options: { limit: 10000, name: utils.assetsPath('img/[name].[hash:7].[ext]') } }, { test: /\.(mp4|webm|ogg|mp3|wav|flac|aac)(\?.*)?$/, loader: 'url-loader', options: { limit: 10000, name: utils.assetsPath('media/[name].[hash:7].[ext]') } }, { test: /\.(woff2?|eot|ttf|otf)(\?.*)?$/, loader: 'url-loader', options: { limit: 10000, name: utils.assetsPath('fonts/[name].[hash:7].[ext]') } } ] }, node: { // prevent webpack from injecting useless setImmediate polyfill because Vue // source contains it (although only uses it if it's native). setImmediate: false, // prevent webpack from injecting mocks to Node native modules // that does not make sense for the client dgram: 'empty', fs: 'empty', net: 'empty', tls: 'empty', child_process: 'empty' } } ```
windows下运行npm run dev报错,查了很多资料,哪位大神指点下,感激~
0 info it worked if it ends with ok 1 verbose cli [ 'D:\\nodejs\\node.exe', 1 verbose cli 'D:\\nodejs\\node_global\\node_modules\\npm\\bin\\npm-cli.js', 1 verbose cli 'run', 1 verbose cli 'dev' ] 2 info using npm@5.0.0 3 info using node@v8.4.0 4 verbose run-script [ 'predev', 'dev', 'postdev' ] 5 info lifecycle vue_elmentui@1.0.0~predev: vue_elmentui@1.0.0 6 silly lifecycle vue_elmentui@1.0.0~predev: no script for predev, continuing 7 info lifecycle vue_elmentui@1.0.0~dev: vue_elmentui@1.0.0 8 verbose lifecycle vue_elmentui@1.0.0~dev: unsafe-perm in lifecycle true 9 verbose lifecycle vue_elmentui@1.0.0~dev: PATH: D:\nodejs\node_global\node_modules\npm\bin\node-gyp-bin;D:\vueElmentUI\node_modules\.bin;D:\cmder\bin;D:\cmder\vendor\git-for-windows\cmd;D:\cmder\vendor\conemu-maximus5\ConEmu\Scripts;D:\cmder\vendor\conemu-maximus5;D:\cmder\vendor\conemu-maximus5\ConEmu;C:\ProgramData\Oracle\Java\javapath;C:\Windows\system32;C:\Windows;C:\Windows\System32\Wbem;C:\Windows\System32\WindowsPowerShell\v1.0\;C:\Program Files (x86)\ATI Technologies\ATI.ACE\Core-Static;D:\svn\bin;C:\Program Files (x86)\Microsoft ASP.NET\ASP.NET Web Pages\v1.0\;C:\Program Files (x86)\Windows Kits\8.0\Windows Performance Toolkit\;C:\Program Files\Microsoft SQL Server\110\Tools\Binn\;C:\Program Files\Microsoft\Web Platform Installer\;C:\Program Files\Intel\WiFi\bin\;C:\Program Files\Common Files\Intel\WirelessCommon\;D:\Git\cmd;D:\java\bin;D:\MongoDB\bin;D:\MongoDB\bin;D:\nodejs\node_global;D:\cmder;D:\nodejs\node_global;D:\nodejs\;C:\Program Files\Intel\WiFi\bin\;C:\Program Files\Common Files\Intel\WirelessCommon\;C:\Users\xw\AppData\Roaming\npm;D:\cmder\vendor\git-for-windows\usr\bin;D:\cmder\vendor\git-for-windows\usr\share\vim\vim74;D:\cmder\ 10 verbose lifecycle vue_elmentui@1.0.0~dev: CWD: D:\vueElmentUI 11 silly lifecycle vue_elmentui@1.0.0~dev: Args: [ '/d /s /c', 'node build/dev-server.js' ] 12 info lifecycle vue_elmentui@1.0.0~dev: Failed to exec dev script 13 verbose stack Error: vue_elmentui@1.0.0 dev: `node build/dev-server.js` 13 verbose stack spawn ;d:\Git\cmd ENOENT 13 verbose stack at _errnoException (util.js:1041:11) 13 verbose stack at Process.ChildProcess._handle.onexit (internal/child_process.js:192:19) 13 verbose stack at onErrorNT (internal/child_process.js:374:16) 13 verbose stack at _combinedTickCallback (internal/process/next_tick.js:138:11) 13 verbose stack at process._tickCallback (internal/process/next_tick.js:180:9) 14 verbose pkgid vue_elmentui@1.0.0 15 verbose cwd D:\vueElmentUI 16 verbose Windows_NT 6.1.7601 17 verbose argv "D:\\nodejs\\node.exe" "D:\\nodejs\\node_global\\node_modules\\npm\\bin\\npm-cli.js" "run" "dev" 18 verbose node v8.4.0 19 verbose npm v5.0.0 20 error file ;d:\Git\cmd 21 error path ;d:\Git\cmd 22 error code ELIFECYCLE 23 error errno ENOENT 24 error syscall spawn ;d:\Git\cmd 25 error vue_elmentui@1.0.0 dev: `node build/dev-server.js` 25 error spawn ;d:\Git\cmd ENOENT 26 error Failed at the vue_elmentui@1.0.0 dev script. 26 error This is probably not a problem with npm. There is likely additional logging output above. 27 verbose exit [ 1, true ]
Rap2页面运行失败,Rap2-dolores本地运行报错了
npm run dev运行rap2-dolores,访问页面出现以下错误: ``` Wrote 38 CSS files to D:\WorkSpace\Rap2\rap2-dolores\build\ Starting the development server... Failed to compile. ./src/components/organization/OrganizationRepositoryList.tsx Module not found: Can't resolve '../repository/Repository.css' in 'D:\WorkSpace\Rap2\rap2-dolores\src\components\organization' ``` npm install 没报错,npm build也会报错,下面是npm build的日志文件: ``` 0 info it worked if it ends with ok 1 verbose cli [ 'C:\\Program Files\\nodejs\\node.exe', 1 verbose cli 'C:\\Program Files\\nodejs\\node_modules\\npm\\bin\\npm-cli.js', 1 verbose cli 'run', 1 verbose cli 'build' ] 2 info using npm@6.4.1 3 info using node@v10.15.3 4 verbose run-script [ 'prebuild', 'build', 'postbuild' ] 5 info lifecycle rap2-dolores@1.0.0~prebuild: rap2-dolores@1.0.0 6 info lifecycle rap2-dolores@1.0.0~build: rap2-dolores@1.0.0 7 verbose lifecycle rap2-dolores@1.0.0~build: unsafe-perm in lifecycle true 8 verbose lifecycle rap2-dolores@1.0.0~build: PATH: C:\Program Files\nodejs\node_modules\npm\node_modules\npm-lifecycle\node-gyp-bin;D:\WorkSpace\Rap2\rap2-dolores\node_modules\.bin;D:\WorkSpace\Rap2\rap2-dolores\node_modules\.bin;D:\Matlab\bin;D:\Matlab\bin\win64;C:\Program Files (x86)\Intel\Intel(R) Management Engine Components\iCLS\;C:\Program Files\Intel\Intel(R) Management Engine Components\iCLS\;C:\WINDOWS\system32;C:\WINDOWS;C:\WINDOWS\System32\Wbem;C:\WINDOWS\System32\WindowsPowerShell\v1.0\;C:\Program Files (x86)\Intel\Intel(R) Management Engine Components\DAL;C:\Program Files\Intel\Intel(R) Management Engine Components\DAL;C:\Program Files (x86)\Intel\Intel(R) Management Engine Components\IPT;C:\Program Files\Intel\Intel(R) Management Engine Components\IPT;C:\WINDOWS\System32\OpenSSH\;C:\Java\jdk1.8.0_91\bin;C:\Program Files\TortoiseGit\bin;C:\Program Files\nodejs\;D:\Matlab\bin\win64;D:\matlab\runtime\win64;D:\matlab\bin;D:\oKit\apache\bin\;C:\Users\admin\AppData\Local\Microsoft\WindowsApps;C:\Users\admin\AppData\Roaming\npm 9 verbose lifecycle rap2-dolores@1.0.0~build: CWD: D:\WorkSpace\Rap2\rap2-dolores 10 silly lifecycle rap2-dolores@1.0.0~build: Args: [ '/d /s /c', 10 silly lifecycle 'npm run lint && npm run build-css && react-scripts build' ] 11 silly lifecycle rap2-dolores@1.0.0~build: Returned: code: 1 signal: null 12 info lifecycle rap2-dolores@1.0.0~build: Failed to exec build script 13 verbose stack Error: rap2-dolores@1.0.0 build: `npm run lint && npm run build-css && react-scripts build` 13 verbose stack Exit status 1 13 verbose stack at EventEmitter.<anonymous> (C:\Program Files\nodejs\node_modules\npm\node_modules\npm-lifecycle\index.js:301:16) 13 verbose stack at EventEmitter.emit (events.js:189:13) 13 verbose stack at ChildProcess.<anonymous> (C:\Program Files\nodejs\node_modules\npm\node_modules\npm-lifecycle\lib\spawn.js:55:14) 13 verbose stack at ChildProcess.emit (events.js:189:13) 13 verbose stack at maybeClose (internal/child_process.js:970:16) 13 verbose stack at Process.ChildProcess._handle.onexit (internal/child_process.js:259:5) 14 verbose pkgid rap2-dolores@1.0.0 15 verbose cwd D:\WorkSpace\Rap2\rap2-dolores 16 verbose Windows_NT 10.0.17134 17 verbose argv "C:\\Program Files\\nodejs\\node.exe" "C:\\Program Files\\nodejs\\node_modules\\npm\\bin\\npm-cli.js" "run" "build" 18 verbose node v10.15.3 19 verbose npm v6.4.1 20 error code ELIFECYCLE 21 error errno 1 22 error rap2-dolores@1.0.0 build: `npm run lint && npm run build-css && react-scripts build` 22 error Exit status 1 23 error Failed at the rap2-dolores@1.0.0 build script. 23 error This is probably not a problem with npm. There is likely additional logging output above. 24 verbose exit [ 1, true ] ```
大学四年自学走来,这些私藏的实用工具/学习网站我贡献出来了
大学四年,看课本是不可能一直看课本的了,对于学习,特别是自学,善于搜索网上的一些资源来辅助,还是非常有必要的,下面我就把这几年私藏的各种资源,网站贡献出来给你们。主要有:电子书搜索、实用工具、在线视频学习网站、非视频学习网站、软件下载、面试/求职必备网站。 注意:文中提到的所有资源,文末我都给你整理好了,你们只管拿去,如果觉得不错,转发、分享就是最大的支持了。 一、电子书搜索 对于大部分程序员...
【JSON解析】浅谈JSONObject的使用
简介 在程序开发过程中,在参数传递,函数返回值等方面,越来越多的使用JSON。JSON(JavaScript Object Notation)是一种轻量级的数据交换格式,同时也易于机器解析和生成、易于理解、阅读和撰写,而且Json采用完全独立于语言的文本格式,这使得Json成为理想的数据交换语言。 JSON建构于两种结构: “名称/值”对的集合(A Collection of name/va...
《MySQL 性能优化》之理解 MySQL 体系结构
本文介绍 MySQL 的体系结构,包括物理结构、逻辑结构以及插件式存储引擎。
程序员请照顾好自己,周末病魔差点一套带走我。
程序员在一个周末的时间,得了重病,差点当场去世,还好及时挽救回来了。
卸载 x 雷某度!GitHub 标星 1.5w+,从此我只用这款全能高速下载工具!
作者 | Rocky0429 来源 | Python空间 大家好,我是 Rocky0429,一个喜欢在网上收集各种资源的蒟蒻… 网上资源眼花缭乱,下载的方式也同样千奇百怪,比如 BT 下载,磁力链接,网盘资源等等等等,下个资源可真不容易,不一样的方式要用不同的下载软件,因此某比较有名的 x 雷和某度网盘成了我经常使用的工具。 作为一个没有钱的穷鬼,某度网盘几十 kb 的下载速度让我...
只因接了一个电话,程序员被骗 30 万!
今天想给大家说一个刚刚发生在我身边的一起真实的诈骗经历,我的朋友因此被骗走30万。注:为了保护当事人隐私,部分情节进行了修改。1平安夜突来的电话开始以为就像普通的诈骗一样,想办法让你把钱...
我一个37岁的程序员朋友
周末了,人一旦没有点事情干,心里就瞎想,而且跟几个老男人坐在一起,更容易瞎想,我自己现在也是 30 岁了,也是无时无刻在担心自己的职业生涯,担心丢掉工作没有收入,担心身体机能下降,担心突...
python自动下载图片
近日闲来无事,总有一种无形的力量萦绕在朕身边,让朕精神涣散,昏昏欲睡。 可是,像朕这么有职业操守的社畜怎么能在上班期间睡瞌睡呢,我不禁陷入了沉思。。。。 突然旁边的IOS同事问:‘嘿,兄弟,我发现一个网站的图片很有意思啊,能不能帮我保存下来提升我的开发灵感?’ 作为一个坚强的社畜怎么能说自己不行呢,当时朕就不假思索的答应:‘oh, It’s simple. Wait for me for a ...
一名大专同学的四个问题
【前言】   收到一封来信,赶上各种事情拖了几日,利用今天要放下工作的时机,做个回复。   2020年到了,就以这一封信,作为开年标志吧。 【正文】   您好,我是一名现在有很多困惑的大二学生。有一些问题想要向您请教。   先说一下我的基本情况,高考失利,不想复读,来到广州一所大专读计算机应用技术专业。学校是偏艺术类的,计算机专业没有实验室更不用说工作室了。而且学校的学风也不好。但我很想在计算机领...
复习一周,京东+百度一面,不小心都拿了Offer
京东和百度一面都问了啥,面试官百般刁难,可惜我全会。
Java 14 都快来了,为什么还有这么多人固守Java 8?
从Java 9开始,Java版本的发布就让人眼花缭乱了。每隔6个月,都会冒出一个新版本出来,Java 10 , Java 11, Java 12, Java 13, 到2020年3月份,...
达摩院十大科技趋势发布:2020 非同小可!
【CSDN编者按】1月2日,阿里巴巴发布《达摩院2020十大科技趋势》,十大科技趋势分别是:人工智能从感知智能向认知智能演进;计算存储一体化突破AI算力瓶颈;工业互联网的超融合;机器间大规模协作成为可能;模块化降低芯片设计门槛;规模化生产级区块链应用将走入大众;量子计算进入攻坚期;新材料推动半导体器件革新;保护数据隐私的AI技术将加速落地;云成为IT技术创新的中心 。 新的画卷,正在徐徐展开。...
轻松搭建基于 SpringBoot + Vue 的 Web 商城应用
首先介绍下在本文出现的几个比较重要的概念: 函数计算(Function Compute): 函数计算是一个事件驱动的服务,通过函数计算,用户无需管理服务器等运行情况,只需编写代码并上传。函数计算准备计算资源,并以弹性伸缩的方式运行用户代码,而用户只需根据实际代码运行所消耗的资源进行付费。Fun: Fun 是一个用于支持 Serverless 应用部署的工具,能帮助您便捷地管理函数计算、API ...
Python+OpenCV实时图像处理
目录 1、导入库文件 2、设计GUI 3、调用摄像头 4、实时图像处理 4.1、阈值二值化 4.2、边缘检测 4.3、轮廓检测 4.4、高斯滤波 4.5、色彩转换 4.6、调节对比度 5、退出系统 初学OpenCV图像处理的小伙伴肯定对什么高斯函数、滤波处理、阈值二值化等特性非常头疼,这里给各位分享一个小项目,可通过摄像头实时动态查看各类图像处理的特点,也可对各位调参、测试...
2020年一线城市程序员工资大调查
人才需求 一线城市共发布岗位38115个,招聘120827人。 其中 beijing 22805 guangzhou 25081 shanghai 39614 shenzhen 33327 工资分布 2020年中国一线城市程序员的平均工资为16285元,工资中位数为14583元,其中95%的人的工资位于5000到20000元之间。 和往年数据比较: yea...
为什么猝死的都是程序员,基本上不见产品经理猝死呢?
相信大家时不时听到程序员猝死的消息,但是基本上听不到产品经理猝死的消息,这是为什么呢? 我们先百度搜一下:程序员猝死,出现将近700多万条搜索结果: 搜索一下:产品经理猝死,只有400万条的搜索结果,从搜索结果数量上来看,程序员猝死的搜索结果就比产品经理猝死的搜索结果高了一倍,而且从下图可以看到,首页里面的五条搜索结果,其实只有两条才是符合条件。 所以程序员猝死的概率真的比产品经理大,并不是错...
害怕面试被问HashMap?这一篇就搞定了!
声明:本文以jdk1.8为主! 搞定HashMap 作为一个Java从业者,面试的时候肯定会被问到过HashMap,因为对于HashMap来说,可以说是Java集合中的精髓了,如果你觉得自己对它掌握的还不够好,我想今天这篇文章会非常适合你,至少,看了今天这篇文章,以后不怕面试被问HashMap了 其实在我学习HashMap的过程中,我个人觉得HashMap还是挺复杂的,如果真的想把它搞得明明白...
毕业5年,我问遍了身边的大佬,总结了他们的学习方法
我问了身边10个大佬,总结了他们的学习方法,原来成功都是有迹可循的。
推荐10个堪称神器的学习网站
每天都会收到很多读者的私信,问我:“二哥,有什么推荐的学习网站吗?最近很浮躁,手头的一些网站都看烦了,想看看二哥这里有什么新鲜货。” 今天一早做了个恶梦,梦到被老板辞退了。虽然说在我们公司,只有我辞退老板的份,没有老板辞退我这一说,但是还是被吓得 4 点多都起来了。(主要是因为我掌握着公司所有的核心源码,哈哈哈) 既然 4 点多起来,就得好好利用起来。于是我就挑选了 10 个堪称神器的学习网站,推...
这些软件太强了,Windows必装!尤其程序员!
Windows可谓是大多数人的生产力工具,集娱乐办公于一体,虽然在程序员这个群体中都说苹果是信仰,但是大部分不都是从Windows过来的,而且现在依然有很多的程序员用Windows。 所以,今天我就把我私藏的Windows必装的软件分享给大家,如果有一个你没有用过甚至没有听过,那你就赚了????,这可都是提升你幸福感的高效率生产力工具哦! 走起!???? NO、1 ScreenToGif 屏幕,摄像头和白板...
阿里面试,面试官没想到一个ArrayList,我都能跟他扯半小时
我是真的没想到,面试官会这样问我ArrayList。
曾经优秀的人,怎么就突然不优秀了。
职场上有很多辛酸事,很多合伙人出局的故事,很多技术骨干被裁员的故事。说来模板都类似,曾经是名校毕业,曾经是优秀员工,曾经被领导表扬,曾经业绩突出,然而突然有一天,因为种种原因,被裁员了,...
大学四年因为知道了这32个网站,我成了别人眼中的大神!
依稀记得,毕业那天,我们导员发给我毕业证的时候对我说“你可是咱们系的风云人物啊”,哎呀,别提当时多开心啦????,嗯,我们导员是所有导员中最帅的一个,真的???? 不过,导员说的是实话,很多人都叫我大神的,为啥,因为我知道这32个网站啊,你说强不强????,这次是绝对的干货,看好啦,走起来! PS:每个网站都是学计算机混互联网必须知道的,真的牛杯,我就不过多介绍了,大家自行探索,觉得没用的,尽管留言吐槽吧???? 社...
良心推荐,我珍藏的一些Chrome插件
上次搬家的时候,发了一个朋友圈,附带的照片中不小心暴露了自己的 Chrome 浏览器插件之多,于是就有小伙伴评论说分享一下我觉得还不错的浏览器插件。 我下面就把我日常工作和学习中经常用到的一些 Chrome 浏览器插件分享给大家,随便一个都能提高你的“生活品质”和工作效率。 Markdown Here Markdown Here 可以让你更愉快的写邮件,由于支持 Markdown 直接转电子邮...
看完这篇HTTP,跟面试官扯皮就没问题了
我是一名程序员,我的主要编程语言是 Java,我更是一名 Web 开发人员,所以我必须要了解 HTTP,所以本篇文章就来带你从 HTTP 入门到进阶,看完让你有一种恍然大悟、醍醐灌顶的感觉。 最初在有网络之前,我们的电脑都是单机的,单机系统是孤立的,我还记得 05 年前那会儿家里有个电脑,想打电脑游戏还得两个人在一个电脑上玩儿,及其不方便。我就想为什么家里人不让上网,我的同学 xxx 家里有网,每...
史上最全的IDEA快捷键总结
现在Idea成了主流开发工具,这篇博客对其使用的快捷键做了总结,希望对大家的开发工作有所帮助。
阿里程序员写了一个新手都写不出的低级bug,被骂惨了。
这种新手都不会范的错,居然被一个工作好几年的小伙子写出来,差点被当场开除了。
谁是华为扫地僧?
是的,华为也有扫地僧!2020年2月11-12日,“养在深闺人不知”的华为2012实验室扫地僧们,将在华为开发者大会2020(Cloud)上,和大家见面。到时,你可以和扫地僧们,吃一个洋...
Idea 中最常用的10款插件(提高开发效率),一定要学会使用!
学习使用一些插件,可以提高开发效率。对于我们开发人员很有帮助。这篇博客介绍了开发中使用的插件。
AI 没让人类失业,搞 AI 的人先失业了
最近和几个 AI 领域的大佬闲聊 根据他们讲的消息和段子 改编出下面这个故事 如有雷同 都是巧合 1. 老王创业失败,被限制高消费 “这里写我跑路的消息实在太夸张了。” 王葱葱哼笑一下,把消息分享给群里。 阿杰也看了消息,笑了笑。在座几位也都笑了。 王葱葱是个有名的人物,21岁那年以全额奖学金进入 KMU 攻读人工智能博士,累计发表论文 40 余篇,个人技术博客更是成为深度学习领域内风向标。 ...
立即提问