误删了glibc,centos下报错-bash: /bin/ls: /lib64/ld-linux-x86-64.so.2: bad ELF interpreter: No such file or directory 5C

因为操作不当误删了glibc库,然后任何命令都报错-bash: /bin/ls: /lib64/ld-linux-x86-64.so.2: bad ELF interpreter: No such file or directory;进入了救援模式,挂载镜像的时候又报错unknown filesystem type ios9660;然后要怎么样才能恢复系统呢

wxt_hillwill
wxt_hillwill 已解决
5 个月之前 回复

1个回答

Csdn user default icon
上传中...
上传图片
插入图片
抄袭、复制答案,以达到刷声望分或其他目的的行为,在CSDN问答是严格禁止的,一经发现立刻封号。是时候展现真正的技术了!
其他相关推荐
arm-linux/bin/ld: cannot find -lopencv_imgproc
用qte编译一个opencv程序时,显示如下错误: ligang@ligang-virtual-machine:/work/qtepro/opencv$ make /mysoftware/qte/bin/qmake -unix -o Makefile opencv.pro arm-linux-g++ -Wl,-O1 -Wl,-rpath,/mysoftware/qte/lib -o opencv main.o -L/mysoftware/qte/lib -lopencv_imgproc -lopencv_core -lopencv_highgui -lopencv_ml /usr/local/lib/libopencv_core.so /usr/local/lib/libopencv_highgui.so /usr/local/lib/libopencv_imgproc.so /usr/local/lib/libopencv_ml.so -lQtNetwork -L/mysoftware/tslib/lib -L/mysoftware/qte/lib -lQtCore -lm -lrt -ldl -lpthread /mysoftware/gcc-3.4.5-glibc-2.3.6/bin/../lib/gcc/arm-linux/3.4.5/../../../../arm-linux/bin/ld: skipping incompatible /mysoftware/qte/lib/libopencv_imgproc.so when searching for -lopencv_imgproc /mysoftware/gcc-3.4.5-glibc-2.3.6/bin/../lib/gcc/arm-linux/3.4.5/../../../../arm-linux/bin/ld: skipping incompatible /mysoftware/qte/lib/libopencv_imgproc.so when searching for -lopencv_imgproc /mysoftware/gcc-3.4.5-glibc-2.3.6/bin/../lib/gcc/arm-linux/3.4.5/../../../../arm-linux/bin/ld: cannot find -lopencv_imgproc 配置应该都是正确的,难道是opencv的库没有头文件库吗?还是需要该它的symbollink?
centos7 安装glibc2.23,configure: error: The x86_64 is not supported.
进入python时,导入以下命令出现glibc版本异常 ``` import tensorflow as tf ``` ![图片说明](https://img-ask.csdn.net/upload/201909/11/1568195596_990140.png) 下载对应的glibc版本 ``` ./configure --prefix=/usr/local/glibc-2.2.3 --disable-profile --enable-add-ons --with-headers=/usr/include --with-binutils=/usr/bin ``` 又遇一个坑 ![图片说明](https://img-ask.csdn.net/upload/201909/11/1568195807_735696.png) 也去网上找了一些方法,但问题还是存在! 以下是我找的资料: https://blog.csdn.net/qq_37817129/article/details/89570808 https://blog.csdn.net/f0UiRe/article/details/88736755 https://blog.csdn.net/u013216061/article/details/78813805 http://www.itkeyword.com/doc/2258901672188509x371/how-to-compile-glibc-32bit-on-an-x86-64-machine http://blog.chinaunix.net/uid-26000296-id-5159364.html
ubuntu12.04下 opencv库交叉编译后 动态库找不到
ubuntu上我装了pc 和arm 两个版本的opencv2.4.9 目录分别是/usr/local/opencv2.4.9 和/opt/opencv2.4.9-for-arm pc版本的库文件都在/usr/local/lib下 arm版本库文件在/opt/opencv2.4.9-for-arm/lib下 whereis libopencv___core 的时候,只列出的/usr/local/lib/libopencv_core.so 交叉编译器在/opt/Embedsky/gcc-4.6.2-glibc-2.13-linaro-multilib-2011.12/tq-linaro-toolchain/bin下 我写一个opencv测试程序test.cpp 交叉编译出现警告 ``` # arm-linux-g++ -o test test.cpp -I /opt/opencv2.4.9-for-arm/lib/include -L /opt/opencv2.4.9-for-arm/lib -lopencv_core -lopencv_highgui -lpthread -lrt In file included from /opt/opencv2.4.9-for-arm/lib/include/opencv2/flann/kmeans_index.h:50:0, from /opt/opencv2.4.9-for-arm/lib/include/opencv2/flann/all_indices.h:38, from /opt/opencv2.4.9-for-arm/lib/include/opencv2/flann/flann_base.hpp:44, from /opt/opencv2.4.9-for-arm/lib/include/opencv2/flann/flann.hpp:50, from /opt/opencv2.4.9-for-arm/lib/include/opencv/cv.h:69, from test.cpp:2: /opt/opencv2.4.9-for-arm/lib/include/opencv2/flann/logger.h:73:9: note: the mangling of 'va_list' has changed in GCC 4.4 /opt/Embedsky/gcc-4.6.2-glibc-2.13-linaro-multilib-2011.12/tq-linaro-toolchain/bin/../lib/gcc/arm-fsl-linux-gnueabi/4.6.2/../../../../arm-fsl-linux-gnueabi/bin/ld: warning: ../../lib/libopencv_core.so, needed by /opt/opencv2.4.9-for-arm/lib/libopencv_highgui.so, not found (try using -rpath or -rpath-link) /opt/Embedsky/gcc-4.6.2-glibc-2.13-linaro-multilib-2011.12/tq-linaro-toolchain/bin/../lib/gcc/arm-fsl-linux-gnueabi/4.6.2/../../../../arm-fsl-linux-gnueabi/bin/ld: warning: ../../lib/libopencv_imgproc.so, needed by /opt/opencv2.4.9-for-arm/lib/libopencv_highgui.so, not found (try using -rpath or -rpath-link) root@tsie-All-Series:/home/tsie/nfs/test/opencv_test# whereis libopencv_core libopencv_core: /usr/local/lib/libopencv_core.so ``` 这里面好像用到交叉编译器的ld,找opencv的.so文件看提示是跑到交叉编译器所在文件夹里面的lib去找?? 我也吧opencv的交叉库放到这个文件夹里面,再编译还是同样的问题 然后我尝试加上运行时库路径参数 -Wl,-rpath,/opt/opencv2.4.9-for-arm/lib,再编译,弹出来一样的信息。 然后,就没有然后了。我晕 这究竟谁什么问题啊 求各路大神给点思路
用make进行编译的时候,提示error adding symbols
报错信息: /usr/bin/ld: //usr/local/lib/libceres.a(evaluator.cc.o): undefined reference to symbol 'pthread_rwlock_wrlock@@GLIBC_2.2.5' //lib/x86_64-linux-gnu/libpthread.so.0: error adding symbols: DSO missing from command line collect2: error: ld returned 1 exit status 尝试了网上很多种方法都没有解决,希望得到帮助,谢谢!
RK3328平台android8.1编译报错
-fPIC -no-canonical-prefixes -U_FORTIFY_SOURCE -D_FORTIFY_SOURCE=2 -fstack-protector -D__STDC_FORMAT_MACROS -D__STDC_CONSTANT_MACROS -O2 -g -fno-strict-aliasing --gcc-toolchain=prebuilts/gcc/linux-x86/host/x86_64-linux-glibc2.15-4.8 --sysroot prebuilts/gcc/linux-x86/host/x86_64-linux-glibc2.15-4.8/sysroot -fstack-protector-strong -m64 -DANDROID -fmessage-length=0 -W -Wall -Wno-unused -Winit-self -Wpointer-arith -DNDEBUG -UDEBUG -fdebug-prefix-map=/proc/self/cwd= -D__compiler_offsetof=__builtin_offsetof -Werror=int-conversion -Wno-reserved-id-macro -Wno-format-pedantic -Wno-unused-command-line-argument -fcolor-diagnostics -Wno-expansion-to-defined -fdebug-prefix-map=\$PWD/= -target x86_64-linux-gnu -Bprebuilts/gcc/linux-x86/host/x86_64-linux-glibc2.15-4.8/x86_64-linux/bin -Wsign-promo -Wno-inconsistent-missing-override -Wno-null-dereference -D_LIBCPP_ENABLE_THREAD_SAFETY_ANNOTATIONS -Wno-thread-safety-negative -isystem prebuilts/gcc/linux-x86/host/x86_64-linux-glibc2.15-4.8/x86_64-linux/include/c++/4.8 -isystem prebuilts/gcc/linux-x86/host/x86_64-linux-glibc2.15-4.8/x86_64-linux/include/c++/4.8/backward -isystem prebuilts/gcc/linux-x86/host/x86_64-linux-glibc2.15-4.8/x86_64-linux/include/c++/4.8/x86_64-linux -std=gnu++14 -Wall -Werror -fPIE -D_USING_LIBCXX -DANDROID_STRICT -nostdinc++ -Werror=int-to-pointer-cast -Werror=pointer-to-int-cast -Werror=address-of-temporary -Werror=return-type -MD -MF out/host/linux-x86/obj/EXECUTABLES/validatekeymaps_intermediates/Main.d -o out/host/linux-x86/obj/EXECUTABLES/validatekeymaps_intermediates/Main.o frameworks/base/tools/validatekeymaps/Main.cpp" Traceback (most recent call last): File "prebuilts/clang/host/linux-x86/clang-4053586/bin/clang++", line 4, in <module> import shlex ImportError: No module named shlex [ 0% 29/76723] host C++: conscrypt_ge...nts/src/gen/cpp/generate_constants.cpp FAILED: out/host/linux-x86/obj/EXECUTABLES/conscrypt_generate_constants_intermediates/constants/src/gen/cpp/generate_constants.o /bin/bash -c "PWD=/proc/self/cwd prebuilts/clang/host/linux-x86/clang-4053586/bin/clang++ -I external/conscrypt -I out/host/linux-x86/obj/EXECUTABLES/conscrypt_generate_constants_intermediates -I out/host/linux-x86/gen/EXECUTABLES/conscrypt_generate_constants_intermediates -I libnativehelper/include_deprecated \$(cat out/host/linux-x86/obj/EXECUTABLES/conscrypt_generate_constants_intermediates/import_includes) -I system/core/include -I system/media/audio/include -I hardware/libhardware/include -I hardware/libhardware_legacy/include -I hardware/ril/include -I libnativehelper/include -I frameworks/native/include -I frameworks/native/opengl/include -I frameworks/av/include -c -fno-exceptions -Wno-multichar -Wa,--noexecstack -fPIC -no-canonical-prefixes -U_FORTIFY_SOURCE -D_FORTIFY_SOURCE=2 -fstack-protector -D__STDC_FORMAT_MACROS -D__STDC_CONSTANT_MACROS -O2 -g -fno-strict-aliasing --gcc-toolchain=prebuilts/gcc/linux-x86/host/x86_64-linux-glibc2.15-4.8 --sysroot prebuilts/gcc/linux-x86/host/x86_64-linux-glibc2.15-4.8/sysroot -fstack-protector-strong -m64 -DANDROID -fmessage-length=0 -W -Wall -Wno-unused -Winit-self -Wpointer-arith -DNDEBUG -UDEBUG -fdebug-prefix-map=/proc/self/cwd= -D__compiler_offsetof=__builtin_offsetof -Werror=int-conversion -Wno-reserved-id-macro -Wno-format-pedantic -Wno-unused-command-line-argument -fcolor-diagnostics -Wno-expansion-to-defined -fdebug-prefix-map=\$PWD/= -target x86_64-linux-gnu -Bprebuilts/gcc/linux-x86/host/x86_64-linux-glibc2.15-4.8/x86_64-linux/bin -Wsign-promo -Wno-inconsistent-missing-override -Wno-null-dereference -D_LIBCPP_ENABLE_THREAD_SAFETY_ANNOTATIONS -Wno-thread-safety-negative -isystem prebuilts/gcc/linux-x86/host/x86_64-linux-glibc2.15-4.8/x86_64-linux/include/c++/4.8 -isystem prebuilts/gcc/linux-x86/host/x86_64-linux-glibc2.15-4.8/x86_64-linux/include/c++/4.8/backward -isystem prebuilts/gcc/linux-x86/host/x86_64-linux-glibc2.15-4.8/x86_64-linux/include/c++/4.8/x86_64-linux -std=gnu++14 -fPIE -D_USING_LIBCXX -nostdinc++ -Werror=int-to-pointer-cast -Werror=pointer-to-int-cast -Werror=address-of-temporary -Werror=return-type -MD -MF out/host/linux-x86/obj/EXECUTABLES/conscrypt_generate_constants_intermediates/constants/src/gen/cpp/generate_constants.d -o out/host/linux-x86/obj/EXECUTABLES/conscrypt_generate_constants_intermediates/constants/src/gen/cpp/generate_constants.o external/conscrypt/constants/src/gen/cpp/generate_constants.cpp" Traceback (most recent call last): File "prebuilts/clang/host/linux-x86/clang-4053586/bin/clang++", line 4, in <module> import shlex ImportError: No module named shlex [ 0% 30/76723] host C++: protoc-gen-j...tools/streaming_proto/string_utils.cpp FAILED: out/host/linux-x86/obj/EXECUTABLES/protoc-gen-javastream_intermediates/string_utils.o /bin/bash -c "PWD=/proc/self/cwd prebuilts/clang/host/linux-x86/clang-4053586/bin/clang++ -I frameworks/base/tools/streaming_proto -I out/host/linux-x86/obj/EXECUTABLES/protoc-gen-javastream_intermediates -I out/host/linux-x86/gen/EXECUTABLES/protoc-gen-javastream_intermediates -I libnativehelper/include_deprecated \$(cat out/host/linux-x86/obj/EXECUTABLES/protoc-gen-javastream_intermediates/import_includes) -I system/core/include -I system/media/audio/include -I hardware/libhardware/include -I hardware/libhardware_legacy/include -I hardware/ril/include -I libnativehelper/include -I frameworks/native/include -I frameworks/native/opengl/include -I frameworks/av/include -c -fno-exceptions -Wno-multichar -Wa,--noexecstack -fPIC -no-canonical-prefixes -U_FORTIFY_SOURCE -D_FORTIFY_SOURCE=2 -fstack-protector -D__STDC_FORMAT_MACROS -D__STDC_CONSTANT_MACROS -O2 -g -fno-strict-aliasing --gcc-toolchain=prebuilts/gcc/linux-x86/host/x86_64-linux-glibc2.15-4.8 --sysroot prebuilts/gcc/linux-x86/host/x86_64-linux-glibc2.15-4.8/sysroot -fstack-protector-strong -m64 -DANDROID -fmessage-length=0 -W -Wall -Wno-unused -Winit-self -Wpointer-arith -DNDEBUG -UDEBUG -fdebug-prefix-map=/proc/self/cwd= -D__compiler_offsetof=__builtin_offsetof -Werror=int-conversion -Wno-reserved-id-macro -Wno-format-pedantic -Wno-unused-command-line-argument -fcolor-diagnostics -Wno-expansion-to-defined -fdebug-prefix-map=\$PWD/= -target x86_64-linux-gnu -Bprebuilts/gcc/linux-x86/host/x86_64-linux-glibc2.15-4.8/x86_64-linux/bin -Wsign-promo -Wno-inconsistent-missing-override -Wno-null-dereference -D_LIBCPP_ENABLE_THREAD_SAFETY_ANNOTATIONS -Wno-thread-safety-negative -isystem prebuilts/gcc/linux-x86/host/x86_64-linux-glibc2.15-4.8/x86_64-linux/include/c++/4.8 -isystem prebuilts/gcc/linux-x86/host/x86_64-linux-glibc2.15-4.8/x86_64-linux/include/c++/4.8/backward -isystem prebuilts/gcc/linux-x86/host/x86_64-linux-glibc2.15-4.8/x86_64-linux/include/c++/4.8/x86_64-linux -std=gnu++14 -fPIE -D_USING_LIBCXX -DANDROID_STRICT -nostdinc++ -Werror=int-to-pointer-cast -Werror=pointer-to-int-cast -Werror=address-of-temporary -Werror=return-type -MD -MF out/host/linux-x86/obj/EXECUTABLES/protoc-gen-javastream_intermediates/string_utils.d -o out/host/linux-x86/obj/EXECUTABLES/protoc-gen-javastream_intermediates/string_utils.o frameworks/base/tools/streaming_proto/string_utils.cpp" Traceback (most recent call last): File "prebuilts/clang/host/linux-x86/clang-4053586/bin/clang++", line 4, in <module> import shlex ImportError: No module named shlex [ 0% 49/76723] build out/target/common/obj/all-event-log-tags.txt ninja: build stopped: subcommand failed. 17:38:37 ninja failed with: exit status 1 make: *** [run_soong_ui] Error 1 jda@jda-ubut12-ser:rk3328_8.1_box_190306$
升级glibc2.14失败,如何解决?
在CentOS 6环境下升级Android SDK的platform-tools版本到最新的23时,报/lib64/libc.so.6: version `GLIBC_2.14' not found错误,升级glibc2.14出现glibc-2.14/etc/ld.so.conf: No such file or directory错误,使用命令touch /glibc-2.14/etc/ld.so.conf不再报错,但查看glibc安装版本还是不对,系统的glibc版本始终是glibc-2.12,也就是依然没有安装进去,使用export LD_LIBRARY_PATH=/opt/glibc-2.14/lib:$LD_LIBRARY_PATH修改过临时变量,都不能解决,请问如何成功安装glibc?谢谢!备注:glibc的版本我用的是glibc-2.14.tar.xz这个压缩包。
linux设置的环境变量无效
我是rhel6.2系统,执行某程序时提示: /lib64/libc.so.6: version `GLIBC_2.14' not found 于是安装glibc-2.14,安装位置在/opt/glibc-2.14,安装完了以后增加临时环境变量: export LD_LIBRARY_PATH=/opt/glibc-2.14/lib,glibc-1.14,这样就ok了。 但环境临时环境变量重启就会失效,于是我在/etc/profile末尾增加了这样一行 export PATH="/opt/glibc-2.14/lib:$PATH 但这样行不管用,重启后仍然会报错: /lib64/libc.so.6: version `GLIBC_2.14' not found , 只能通过设置临时环境变量的方法让其不报错。很困惑
linux升级glibc2.11报错
linux升级glibc2.11报错,部分报错信息如下: gcc ../sysdeps/x86_64/dl-trampoline.S -c -I../include -I/usr/glibc/glibc-2.11.1/glibc-build/elf -I/usr/glibc/glibc-2.11.1/glibc-build -I../sysdeps/x86_64/elf -I../nptl/sysdeps/unix/sysv/linux/x86_64 -I../sysdeps/unix/sysv/linux/x86_64 -I../sysdeps/unix/sysv/linux/wordsize-64 -I../nptl/sysdeps/unix/sysv/linux -I../nptl/sysdeps/pthread -I../sysdeps/pthread -I../ports/sysdeps/unix/sysv/linux -I../sysdeps/unix/sysv/linux -I../sysdeps/gnu -I../sysdeps/unix/common -I../sysdeps/unix/mman -I../sysdeps/unix/inet -I../nptl/sysdeps/unix/sysv -I../ports/sysdeps/unix/sysv -I../sysdeps/unix/sysv -I../sysdeps/unix/x86_64 -I../nptl/sysdeps/unix -I../ports/sysdeps/unix -I../sysdeps/unix -I../sysdeps/posix -I../sysdeps/x86_64/fpu -I../nptl/sysdeps/x86_64 -I../sysdeps/x86_64 -I../sysdeps/wordsize-64 -I../sysdeps/ieee754/ldbl-96 -I../sysdeps/ieee754/dbl-64 -I../sysdeps/ieee754/flt-32 -I../sysdeps/ieee754 -I../sysdeps/generic/elf -I../sysdeps/generic -I../nptl -I../ports -I.. -I../libio -I. -D_LIBC_REENTRANT -include ../include/libc-symbols.h -DASSEMBLER -g -Wa,--noexecstack -o /usr/glibc/glibc-2.11.1/glibc-build/elf/dl-trampoline.o -MD -MP -MF /usr/glibc/glibc-2.11.1/glibc-build/elf/dl-trampoline.o.dt -MT /usr/glibc/glibc-2.11.1/glibc-build/elf/dl-trampoline.o ../sysdeps/x86_64/dl-trampoline.h: Assembler messages: ../sysdeps/x86_64/dl-trampoline.h:23: Error: no such instruction: `vmovdqu %ymm0,(192)(%rsp)' ../sysdeps/x86_64/dl-trampoline.h:24: Error: no such instruction: `vmovdqu %ymm1,(192+64)(%rsp)' ../sysdeps/x86_64/dl-trampoline.h:25: Error: no such instruction: `vmovdqu %ymm2,(192+64*2)(%rsp)' ../sysdeps/x86_64/dl-trampoline.h:26: Error: no such instruction: `vmovdqu %ymm3,(192+64*3)(%rsp)' ../sysdeps/x86_64/dl-trampoline.h:27: Error: no such instruction: `vmovdqu %ymm4,(192+64*4)(%rsp)' ../sysdeps/x86_64/dl-trampoline.h:28: Error: no such instruction: `vmovdqu %ymm5,(192+64*5)(%rsp)' ../sysdeps/x86_64/dl-trampoline.h:29: Error: no such instruction: `vmovdqu %ymm6,(192+64*6)(%rsp)' ../sysdeps/x86_64/dl-trampoline.h:30: Error: no such instruction: `vmovdqu %ymm7,(192+64*7)(%rsp)' ../sysdeps/x86_64/dl-trampoline.h:34: Error: no such instruction: `vmovdqa %xmm0,(704)(%rsp)' ../sysdeps/x86_64/dl-trampoline.h:35: Error: no such instruction: `vmovdqa %xmm1,(704+16)(%rsp)' ../sysdeps/x86_64/dl-trampoline.h:36: Error: no such instruction: `vmovdqa %xmm2,(704+16*2)(%rsp)' ../sysdeps/x86_64/dl-trampoline.h:37: Error: no such instruction: `vmovdqa %xmm3,(704+16*3)(%rsp)' ../sysdeps/x86_64/dl-trampoline.h:38: Error: no such instruction: `vmovdqa %xmm4,(704+16*4)(%rsp)' ../sysdeps/x86_64/dl-trampoline.h:39: Error: no such instruction: `vmovdqa %xmm5,(704+16*5)(%rsp)' ../sysdeps/x86_64/dl-trampoline.h:40: Error: no such instruction: `vmovdqa %xmm6,(704+16*6)(%rsp)' ../sysdeps/x86_64/dl-trampoline.h:41: Error: no such instruction: `vmovdqa %xmm7,(704+16*7)(%rsp)' ../sysdeps/x86_64/dl-trampoline.h:70: Error: no such instruction: `vpcmpeqq (704)(%rsp),%xmm0,%xmm8' ../sysdeps/x86_64/dl-trampoline.h:71: Error: no such instruction: `vpmovmskb %xmm8,%esi' ../sysdeps/x86_64/dl-trampoline.h:74: Error: no such instruction: `vmovdqa %xmm0,(192)(%rsp)' ../sysdeps/x86_64/dl-trampoline.h:76: Error: no such instruction: `vmovdqu (192)(%rsp),%ymm0' ../sysdeps/x86_64/dl-trampoline.h:77: Error: no such instruction: `vmovdqa %xmm0,(64)(%rsp)' ../sysdeps/x86_64/dl-trampoline.h:79: Error: no such instruction: `vpcmpeqq (704+16)(%rsp),%xmm1,%xmm8' ../sysdeps/x86_64/dl-trampoline.h:80: Error: no such instruction: `vpmovmskb %xmm8,%esi' ../sysdeps/x86_64/dl-trampoline.h:83: Error: no such instruction: `vmovdqa %xmm1,(192+64)(%rsp)' ../sysdeps/x86_64/dl-trampoline.h:85: Error: no such instruction: `vmovdqu (192+64)(%rsp),%ymm1' ../sysdeps/x86_64/dl-trampoline.h:86: Error: no such instruction: `vmovdqa %xmm1,(64+16)(%rsp)' ../sysdeps/x86_64/dl-trampoline.h:88: Error: no such instruction: `vpcmpeqq (704+16*2)(%rsp),%xmm2,%xmm8' ../sysdeps/x86_64/dl-trampoline.h:89: Error: no such instruction: `vpmovmskb %xmm8,%esi' ../sysdeps/x86_64/dl-trampoline.h:92: Error: no such instruction: `vmovdqa %xmm2,(192+64*2)(%rsp)' ../sysdeps/x86_64/dl-trampoline.h:94: Error: no such instruction: `vmovdqu (192+64*2)(%rsp),%ymm2' ../sysdeps/x86_64/dl-trampoline.h:95: Error: no such instruction: `vmovdqa %xmm2,(64+16*2)(%rsp)' ../sysdeps/x86_64/dl-trampoline.h:97: Error: no such instruction: `vpcmpeqq (704+16*3)(%rsp),%xmm3,%xmm8' ../sysdeps/x86_64/dl-trampoline.h:98: Error: no such instruction: `vpmovmskb %xmm8,%esi' ../sysdeps/x86_64/dl-trampoline.h:101: Error: no such instruction: `vmovdqa %xmm3,(192+64*3)(%rsp)' ../sysdeps/x86_64/dl-trampoline.h:103: Error: no such instruction: `vmovdqu (192+64*3)(%rsp),%ymm3' ../sysdeps/x86_64/dl-trampoline.h:104: Error: no such instruction: `vmovdqa %xmm3,(64+16*3)(%rsp)' ../sysdeps/x86_64/dl-trampoline.h:106: Error: no such instruction: `vpcmpeqq (704+16*4)(%rsp),%xmm4,%xmm8' ../sysdeps/x86_64/dl-trampoline.h:107: Error: no such instruction: `vpmovmskb %xmm8,%esi' ../sysdeps/x86_64/dl-trampoline.h:110: Error: no such instruction: `vmovdqa %xmm4,(192+64*4)(%rsp)' ../sysdeps/x86_64/dl-trampoline.h:112: Error: no such instruction: `vmovdqu (192+64*4)(%rsp),%ymm4' ../sysdeps/x86_64/dl-trampoline.h:113: Error: no such instruction: `vmovdqa %xmm4,(64+16*4)(%rsp)' ../sysdeps/x86_64/dl-trampoline.h:115: Error: no such instruction: `vpcmpeqq (704+16*5)(%rsp),%xmm5,%xmm8' ../sysdeps/x86_64/dl-trampoline.h:116: Error: no such instruction: `vpmovmskb %xmm8,%esi' ../sysdeps/x86_64/dl-trampoline.h:119: Error: no such instruction: `vmovdqa %xmm5,(192+64*5)(%rsp)' ../sysdeps/x86_64/dl-trampoline.h:121: Error: no such instruction: `vmovdqu (192+64*5)(%rsp),%ymm5' ../sysdeps/x86_64/dl-trampoline.h:122: Error: no such instruction: `vmovdqa %xmm5,(64+16*5)(%rsp)' ../sysdeps/x86_64/dl-trampoline.h:124: Error: no such instruction: `vpcmpeqq (704+16*6)(%rsp),%xmm6,%xmm8' ../sysdeps/x86_64/dl-trampoline.h:125: Error: no such instruction: `vpmovmskb %xmm8,%esi' ../sysdeps/x86_64/dl-trampoline.h:128: Error: no such instruction: `vmovdqa %xmm6,(192+64*6)(%rsp)' ../sysdeps/x86_64/dl-trampoline.h:130: Error: no such instruction: `vmovdqu (192+64*6)(%rsp),%ymm6' ../sysdeps/x86_64/dl-trampoline.h:131: Error: no such instruction: `vmovdqa %xmm6,(64+16*6)(%rsp)' ../sysdeps/x86_64/dl-trampoline.h:133: Error: no such instruction: `vpcmpeqq (704+16*7)(%rsp),%xmm7,%xmm8' ../sysdeps/x86_64/dl-trampoline.h:134: Error: no such instruction: `vpmovmskb %xmm8,%esi' ../sysdeps/x86_64/dl-trampoline.h:137: Error: no such instruction: `vmovdqa %xmm7,(192+64*7)(%rsp)' ../sysdeps/x86_64/dl-trampoline.h:139: Error: no such instruction: `vmovdqu (192+64*7)(%rsp),%ymm7' ../sysdeps/x86_64/dl-trampoline.h:140: Error: no such instruction: `vmovdqa %xmm7,(64+16*7)(%rsp)' ../sysdeps/x86_64/dl-trampoline.h:217: Error: no such instruction: `vmovdqu %ymm0,80(%rcx)' ../sysdeps/x86_64/dl-trampoline.h:218: Error: no such instruction: `vmovdqu %ymm1,144(%rcx)' ../sysdeps/x86_64/dl-trampoline.h:222: Error: no such instruction: `vmovdqa %xmm0,(208)(%rcx)' ../sysdeps/x86_64/dl-trampoline.h:223: Error: no such instruction: `vmovdqa %xmm1,(208+16)(%rcx)' ../sysdeps/x86_64/dl-trampoline.h:243: Error: no such instruction: `vpcmpeqq (208)(%rsp),%xmm0,%xmm2' ../sysdeps/x86_64/dl-trampoline.h:244: Error: no such instruction: `vpmovmskb %xmm2,%esi' ../sysdeps/x86_64/dl-trampoline.h:247: Error: no such instruction: `vmovdqu 80(%rsp),%ymm0' ../sysdeps/x86_64/dl-trampoline.h:249: Error: no such instruction: `vpcmpeqq (208+16)(%rsp),%xmm1,%xmm2' ../sysdeps/x86_64/dl-trampoline.h:250: Error: no such instruction: `vpmovmskb %xmm2,%esi' ../sysdeps/x86_64/dl-trampoline.h:253: Error: no such instruction: `vmovdqu 144(%rsp),%ymm1' make[2]: *** [/usr/glibc/glibc-2.11.1/glibc-build/elf/dl-trampoline.o] 错误 1 make[2]: Leaving directory `/usr/glibc/glibc-2.11.1/elf' make[1]: *** [elf/subdir_lib] 错误 2 make[1]: Leaving directory `/usr/glibc/glibc-2.11.1' make: *** [all] 错误 2
关于Makefile 通用规则的疑问
我的Makefile如下: ``` TOPDIR = . CROSS_COMPILE = mips-linux-gnu- CC = $(CROSS_COMPILE)gcc CXX = $(CROSS_COMPILE)g++ STRIP = $(CROSS_COMPILE)strip AR = $(CROSS_COMPILE)ar CFLAGS = -g -O2 -Wall ifeq ($(FR), ON) CFLAGS += -DFACE_RECOG endif INCLUDE = -I./t02_sdk/include INCLUDE += -I./rtsp_server/include INCLUDE += -I./t30_sdk/include LIBS = -L./t02_sdk/lib/T30/glibc -lakubelli -lpthread LIBS += -L./rtsp_server -lrtsp_server LIBS += -L./rtsp_server/live555/lib/glibc -lliveMedia -lBasicUsageEnvironment -lUsageEnvironment -lgroupsock LIBS += -L./t30_sdk/lib/glibc -limp -lalog -lsysutils OBJS = akubelli_test.o imp.o TARGET = akubelli_test all: $(TARGET) $(TARGET): librtsp_server $(OBJS) $(CXX) $(OBJS) -o $(TARGET) $(INCLUDE) $(LIBS) -lpthread -lm -ldl -lrt -lstdc++ $(STRIP) $@ librtsp_server: make -C $(TOPDIR)/rtsp_server %o:%c $(CC) $(INCLUDE) $(CFLAGS) $(LIBS) -c $< -o $@ .PHONY :clean clean: rm -rf $(TARGET) $(OBJS) make -C $(TOPDIR)/rtsp_server clean ``` Make结果: ![图片说明](https://img-ask.csdn.net/upload/201908/08/1565229938_880887.jpg) 疑问点: 通用规则 %o:%c $(CC) $(INCLUDE) $(CFLAGS) $(LIBS) -c $< -o $@ 按理说不是应该会打印出$(INCLUDE) $(CFLAGS)的详细信息吗? 但实际却没有打印,还报找不到头文件(头文件在:./rtsp_server/include/RTSPServer.hh),这是为什么 ------------------------------------------------------------------------- 补充: 加了info打印后的结果: ![图片说明](https://img-ask.csdn.net/upload/201908/08/1565235094_304092.jpg)![图片说明](https://img-ask.csdn.net/upload/201908/08/1565235102_141561.jpg) 任何信息都没打印,包括我随便 echo 一个字符串都没输出的
Android5.0 编译出错,哪位大神帮帮我
mkdir -p out/target/product/generic/obj/STATIC_LIBRARIES/third_party_webrtc_modules_audioproc_debug_proto_gyp_intermediates; cp out/target/product/generic/obj/GYP/shared_intermediates/protoc_out/webrtc/audio_processing/debug.pb.cc out/target/product/generic/obj/STATIC_LIBRARIES/third_party_webrtc_modules_audioproc_debug_proto_gyp_intermediates/debug.pb.cc host Executable: third_party_libvpx_libvpx_obj_int_extract_arm_host_gyp (out/host/linux-x86/obj32/EXECUTABLES/third_party_libvpx_libvpx_obj_int_extract_arm_host_gyp_intermediates/libvpx_obj_int_extract) target thumb C++: third_party_webrtc_modules_rtp_rtcp_gyp <= external/chromium_org/third_party/webrtc/modules/rtp_rtcp/source/rtp_header_parser.cc /home/rock/android-5.0.0_r2/prebuilts/gcc/linux-x86/host/x86_64-linux-glibc2.11-4.6/bin/../lib/gcc/x86_64-linux/4.6/../../../../x86_64-linux/bin/ld: error: out/host/linux-x86/obj32/EXECUTABLES/third_party_libvpx_libvpx_obj_int_extract_arm_host_gyp_intermediates/third_party/libvpx/source/libvpx/build/make/obj_int_extract.o: file is empty /home/rock/android-5.0.0_r2/prebuilts/gcc/linux-x86/host/x86_64-linux-glibc2.11-4.6/bin/../sysroot/usr/lib/../lib32/Scrt1.o(.text+0x28): error: undefined reference to 'main' collect2: ld returned 1 exit status make: *** [out/host/linux-x86/obj32/EXECUTABLES/third_party_libvpx_libvpx_obj_int_extract_arm_host_gyp_intermediates/libvpx_obj_int_extract] 错误 1 make: *** 正在等待未完成的任务.... 哪位大神可以帮帮我。
关于Ubuntu16.04用tar.gz通用压缩包安装mysql5.7.17失败
系统Ubuntu16.04 64位 准备安装MySQL 57.7.17 概要 apt-cache search libaio #安装mysql依赖库 tar -zxvf -zxvf mysql-5.7.17-linux-glibc2.5-x86_64.tar.gz #解压压缩包 mv mysql-5.7.17-linux-glibc2.5-x86_64 mysql #修改名字 groupadd mysql #添加用户组 useradd -r -g mysql -s /bin/false mysql #添加用户 cd mysql #进入mysql目录 mkdir mysql-files #新建目录 chmod 750 mysql-files #给目录授权为mysql 用户 chown -R mysql . chgrp -R mysql . bin/mysqld --initialize --user=mysql --basedir=/usr/local/mysql --datadir=/usr/local/mysql/data #初始化mysql数据库 bin/mysql_ssl_rsa_setup #创建SSL证书,密钥文件和RSA密钥对文件 chown -R root . #给当前目录授权为用户root chown -R mysql data mysql-files bin/mysqld_safe --user=mysql & #启动mysql 问题卡在这了 ![图片说明](https://img-ask.csdn.net/upload/201704/04/1491243943_360085.jpg) 详细步骤 1.安装准备 1.1查看自己的Linux系统版本 命令: cat /etc/issue 再具体点:uname -a 86_64就代表64位的系统 OK,咱们确定了自己的系统,现在去MySQL官网下载二进制压缩包源文件 1.2官网下载安装包 https://dev.mysql.com/downloads/mysql/ ![图片说明](https://img-ask.csdn.net/upload/201704/04/1491244259_939400.jpg) 选择对应的安装包 ![图片说明](https://img-ask.csdn.net/upload/201704/04/1491244281_48676.jpg) ![图片说明](https://img-ask.csdn.net/upload/201704/04/1491244297_258139.jpg) 下载的话,有两种方式: 1.从官网下载,然后用FTP软件上传到服务器上。 2.使用在线下载的方式,使用命令: wget -P /usr/local/support https://cdn.mysql.com//Downloads/MySQL-5.7/mysql-5.7.17-linux-glibc2.5-x86_64.tar.gz 注:-P /usr/local/support 是指定下载目录 不要问我为啥网速这么快。。。。我也震惊了 ![图片说明](https://img-ask.csdn.net/upload/201704/04/1491244091_52801.jpg) 2.开始安装: 参考官方文档 ①为了预防以前安装过mysql,导致旧版本遗留文件冲突,所以需要把以前安装的文件都删除掉 /etc/my.cnf /etc/msyql目录 查找命令: find / -name 文件名or目录名 删除命令: rm -rf 文件名or目录名 ②安装mysql的依赖库libaio 搜索命令 apt-cache search libaio apt-cache search libaio 如果搜索没有显示结果,就安装 安装命令:apt-get install libaio1 注:如果报错,则需要使用更新命令 apt-get update 更新后就可以安装依赖库了 ③解压压缩包 命令: tar -zxvf -zxvf mysql-5.7.17-linux-glibc2.5-x86_64.tar.gz ④改名字,便于操作 命令:mv mysql-5.7.17-linux-glibc2.5-x86_64 mysql ④添加用户组, 添加用户 groupadd mysql useradd -r -g mysql -s /bin/false mysql ⑤进入msyql目录,创建目录mysql-files cd mysql mkdir mysql-files ⑥给文件夹授权为用户mysql chmod 750 mysql-files chown -R mysql . chgrp -R mysql . ⑦初始化数据库 bin/mysqld --initialize --user=mysql --basedir=/usr/local/mysql --datadir=/usr/local/mysql/data ⑧创建SSL证书,密钥文件和RSA密钥对文件 bin/mysql_ssl_rsa_setup ⑨给当前目录授权为用户root chown -R root . chown -R mysql data mysql-files ⑩问题来了 每当我执行到这个命令时,就卡那不懂了。。。。请教大神,这是为什么 bin/mysqld_safe --user=mysql & # Next command is optional ![图片说明](https://img-ask.csdn.net/upload/201704/04/1491244374_944582.jpg) 然后: 执行 mysql -u root -p 再输入密码,显示: ![图片说明](https://img-ask.csdn.net/upload/201704/04/1491244197_897753.png) 尝试解决 网上搜的方法: 在my.cnf 中添加sockt ![图片说明](https://img-ask.csdn.net/upload/201704/04/1491244246_429225.png) 使用该方法启动 mysql -p --socket=/tmp/mysql.sock ![图片说明](https://img-ask.csdn.net/upload/201704/04/1491244255_351582.png) 另外,参考这篇博客 http://ng2.site/mysql/2016/11/16/install-mysql-offline.html 也是安装失败,请大神指点! ------------------------------------------------------------------------------------------------------------------------------------------------------ PS: 我用apt-get install mysql-server 可以成功安装,但是用通用二进制压缩包离线安装一直安装不成功,这个问题纠结我很久了,成了心结,所以一定要解决掉!
buffer overflow detected arm-linux-ar terminated
系统是ubuntu14.04 LTS gcc版本是4.4 步骤是这样: 先安装了binutils-2.15 ../configure --target=arm-linux --prefix=定义的安装目录 make make install 这个折腾了好久,成功安装好了 之后进行arm-linx-gcc制作 ../configure --target=arm-linux --prefix=定义的安装目录 --enable-language=c --disable-threads --disable-shared make 在make部分就出现了 *** buffer overflow detected ***: arm-linux-ar terminated ======= Backtrace: ========= /lib/x86_64-linux-gnu/libc.so.6(+0x741cf)[0x2b19ddccf1cf] /lib/x86_64-linux-gnu/libc.so.6(__fortify_fail+0x5c)[0x2b19ddd66b2c] /lib/x86_64-linux-gnu/libc.so.6(+0x10a9f0)[0x2b19ddd659f0] /lib/x86_64-linux-gnu/libc.so.6(+0x109ef9)[0x2b19ddd64ef9] /lib/x86_64-linux-gnu/libc.so.6(_IO_default_xsputn+0xbc)[0x2b19ddcd754c] /lib/x86_64-linux-gnu/libc.so.6(_IO_padn+0xa0)[0x2b19ddccb510] /lib/x86_64-linux-gnu/libc.so.6(_IO_vfprintf+0x3c5d)[0x2b19ddca8bfd] /lib/x86_64-linux-gnu/libc.so.6(__vsprintf_chk+0x84)[0x2b19ddd64f84] /lib/x86_64-linux-gnu/libc.so.6(__sprintf_chk+0x7d)[0x2b19ddd64edd] arm-linux-ar[0x409524] arm-linux-ar[0x407781] arm-linux-ar[0x409dcd] arm-linux-ar[0x40d597] arm-linux-ar[0x40405f] arm-linux-ar[0x40453f] arm-linux-ar[0x405017] /lib/x86_64-linux-gnu/libc.so.6(__libc_start_main+0xf5)[0x2b19ddc7cec5] arm-linux-ar[0x401cf9] ======= Memory map: ======== 00400000-00459000 r-xp 00000000 08:0b 61558 /home/kanata/armlinux/tools/bin/arm-linux-ar 00658000-00659000 r--p 00058000 08:0b 61558 /home/kanata/armlinux/tools/bin/arm-linux-ar 00659000-0065a000 rw-p 00059000 08:0b 61558 /home/kanata/armlinux/tools/bin/arm-linux-ar 0065a000-0065e000 rw-p 00000000 00:00 0 020f6000-0236a000 rw-p 00000000 00:00 0 [heap] 2b19dda36000-2b19dda59000 r-xp 00000000 08:0c 786434 /lib/x86_64-linux-gnu/ld-2.19.so 2b19dda59000-2b19dda5b000 rw-p 00000000 00:00 0 2b19dda5b000-2b19dda62000 r--s 00000000 08:0c 392357 /usr/lib/x86_64-linux-gnu/gconv/gconv-modules.cache 2b19dda62000-2b19dda6d000 rw-p 00000000 00:00 0 2b19dda6f000-2b19dda72000 rw-p 00000000 00:00 0 2b19ddc58000-2b19ddc59000 r--p 00022000 08:0c 786434 /lib/x86_64-linux-gnu/ld-2.19.so 2b19ddc59000-2b19ddc5a000 rw-p 00023000 08:0c 786434 /lib/x86_64-linux-gnu/ld-2.19.so 2b19ddc5a000-2b19ddc5b000 rw-p 00000000 00:00 0 2b19ddc5b000-2b19dde17000 r-xp 00000000 08:0c 786458 /lib/x86_64-linux-gnu/libc-2.19.so 2b19dde17000-2b19de016000 ---p 001bc000 08:0c 786458 /lib/x86_64-linux-gnu/libc-2.19.so 2b19de016000-2b19de01a000 r--p 001bb000 08:0c 786458 /lib/x86_64-linux-gnu/libc-2.19.so 2b19de01a000-2b19de01c000 rw-p 001bf000 08:0c 786458 /lib/x86_64-linux-gnu/libc-2.19.so 2b19de01c000-2b19de021000 rw-p 00000000 00:00 0 2b19de021000-2b19de703000 r--p 00000000 08:0c 138526 /usr/lib/locale/locale-archive 2b19de703000-2b19de719000 r-xp 00000000 08:0c 807277 /lib/x86_64-linux-gnu/libgcc_s.so.1 2b19de719000-2b19de918000 ---p 00016000 08:0c 807277 /lib/x86_64-linux-gnu/libgcc_s.so.1 2b19de918000-2b19de919000 rw-p 00015000 08:0c 807277 /lib/x86_64-linux-gnu/libgcc_s.so.1 7fffd333d000-7fffd3360000 rw-p 00000000 00:00 0 [stack] 7fffd33fe000-7fffd3400000 r-xp 00000000 00:00 0 [vdso] ffffffffff600000-ffffffffff601000 r-xp 00000000 00:00 0 [vsyscall] make[2]: *** [libgcc.a] 已放弃 (core dumped) make[2]: *** 正在删除文件“libgcc.a” make[2]:正在离开目录 `/home/kanata/armlinux/build-tools/build-gcc/gcc' make[1]: *** [libgcc.a] 错误 2 make[1]:正在离开目录 `/home/kanata/armlinux/build-tools/build-gcc/gcc' make: *** [all-gcc] 错误 2 请问有高手解决过这种问题吗,说下我知道的可能性: 1.gcc版本过高,好友有尝试低版本的gcc编译通过的 2.我尝试过安装了4.1,但是configure的时候出现的问题是找不到crt1.o,之后export了crt1.o的路径的时候又出现 -lgcc_s.o找不到的问题==` 想放弃的时候尝试过的替代方案是直接下载别人做好的arm-linux-gcc工具包,但是按照配置弄的时候,却出现: kanata@blue:~$ arm arm2hpdl arm-linux-gcc arm-linux-objdump arm-linux-addr2line arm-linux-gcc-3.4.5 arm-linux-ranlib arm-linux-ar arm-linux-gccbug arm-linux-readelf arm-linux-as arm-linux-gcov arm-linux-size arm-linux-c++ arm-linux-gprof arm-linux-strings arm-linux-c++filt arm-linux-ld arm-linux-strip arm-linux-cpp arm-linux-nm arm-linux-g++ arm-linux-objcopy kanata@blue:~$ arm-linux-gcc -v bash: /home/kanata/gcc-3.4.5-glibc-2.3.6/bin/arm-linux-gcc: 没有那个文件或目录 能有什么解决办法吗?
makefile 编译文件的时候提示这个错误,试过网上很多方法,还是报错,在线等
/usr/bin/ld: zdatabase.o: undefined reference to symbol 'pthread_create@@GLIBC_2.2.5' /lib/x86_64-linux-gnu/libpthread.so.0: error adding symbols: DSO missing from command line collect2: error: ld returned 1 exit status makefile:23: recipe for target 'hello' failed make: *** [hello] Error 1
Centos6.4 安装完tensorflow后 命令行输入 import tensorflow报错
小弟刚刚接触tensorflow,照的网上的教程安装完之后,在命令行运行import tensorflow这条语句的时候就报错了,下面是报错的内容,希望各位大神帮帮小弟。 >>> import tensorflow Traceback (most recent call last): File "<stdin>", line 1, in <module> File "/home/anaconda2/envs/tensorflow/lib/python2.7/site-packages/tensorflow/__init__.py", line 24, in <module> from tensorflow.python import * File "/home/anaconda2/envs/tensorflow/lib/python2.7/site-packages/tensorflow/python/__init__.py", line 49, in <module> from tensorflow.python import pywrap_tensorflow File "/home/anaconda2/envs/tensorflow/lib/python2.7/site-packages/tensorflow/python/pywrap_tensorflow.py", line 72, in <module> raise ImportError(msg) ImportError: Traceback (most recent call last): File "/home/anaconda2/envs/tensorflow/lib/python2.7/site-packages/tensorflow/python/pywrap_tensorflow.py", line 58, in <module> from tensorflow.python.pywrap_tensorflow_internal import * File "/home/anaconda2/envs/tensorflow/lib/python2.7/site-packages/tensorflow/python/pywrap_tensorflow_internal.py", line 28, in <module> _pywrap_tensorflow_internal = swig_import_helper() File "/home/anaconda2/envs/tensorflow/lib/python2.7/site-packages/tensorflow/python/pywrap_tensorflow_internal.py", line 24, in swig_import_helper _mod = imp.load_module('_pywrap_tensorflow_internal', fp, pathname, description) ImportError: /lib64/libc.so.6: version `GLIBC_2.16' not found (required by /home/zhufeng/anaconda2/envs/tensorflow/lib/python2.7/site-packages/tensorflow/python/_pywrap_tensorflow_internal.so) Failed to load the native TensorFlow runtime. See https://www.tensorflow.org/install/install_sources#common_installation_problems for some common reasons and solutions. Include the entire stack trace above this error message when asking for help.
import tensorflow 时报错:version GLIBC_2.14 not found
**Linux下使用 pip install tensorflow --upgrade 命令安装成功,但是在import tensorflow的时候报错,具体错误如下: ** >>> import tensorflow Traceback (most recent call last): File "/usr/local/lib/python3.5/site-packages/tensorflow/python/pywrap_tensorflow.py", line 41, in <module> from tensorflow.python.pywrap_tensorflow_internal import * File "/usr/local/lib/python3.5/site-packages/tensorflow/python/pywrap_tensorflow_internal.py", line 28, in <module> _pywrap_tensorflow_internal = swig_import_helper() File "/usr/local/lib/python3.5/site-packages/tensorflow/python/pywrap_tensorflow_internal.py", line 24, in swig_import_helper _mod = imp.load_module('_pywrap_tensorflow_internal', fp, pathname, description) File "/usr/local/lib/python3.5/imp.py", line 242, in load_module return load_dynamic(name, filename, file) File "/usr/local/lib/python3.5/imp.py", line 342, in load_dynamic return _load(spec) ImportError: /usr/lib64/libstdc++.so.6: version `GLIBCXX_3.4.18' not found (required by /usr/local/lib/python3.5/site-packages/tensorflow/python/_pywrap_tensorflow_internal.so) During handling of the above exception, another exception occurred: Traceback (most recent call last): File "<stdin>", line 1, in <module> File "/usr/local/lib/python3.5/site-packages/tensorflow/__init__.py", line 24, in <module> from tensorflow.python import * File "/usr/local/lib/python3.5/site-packages/tensorflow/python/__init__.py", line 49, in <module> from tensorflow.python import pywrap_tensorflow File "/usr/local/lib/python3.5/site-packages/tensorflow/python/pywrap_tensorflow.py", line 52, in <module> raise ImportError(msg) ImportError: Traceback (most recent call last): File "/usr/local/lib/python3.5/site-packages/tensorflow/python/pywrap_tensorflow.py", line 41, in <module> from tensorflow.python.pywrap_tensorflow_internal import * File "/usr/local/lib/python3.5/site-packages/tensorflow/python/pywrap_tensorflow_internal.py", line 28, in <module> _pywrap_tensorflow_internal = swig_import_helper() File "/usr/local/lib/python3.5/site-packages/tensorflow/python/pywrap_tensorflow_internal.py", line 24, in swig_import_helper _mod = imp.load_module('_pywrap_tensorflow_internal', fp, pathname, description) File "/usr/local/lib/python3.5/imp.py", line 242, in load_module return load_dynamic(name, filename, file) File "/usr/local/lib/python3.5/imp.py", line 342, in load_dynamic return _load(spec) ImportError: /usr/lib64/libstdc++.so.6: version `GLIBCXX_3.4.18' not found (required by /usr/local/lib/python3.5/site-packages/tensorflow/python/_pywrap_tensorflow_internal.so) Failed to load the native TensorFlow runtime. See https://www.tensorflow.org/install/install_sources#common_installation_problems for some common reasons and solutions. Include the entire stack trace above this error message when asking for help. **最开始是 version 'GLIBC2.14' not found,升级到glibc2.14版本后,又报错 version ‘GLIBC2.18’not found,又升级到2.19版本就报现在这个错误,这真是由于GLIBC版本过低引起的吗,怎么解决?**
centos7.0 静默安装oracle10g 报错,跪求大神解决!!!!
centos7.0 静默安装oracle10g 报错,参考安装步骤为https://www.cnblogs.com/0201zcr/p/4728241.html /home/oracle/database/install/.oui: /usr/lib/libc.so.6: version `GLIBC_2.3' not found (required by /home/oracle/database/install/.oui) /home/oracle/database/install/.oui: /usr/lib/libc.so.6: version `GLIBC_2.2' not found (required by /home/oracle/database/install/.oui)
Linux 编译安装libc.so.6时出现Segmentation fault (core dumped)错误导致ls等命令不能用怎么办?
在学校集群上装tensorflow,import tensorflow时出现ImportError: /lib64/libc.so.6: version `GLIBC_2.16' not found,网上查资料按以下步骤进行操作: (1)下载glibc-2.16.0.tar.bz并解压为 ~/Download/glibc-2.16.0 (2)cd ~/Download/glibc-2.16.0/ mkdir build cd build ../configure --prefix=/usr --disable-profile --enable-add-ons --with-headers=/usr/include --with-binutils=/usr/bin make (3) make install时出现错误: ...... ...... ![图片说明](https://img-ask.csdn.net/upload/201901/05/1546689124_286319.jpg) ![图片说明](https://img-ask.csdn.net/upload/201901/05/1546689159_184865.jpg) 如图所示: (1)make install 时出现错误:make[1]: *** [install] Segmentation fault (core dumped) (2)ls等命令无法使用,显示缺少version `GLIBC_2.14' (3)尝试gdb调试,结果显示与(2)中一样的问题 另外,系统本来的libc.so.6链接到libc-2.12.so,最高到GLIBC_2.12,由此看来libc-2.16好像已经安装了一部分。 求各路大神帮帮小弟!!!在线等,挺急的!!!不管是把glibc-2.16安装好还是回退到原来的版本都可以,目的只有一个,那就是让ls,cp,gdb等命令能正常使用。 集群linux版本(red hat)太低了,用起来太麻烦,把系统修复好之后我就不折腾了。
我在CentOS6.5升级glibc-2.14 make install出现错误
我在CentOS6.5升级glibc-2.14 make install出现错误:Can't open configuration file /opt/glibc-2.14/etc/ld.so.conf: No such file or directory。 大家有谁遇到过,请帮我解决下子,困扰我了。谢谢!我没有悬赏分数了,抱歉。
交叉编译 skipping incompatible libc.so.6
交叉编译libevent,有两个交叉编译工具链,其中一个编译通过了,另一个编译有问题。 ``` root@us16044:/opt/x86/applications/libeventlibevent-2.1.11-stable/# ./configure --prefix=/opt/x86/applications/libevent/libevent-2.1.11-stable/install-arago/ --host=arm-none-linux CC=/opt/vbox/arago-linux-devkit/bin/arm-arago-linux-gnueabi-gcc CXX=/opt/vbox/arago-linux-devkit/bin/arm-arago-linux-gnueabi-g++ root@us16044:/opt/x86/applications/libeventlibevent-2.1.11-stable/#make ...省略 /opt/vbox/arago-linux-devkit/bin/../lib/gcc/arm-arago-linux-gnueabi/4.5.3/../../../../arm-arago-linux-gnueabi/bin/ld: skipping incompatible /opt/vbox/arago-linux-devkit/bin/../lib/gcc/arm-arago-linux-gnueabi/4.5.3/../../../../arm-arago-linux-gnueabi/lib/../../lib/libc.so.6 when searching for ../../lib/libc.so.6 ...省略 ``` libc.so.6是存在的 ``` root@us16044:/opt/x86/applications/libevent# objdump -p /opt/vbox/arago-linux-devkit/lib/libc.so.6 /opt/vbox/arago-linux-devkit/lib/libc.so.6: file format elf32-i386 Program Header: PHDR off 0x00000034 vaddr 0x00000034 paddr 0x00000034 align 2**2 filesz 0x00000140 memsz 0x00000140 flags r-x INTERP off 0x0013ac20 vaddr 0x0013ac20 paddr 0x0013ac20 align 2**5 filesz 0x00000021 memsz 0x00000021 flags r-- LOAD off 0x00000000 vaddr 0x00000000 paddr 0x00000000 align 2**12 filesz 0x00154ae8 memsz 0x00154ae8 flags r-x LOAD off 0x001551c4 vaddr 0x001561c4 paddr 0x001561c4 align 2**12 filesz 0x000027d8 memsz 0x00005804 flags rw- DYNAMIC off 0x00156d7c vaddr 0x00157d7c paddr 0x00157d7c align 2**2 filesz 0x000000f0 memsz 0x000000f0 flags rw- NOTE off 0x00000174 vaddr 0x00000174 paddr 0x00000174 align 2**2 filesz 0x00000020 memsz 0x00000020 flags r-- TLS off 0x001551c4 vaddr 0x001561c4 paddr 0x001561c4 align 2**2 filesz 0x00000008 memsz 0x00000040 flags r-- EH_FRAME off 0x0013ac44 vaddr 0x0013ac44 paddr 0x0013ac44 align 2**2 filesz 0x00003304 memsz 0x00003304 flags r-- STACK off 0x00000000 vaddr 0x00000000 paddr 0x00000000 align 2**2 filesz 0x00000000 memsz 0x00000000 flags rw- RELRO off 0x001551c4 vaddr 0x001561c4 paddr 0x001561c4 align 2**0 filesz 0x00001e3c memsz 0x00001e3c flags r-- Dynamic Section: NEEDED ld-linux.so.2 SONAME libc.so.6 INIT 0x00016af0 FINI_ARRAY 0x001561cc FINI_ARRAYSZ 0x00000004 HASH 0x00151684 GNU_HASH 0x00000194 STRTAB 0x0000cf2c SYMTAB 0x00003dac STRSZ 0x00005a61 SYMENT 0x00000010 PLTGOT 0x00157ff4 PLTRELSZ 0x00000038 PLTREL 0x00000011 JMPREL 0x000169b4 REL 0x00013fb4 RELSZ 0x00002a00 RELENT 0x00000008 VERDEF 0x00013bc0 VERDEFNUM 0x0000001b FLAGS 0x00000010 VERNEED 0x00013f74 VERNEEDNUM 0x00000001 VERSYM 0x0001298e RELCOUNT 0x000004e2 Version definitions: 1 0x01 0x0865f4e6 libc.so.6 2 0x00 0x0d696910 GLIBC_2.0 3 0x00 0x0d696911 GLIBC_2.1 GLIBC_2.0 4 0x00 0x09691f71 GLIBC_2.1.1 GLIBC_2.1 5 0x00 0x09691f72 GLIBC_2.1.2 GLIBC_2.1.1 6 0x00 0x09691f73 GLIBC_2.1.3 GLIBC_2.1.2 7 0x00 0x0d696912 GLIBC_2.2 GLIBC_2.1.3 8 0x00 0x09691a71 GLIBC_2.2.1 GLIBC_2.2 9 0x00 0x09691a72 GLIBC_2.2.2 GLIBC_2.2.1 10 0x00 0x09691a73 GLIBC_2.2.3 GLIBC_2.2.2 11 0x00 0x09691a74 GLIBC_2.2.4 GLIBC_2.2.3 12 0x00 0x09691a76 GLIBC_2.2.6 GLIBC_2.2.4 13 0x00 0x0d696913 GLIBC_2.3 GLIBC_2.2.6 14 0x00 0x09691972 GLIBC_2.3.2 GLIBC_2.3 15 0x00 0x09691973 GLIBC_2.3.3 GLIBC_2.3.2 16 0x00 0x09691974 GLIBC_2.3.4 GLIBC_2.3.3 17 0x00 0x0d696914 GLIBC_2.4 GLIBC_2.3.4 18 0x00 0x0d696915 GLIBC_2.5 GLIBC_2.4 19 0x00 0x0d696916 GLIBC_2.6 GLIBC_2.5 20 0x00 0x0d696917 GLIBC_2.7 GLIBC_2.6 21 0x00 0x0d696918 GLIBC_2.8 GLIBC_2.7 22 0x00 0x0d696919 GLIBC_2.9 GLIBC_2.8 23 0x00 0x06969190 GLIBC_2.10 GLIBC_2.9 24 0x00 0x06969191 GLIBC_2.11 GLIBC_2.10 25 0x00 0x06969192 GLIBC_2.12 GLIBC_2.11 26 0x00 0x0963cf85 GLIBC_PRIVATE GLIBC_2.12 27 0x00 0x0b792650 GCC_3.0 Version References: required from ld-linux.so.2: 0x0963cf85 0x00 30 GLIBC_PRIVATE 0x0d696913 0x00 29 GLIBC_2.3 0x0d696911 0x00 28 GLIBC_2.1 ``` c/c++新手,编译过程这边不太懂,求帮助
终于明白阿里百度这样的大公司,为什么面试经常拿ThreadLocal考验求职者了
点击上面↑「爱开发」关注我们每晚10点,捕获技术思考和创业资源洞察什么是ThreadLocalThreadLocal是一个本地线程副本变量工具类,各个线程都拥有一份线程私...
《奇巧淫技》系列-python!!每天早上八点自动发送天气预报邮件到QQ邮箱
将代码部署服务器,每日早上定时获取到天气数据,并发送到邮箱。 也可以说是一个小人工智障。 思路可以运用在不同地方,主要介绍的是思路。
加快推动区块链技术和产业创新发展,2019可信区块链峰会在京召开
11月8日,由中国信息通信研究院、中国通信标准化协会、中国互联网协会、可信区块链推进计划联合主办,科技行者协办的2019可信区块链峰会将在北京悠唐皇冠假日酒店开幕。   区块链技术被认为是继蒸汽机、电力、互联网之后,下一代颠覆性的核心技术。如果说蒸汽机释放了人类的生产力,电力解决了人类基本的生活需求,互联网彻底改变了信息传递的方式,区块链作为构造信任的技术有重要的价值。   1...
阿里面试官问我:如何设计秒杀系统?我的回答让他比起大拇指
你知道的越多,你不知道的越多 点赞再看,养成习惯 GitHub上已经开源 https://github.com/JavaFamily 有一线大厂面试点脑图和个人联系方式,欢迎Star和指教 前言 Redis在互联网技术存储方面使用如此广泛,几乎所有的后端技术面试官都要在Redis的使用和原理方面对小伙伴们进行360°的刁难。 作为一个在互联网公司面一次拿一次Offer的面霸,打败了...
C语言魔塔游戏
很早就很想写这个,今天终于写完了。 游戏截图: 编译环境: VS2017 游戏需要一些图片,如果有想要的或者对游戏有什么看法的可以加我的QQ 2985486630 讨论,如果暂时没有回应,可以在博客下方留言,到时候我会看到。 下面我来介绍一下游戏的主要功能和实现方式 首先是玩家的定义,使用结构体,这个名字是可以自己改变的 struct gamerole { char n...
面试官问我:什么是消息队列?什么场景需要他?用了会出现什么问题?
你知道的越多,你不知道的越多 点赞再看,养成习惯 GitHub上已经开源 https://github.com/JavaFamily 有一线大厂面试点脑图、个人联系方式和人才交流群,欢迎Star和完善 前言 消息队列在互联网技术存储方面使用如此广泛,几乎所有的后端技术面试官都要在消息队列的使用和原理方面对小伙伴们进行360°的刁难。 作为一个在互联网公司面一次拿一次Offer的面霸...
Android性能优化(4):UI渲染机制以及优化
文章目录1. 渲染机制分析1.1 渲染机制1.2 卡顿现象1.3 内存抖动2. 渲染优化方式2.1 过度绘制优化2.1.1 Show GPU overdraw2.1.2 Profile GPU Rendering2.2 卡顿优化2.2.1 SysTrace2.2.2 TraceView 在从Android 6.0源码的角度剖析View的绘制原理一文中,我们了解到View的绘制流程有三个步骤,即m...
微服务中的Kafka与Micronaut
今天,我们将通过Apache Kafka主题构建一些彼此异步通信的微服务。我们使用Micronaut框架,它为与Kafka集成提供专门的库。让我们简要介绍一下示例系统的体系结构。我们有四个微型服务:订单服务,行程服务,司机服务和乘客服务。这些应用程序的实现非常简单。它们都有内存存储,并连接到同一个Kafka实例。 我们系统的主要目标是为客户安排行程。订单服务应用程序还充当网关。它接收来自客户的请求...
致 Python 初学者们!
作者| 许向武 责编 | 屠敏 出品 | CSDN 博客 前言 在 Python 进阶的过程中,相信很多同学应该大致上学习了很多 Python 的基础知识,也正在努力成长。在此期间,一定遇到了很多的困惑,对未来的学习方向感到迷茫。我非常理解你们所面临的处境。我从2007年开始接触 Python 这门编程语言,从2009年开始单一使用 Python 应对所有的开发工作,直至今...
究竟你适不适合买Mac?
我清晰的记得,刚买的macbook pro回到家,开机后第一件事情,就是上了淘宝网,花了500元钱,找了一个上门维修电脑的师傅,上门给我装了一个windows系统。。。。。。 表砍我。。。 当时买mac的初衷,只是想要个固态硬盘的笔记本,用来运行一些复杂的扑克软件。而看了当时所有的SSD笔记本后,最终决定,还是买个好(xiong)看(da)的。 已经有好几个朋友问我mba怎么样了,所以今天尽量客观...
程序员一般通过什么途径接私活?
二哥,你好,我想知道一般程序猿都如何接私活,我也想接,能告诉我一些方法吗? 上面是一个读者“烦不烦”问我的一个问题。其实不止是“烦不烦”,还有很多读者问过我类似这样的问题。 我接的私活不算多,挣到的钱也没有多少,加起来不到 20W。说实话,这个数目说出来我是有点心虚的,毕竟太少了,大家轻喷。但我想,恰好配得上“一般程序员”这个称号啊。毕竟苍蝇再小也是肉,我也算是有经验的人了。 唾弃接私活、做外...
字节跳动面试官这样问消息队列:分布式事务、重复消费、顺序消费,我整理了一下
你知道的越多,你不知道的越多 点赞再看,养成习惯 GitHub上已经开源 https://github.com/JavaFamily 有一线大厂面试点脑图、个人联系方式和人才交流群,欢迎Star和完善 前言 消息队列在互联网技术存储方面使用如此广泛,几乎所有的后端技术面试官都要在消息队列的使用和原理方面对小伙伴们进行360°的刁难。 作为一个在互联网公司面一次拿一次Offer的面霸...
Python爬虫爬取淘宝,京东商品信息
小编是一个理科生,不善长说一些废话。简单介绍下原理然后直接上代码。 使用的工具(Python+pycharm2019.3+selenium+xpath+chromedriver)其中要使用pycharm也可以私聊我selenium是一个框架可以通过pip下载 pip installselenium -ihttps://pypi.tuna.tsinghua.edu.cn/simple/ ...
阿里程序员写了一个新手都写不出的低级bug,被骂惨了。
这种新手都不会范的错,居然被一个工作好几年的小伙子写出来,差点被当场开除了。
Java工作4年来应聘要16K最后没要,细节如下。。。
前奏: 今天2B哥和大家分享一位前几天面试的一位应聘者,工作4年26岁,统招本科。 以下就是他的简历和面试情况。 基本情况: 专业技能: 1、&nbsp;熟悉Sping了解SpringMVC、SpringBoot、Mybatis等框架、了解SpringCloud微服务 2、&nbsp;熟悉常用项目管理工具:SVN、GIT、MAVEN、Jenkins 3、&nbsp;熟悉Nginx、tomca...
SpringBoot2.x系列教程(三十六)SpringBoot之Tomcat配置
Spring Boot默认内嵌的Tomcat为Servlet容器,关于Tomcat的所有属性都在ServerProperties配置类中。同时,也可以实现一些接口来自定义内嵌Servlet容器和内嵌Tomcat等的配置。 关于此配置,网络上有大量的资料,但都是基于SpringBoot1.5.x版本,并不适合当前最新版本。本文将带大家了解一下最新版本的使用。 ServerProperties的部分源...
Python绘图,圣诞树,花,爱心 | Turtle篇
每周每日,分享Python实战代码,入门资料,进阶资料,基础语法,爬虫,数据分析,web网站,机器学习,深度学习等等。 公众号回复【进群】沟通交流吧,QQ扫码进群学习吧 微信群 QQ群 1.画圣诞树 import turtle screen = turtle.Screen() screen.setup(800,600) circle = turtle.Turtle()...
作为一个程序员,CPU的这些硬核知识你必须会!
CPU对每个程序员来说,是个既熟悉又陌生的东西? 如果你只知道CPU是中央处理器的话,那可能对你并没有什么用,那么作为程序员的我们,必须要搞懂的就是CPU这家伙是如何运行的,尤其要搞懂它里面的寄存器是怎么一回事,因为这将让你从底层明白程序的运行机制。 随我一起,来好好认识下CPU这货吧 把CPU掰开来看 对于CPU来说,我们首先就要搞明白它是怎么回事,也就是它的内部构造,当然,CPU那么牛的一个东...
破14亿,Python分析我国存在哪些人口危机!
一、背景 二、爬取数据 三、数据分析 1、总人口 2、男女人口比例 3、人口城镇化 4、人口增长率 5、人口老化(抚养比) 6、各省人口 7、世界人口 四、遇到的问题 遇到的问题 1、数据分页,需要获取从1949-2018年数据,观察到有近20年参数:LAST20,由此推测获取近70年的参数可设置为:LAST70 2、2019年数据没有放上去,可以手动添加上去 3、将数据进行 行列转换 4、列名...
听说想当黑客的都玩过这个Monyer游戏(1~14攻略)
第零关 进入传送门开始第0关(游戏链接) 请点击链接进入第1关: 连接在左边→ ←连接在右边 看不到啊。。。。(只能看到一堆大佬做完的留名,也能看到菜鸡的我,在后面~~) 直接fn+f12吧 &lt;span&gt;连接在左边→&lt;/span&gt; &lt;a href="first.php"&gt;&lt;/a&gt; &lt;span&gt;←连接在右边&lt;/span&gt; o...
在家远程办公效率低?那你一定要收好这个「在家办公」神器!
相信大家都已经收到国务院延长春节假期的消息,接下来,在家远程办公可能将会持续一段时间。 但是问题来了。远程办公不是人在电脑前就当坐班了,相反,对于沟通效率,文件协作,以及信息安全都有着极高的要求。有着非常多的挑战,比如: 1在异地互相不见面的会议上,如何提高沟通效率? 2文件之间的来往反馈如何做到及时性?如何保证信息安全? 3如何规划安排每天工作,以及如何进行成果验收? ...... ...
作为一个程序员,内存和磁盘的这些事情,你不得不知道啊!!!
截止目前,我已经分享了如下几篇文章: 一个程序在计算机中是如何运行的?超级干货!!! 作为一个程序员,CPU的这些硬核知识你必须会! 作为一个程序员,内存的这些硬核知识你必须懂! 这些知识可以说是我们之前都不太重视的基础知识,可能大家在上大学的时候都学习过了,但是嘞,当时由于老师讲解的没那么有趣,又加上这些知识本身就比较枯燥,所以嘞,大家当初几乎等于没学。 再说啦,学习这些,也看不出来有什么用啊!...
这个世界上人真的分三六九等,你信吗?
偶然间,在知乎上看到一个问题 一时间,勾起了我深深的回忆。 以前在厂里打过两次工,做过家教,干过辅导班,做过中介。零下几度的晚上,贴过广告,满脸、满手地长冻疮。 再回首那段岁月,虽然苦,但让我学会了坚持和忍耐。让我明白了,在这个世界上,无论环境多么的恶劣,只要心存希望,星星之火,亦可燎原。 下文是原回答,希望能对你能有所启发。 如果我说,这个世界上人真的分三六九等,...
2020年全新Java学习路线图,含配套视频,学完即为中级Java程序员!!
新的一年来临,突如其来的疫情打破了平静的生活! 在家的你是否很无聊,如果无聊就来学习吧! 世上只有一种投资只赚不赔,那就是学习!!! 传智播客于2020年升级了Java学习线路图,硬核升级,免费放送! 学完你就是中级程序员,能更快一步找到工作! 一、Java基础 JavaSE基础是Java中级程序员的起点,是帮助你从小白到懂得编程的必经之路。 在Java基础板块中有6个子模块的学...
B 站上有哪些很好的学习资源?
哇说起B站,在小九眼里就是宝藏般的存在,放年假宅在家时一天刷6、7个小时不在话下,更别提今年的跨年晚会,我简直是跪着看完的!! 最早大家聚在在B站是为了追番,再后来我在上面刷欧美新歌和漂亮小姐姐的舞蹈视频,最近两年我和周围的朋友们已经把B站当作学习教室了,而且学习成本还免费,真是个励志的好平台ヽ(.◕ฺˇд ˇ◕ฺ;)ノ 下面我们就来盘点一下B站上优质的学习资源: 综合类 Oeasy: 综合...
爬取薅羊毛网站百度云资源
这是疫情期间无聊做的爬虫, 去获取暂时用不上的教程 import threading import time import pandas as pd import requests import re from threading import Thread, Lock # import urllib.request as request # req=urllib.request.Requ...
如何优雅地打印一个Java对象?
你好呀,我是沉默王二,一个和黄家驹一样身高,和刘德华一样颜值的程序员。虽然已经写了十多年的 Java 代码,但仍然觉得自己是个菜鸟(请允许我惭愧一下)。 在一个月黑风高的夜晚,我思前想后,觉得再也不能这么蹉跎下去了。于是痛下决心,准备通过输出的方式倒逼输入,以此来修炼自己的内功,从而进阶成为一名真正意义上的大神。与此同时,希望这些文章能够帮助到更多的读者,让大家在学习的路上不再寂寞、空虚和冷。 ...
雷火神山直播超两亿,Web播放器事件监听是怎么实现的?
Web播放器解决了在手机浏览器和PC浏览器上播放音视频数据的问题,让视音频内容可以不依赖用户安装App,就能进行播放以及在社交平台进行传播。在视频业务大数据平台中,播放数据的统计分析非常重要,所以Web播放器在使用过程中,需要对其内部的数据进行收集并上报至服务端,此时,就需要对发生在其内部的一些播放行为进行事件监听。 那么Web播放器事件监听是怎么实现的呢? 01 监听事件明细表 名...
3万字总结,Mysql优化之精髓
本文知识点较多,篇幅较长,请耐心学习 MySQL已经成为时下关系型数据库产品的中坚力量,备受互联网大厂的青睐,出门面试想进BAT,想拿高工资,不会点MySQL优化知识,拿offer的成功率会大大下降。 为什么要优化 系统的吞吐量瓶颈往往出现在数据库的访问速度上 随着应用程序的运行,数据库的中的数据会越来越多,处理时间会相应变慢 数据是存放在磁盘上的,读写速度无法和内存相比 如何优化 设计...
HTML5适合的情人节礼物有纪念日期功能
前言 利用HTML5,css,js实现爱心树 以及 纪念日期的功能 网页有播放音乐功能 以及打字倾诉感情的画面,非常适合情人节送给女朋友 具体的HTML代码 具体只要修改代码里面的男某某和女某某 文字段也可自行修改,还有代码下半部分的JS代码需要修改一下起始日期 注意月份为0~11月 也就是月份需要减一。 当然只有一部分HTML和JS代码不够运行的,文章最下面还附加了完整代码的下载地址 &lt;!...
相关热词 c#开发的dll注册 c#的反射 c# grid绑定数据源 c#多线程怎么循环 c# 鼠标左键 c# char占位符 c# 日期比较 c#16进制转换为int c#用递归求顺序表中最大 c#小型erp源代码
立即提问