Maven项目pom.xml文件不报错,但maven project显示红色波浪,哪些原因造成的 ? 5C

图片说明

weixin_42046751
且随疾风前行_go 问题已经解决。
7 个月之前 回复
weixin_42046751
且随疾风前行_go 从Spring官网查看 Spring Cloud Finchley.SR1,它下面并没有 feign 模块,而是 Spring Cloud Openfeign模块,版本是 2.0.1.RELEASE。所以,把 feign 改成 openfeign 就可以了
7 个月之前 回复

4个回答

右侧依赖红波浪问题其实很容易出现,只要项目中没有编译错误,其实是不影响的。我也经常碰到,多 clean 几次,有时候就自己消失了。

caozhy
每个人都有一个梦才不会孤单的说话就有天堂 正解,问题解决请采纳
7 个月之前 回复

把所在目录clear,完了重新加载一下,如果不是就是缺包,我之前有过一次,是缺少一个Oracle的包,

问题分析:
  1、由于更换了地址,IDEA中的Maven仓库可能配置错误;
  2、jar包可能错误;
  3、jar包版本错误;
解决方法:
  1、检查IDEA中的MAVEN配置,IDEA中默认配置的是C盘m2仓库,重新配置IDEA中MAVEN仓库;
  2、删除repository中对应的jar包的文件夹,刷新,让Maven重新下载;
  3、删除POM文件中与之对应的依赖,然后重新添加依赖,错误消失。

Csdn user default icon
上传中...
上传图片
插入图片
抄袭、复制答案,以达到刷声望分或其他目的的行为,在CSDN问答是严格禁止的,一经发现立刻封号。是时候展现真正的技术了!
其他相关推荐
创建Maven项目 pom.xml文件报错
创建maven项目 pom.xml文件提示错误: Failure to transfer org.apache.maven.surefire:surefire:pom:2.10 from http://repo.maven.apache.org/maven2 was cached in the local repository, resolution will not be reattempted until the update interval of central has elapsed or updates are forced. Original error: Could not transfer artifact org.apache.maven.surefire:surefire:pom:2.10 from/to central (http://repo.maven.apache.org/maven2): java.net.ConnectException: connection timed out to http://repo.maven.apache.org/maven2/org/apache/maven/surefire/surefire/2.10/surefire-2.10.pom 在网上搜索后给出的解决方法是 打开maven的本地库...\repository\org\apache\maven\plugins\maven-surefire-plugin\2.10会发现:里面少只有一个maven-surefire-plugin-2.10.pom.lastUpdated,而没有maven-surefire-plugin-2.10.jar 解决方法: 1.删除maven-surefire-plugin-2.7.1.pom.lastUpdated文件 2.右键点击project -> Maven - Update Dependencies 但我的本地库有aven-surefire-plugin-2.10.jar以及相关文件 没有maven-surefire-plugin-2.10.pom.lastUpdated文件 怎么还报这样的错误 在网上搜索好长时间 一直没有解决 求大神指点!! 谢谢
myeclipse10创建maven,pom.xml报错org.apache.maven.archiver.MavenArchiver.getManifest
pom.xml报错,org.apache.maven.archiver.MavenArchiver.getManifest(org.apache.maven.project.MavenProject, org.apache.maven.archiver.MavenArchiveConfiguration)我在百度上搜了方法,在help选 install new sofware 然添加链接。但是下载不来下,还时在报错, ,大神们这怎么解决啊,这个问题困了我两天了,头疼啊!![图片说明](https://img-ask.csdn.net/upload/201901/30/1548860838_416589.png) 难道还跟我用的myeclipse有关吗,我用的时myeclipse10
myeclipse建立maven是pom.xml报错
用MyEclipse10建立maven web工程的时候,POM.XML总是报错,错误信息如下。还请大神们帮帮忙啊~~ 小弟感激涕零!! Multiple annotations found at this line: - No plugin found for prefix 'war' in the current project and in the plugin groups [] available from the repositories [local (C:\Users\Guan Yang\.m2\repository), central (http://repo1.maven.org/maven2)] - Failure to transfer org.apache.maven.plugins:maven-resources-plugin:pom:2.4.3 from http:// repo1.maven.org/maven2 was cached in the local repository, resolution will not be reattempted until the update interval of central has elapsed or updates are forced. Original error: Could not transfer artifact org.apache.maven.plugins:maven-resources-plugin:pom:2.4.3 from/to central (http://repo1.maven.org/maven2): null to http://repo1.maven.org/maven2/org/apache/maven/plugins/maven-resources-plugin/2.4.3/maven-resources- plugin-2.4.3.pom
maven项目pom.xml报错
配置文件如图,错误如下: -The parameters 'finalName' for goal org.apache.maven.plugins:maven-jar-plugin:2.4:jar are missing or invalid -The project cannot be built until build path errors are resolved 该如何解决?![图片说明](https://img-ask.csdn.net/upload/201807/27/1532662553_952578.png)
Myeclipse10 Maven pom.xml报错
我电脑上面有eclipse和MyEclipse都有,在eclipse中重SVN上面下载项目没有错!但是在MyEclipse中下载下来pom.xml就报错~! 报错: Project build error: Non-resolvable parent POM: Could not find artifact com.ifec.blueair:blueair-packagemanager:pom:0.0.1-SNAPSHOT and 'parent.relativePath' points at wrong local POM 而且在MyEclipse中还缺省100多个包! eclipse下载下来的项目,所需要的包都有下载到本地,而MyEclipse怎么就没有把需要的包下载下来呢?MyEclipse连接的是我自己安装的Maven,测试Maven安装成功了的
maven项目导入之后pom.xml报错
我项目导入之后,pom.xml有红叉,找不到jar包,但是我本地仓库有这个jar包,不知道为什么找不到,点了clean 又 maven--》update project还是报错 到底怎么回事,求教 ![图片说明](https://img-ask.csdn.net/upload/201612/23/1482479584_964743.png) ![图片说明](https://img-ask.csdn.net/upload/201612/26/1482716996_532677.png) ``` <?xml version="1.0"?> <project xsi:schemaLocation="http://maven.apache.org/POM/4.0.0 http://maven.apache.org/xsd/maven-4.0.0.xsd" xmlns="http://maven.apache.org/POM/4.0.0" xmlns:xsi="http://www.w3.org/2001/XMLSchema-instance"> <modelVersion>4.0.0</modelVersion> <parent> <artifactId>parent</artifactId> <groupId>com.auchan</groupId> <version>1.0.0-SNAPSHOT</version> </parent> <groupId>com.auchan.web</groupId> <artifactId>web</artifactId> <packaging>war</packaging> <version>1.0.0-SNAPSHOT</version> <name>${project.artifactId} v${project.version}</name> <dependencies> <dependency> <groupId>junit</groupId> <artifactId>junit</artifactId> </dependency> <!--inner project dependency start --> <dependency> <groupId>com.auchan.service</groupId> <artifactId>service</artifactId> <version>${training.version}</version> <exclusions> <exclusion> <artifactId>commons-fileupload</artifactId> <groupId>commons-fileupload</groupId> </exclusion> <exclusion> <artifactId>log4j</artifactId> <groupId>log4j</groupId> </exclusion> </exclusions> </dependency> <dependency> <groupId>com.auchan.engine</groupId> <artifactId>engine</artifactId> <version>${training.version}</version> </dependency> <!--inner project dependency end --> <dependency> <groupId>org.tuckey</groupId> <artifactId>urlrewrite</artifactId> </dependency> <dependency> <groupId>org.mortbay.jetty</groupId> <artifactId>jetty</artifactId> </dependency> <dependency> <groupId>org.mortbay.jetty</groupId> <artifactId>jetty-util</artifactId> </dependency> <dependency> <groupId>org.mortbay.jetty</groupId> <artifactId>jetty-naming</artifactId> </dependency> <dependency> <groupId>org.mortbay.jetty</groupId> <artifactId>jetty-plus</artifactId> </dependency> <dependency> <groupId>org.mortbay.jetty</groupId> <artifactId>jsp-2.1</artifactId> </dependency> <dependency> <groupId>org.mortbay.jetty</groupId> <artifactId>jsp-api-2.1</artifactId> </dependency> <!--generate validate code denpendency --> <dependency> <groupId>com.googlecode</groupId> <artifactId>kaptcha</artifactId> </dependency> </dependencies> </project> ```
Maven的pom.xml第一行报错,显示未知错误,哪位大佬能帮忙解决下,不胜感激!
问题rt 代码如下: ![图片说明](https://img-ask.csdn.net/upload/201906/12/1560350057_455880.png) ![图片说明](https://img-ask.csdn.net/upload/201906/12/1560350062_430379.png) ``` <?xml version="1.0" encoding="UTF-8"?> <project xmlns="http://maven.apache.org/POM/4.0.0" xmlns:xsi="http://www.w3.org/2001/XMLSchema-instance" xsi:schemaLocation="http://maven.apache.org/POM/4.0.0 http://maven.apache.org/xsd/maven-4.0.0.xsd"> <modelVersion>4.0.0</modelVersion> <!-- 从spring-boot-starter-parent继承版本号 --> <parent> <groupId>org.springframework.boot</groupId> <artifactId>spring-boot-starter-parent</artifactId> <version>2.1.5.RELEASE</version> <relativePath/> <!-- lookup parent from repository --> </parent> <groupId>com.manning</groupId> <artifactId>readinglist</artifactId> <version>0.0.1-SNAPSHOT</version> <name>Reading List</name> <description>Reading List Demo</description> <properties> <java.version>1.8</java.version> </properties> <!-- 起步依赖 --> <dependencies> <dependency> <groupId>org.springframework.boot</groupId> <artifactId>spring-boot-starter-data-jpa</artifactId> </dependency> <dependency> <groupId>org.springframework.boot</groupId> <artifactId>spring-boot-starter-thymeleaf</artifactId> </dependency> <dependency> <groupId>org.springframework.boot</groupId> <artifactId>spring-boot-starter-web</artifactId> </dependency> <dependency> <groupId>com.h2database</groupId> <artifactId>h2</artifactId> <scope>runtime</scope> </dependency> <dependency> <groupId>org.springframework.boot</groupId> <artifactId>spring-boot-starter-test</artifactId> <scope>test</scope> </dependency> </dependencies> <!-- maven构建插件 --> <build> <plugins> <plugin> <groupId>org.springframework.boot</groupId> <artifactId>spring-boot-maven-plugin</artifactId> </plugin> </plugins> </build> </project> ```
怎么查看maven的pom.xml是否成功下载了所需jar包
## 如题,pom.xml动不动就要报错,不知道是不是因为没有成功下载jar的原因? ![图片说明](https://img-ask.csdn.net/upload/201606/23/1466666764_888875.jpg) Multiple annotations found at this line: - Missing artifact org.apache.maven:maven-artifact:jar:2.0.6:compile - Missing artifact org.apache.maven.shared:maven-filtering:jar:1.0-beta-4:compile - Missing artifact org.apache.maven:maven-profile:jar:2.0.6:compile - Missing artifact org.apache.maven.reporting:maven-reporting-api:jar: 2.0.6:compile - Missing artifact org.apache.maven:maven-plugin-descriptor:jar:2.0.6:compile - Missing artifact org.apache.maven.wagon:wagon-ssh:jar:1.0-beta-2:runtime - Missing artifact org.apache.maven.wagon:wagon-ssh-external:jar:1.0- beta-2:runtime - Missing artifact org.apache.maven:maven-artifact-manager:jar:2.0.6:compile - Missing artifact org.apache.maven:maven-plugin-registry:jar:2.0.6:compile - Missing artifact org.apache.maven:maven-project:jar:2.0.6:compile - Missing artifact org.apache.maven:maven-plugin-api:jar:2.0.6:compile - Missing artifact org.codehaus.plexus:plexus-utils:jar:2.0.5:compile - Missing artifact com.jcraft:jsch:jar:0.1.27:runtime - Missing artifact commons-cli:commons-cli:jar:1.0:compile - Missing artifact org.apache.maven.wagon:wagon-ssh-common:jar:1.0- beta-2:runtime - Missing artifact org.codehaus.plexus:plexus-interactivity-api:jar:1.0- alpha-4:compile - Missing artifact org.wisdom-framework:mysql-connector-java:jar:5.1.34_1:compile - Failed to read artifact descriptor for org.wisdom-framework:abstract-jdbc- driver:jar:0.5 - Missing artifact org.apache.maven.wagon:wagon-file:jar:1.0-beta-2:runtime - Missing artifact org.sonatype.plexus:plexus-build-api:jar:0.0.4:compile - Missing artifact classworlds:classworlds:jar:1.1:compile - Missing artifact org.apache.maven.plugins:maven-resources-plugin:jar: 2.4.3:compile - Missing artifact org.apache.felix:org.apache.felix.ipojo.annotations:jar: 1.12.1:compile - Missing artifact org.codehaus.plexus:plexus-interpolation:jar:1.13:compile - Missing artifact org.apache.maven.wagon:wagon-provider-api:jar:1.0- beta-2:compile - Missing artifact org.apache.maven:maven-monitor:jar:2.0.6:compile - Missing artifact xml-apis:xml-apis:jar:1.0.b2:runtime - Missing artifact org.apache.maven.wagon:wagon-http-shared:jar:1.0- beta-2:runtime - Missing artifact jtidy:jtidy:jar:4aug2000r7-dev:runtime - Missing artifact org.apache.maven:maven-core:jar:2.0.6:compile - Missing artifact org.apache.maven:maven-settings:jar:2.0.6:compile - Missing artifact org.apache.maven:maven-model:jar:2.0.6:compile - Missing artifact org.apache.maven.doxia:doxia-sink-api:jar:1.0-alpha-7:compile - Missing artifact org.apache.maven.wagon:wagon-http-lightweight:jar:1.0- beta-2:runtime - Missing artifact org.apache.maven:maven-repository-metadata:jar:2.0.6:compile - Missing artifact org.apache.maven:maven-error-diagnostics:jar:2.0.6:compile - Missing artifact org.codehaus.plexus:plexus-container-default:jar:1.0-alpha-9- stable-1:compile - Missing artifact junit:junit:jar:3.8.1:test - Missing artifact org.apache.maven:maven-plugin-parameter-documenter:jar: 2.0.6:compile
在做一个淘淘商城的项目,出现了子项目pom.xml报错的问题
子项目pom.xml区 ``` <project xmlns="http://maven.apache.org/POM/4.0.0" xmlns:xsi="http://www.w3.org/2001/XMLSchema-instance" xsi:schemaLocation="http://maven.apache.org/POM/4.0.0 http://maven.apache.org/xsd/maven-4.0.0.xsd"> <modelVersion>4.0.0</modelVersion> <parent> <groupId>cn.itcast.parent</groupId> <artifactId>itcast-parent</artifactId> <version>0.0.1-SNAPSHOT</version> </parent> <groupId>cn.itcast.usermanage</groupId> <artifactId>itcast-usermanage</artifactId> <version>1.0.0-SNAPSHOT</version> <packaging>war</packaging> <dependencies> <!-- 单元测试 --> <dependency> <groupId>junit</groupId> <artifactId>junit</artifactId> <scope>test</scope> </dependency> <dependency> <groupId>org.springframework</groupId> <artifactId>spring-webmvc</artifactId> </dependency> <dependency> <groupId>org.springframework</groupId> <artifactId>spring-jdbc</artifactId> </dependency> <dependency> <groupId>org.springframework</groupId> <artifactId>spring-aspects</artifactId> </dependency> <!-- Mybatis --> <dependency> <groupId>org.mybatis</groupId> <artifactId>mybatis</artifactId> </dependency> <dependency> <groupId>org.mybatis</groupId> <artifactId>mybatis-spring</artifactId> </dependency> <!-- MySql --> <dependency> <groupId>mysql</groupId> <artifactId>mysql-connector-java</artifactId> </dependency> <dependency> <groupId>org.slf4j</groupId> <artifactId>slf4j-log4j12</artifactId> </dependency> <!-- Jackson Json处理工具包 --> <dependency> <groupId>com.fasterxml.jackson.core</groupId> <artifactId>jackson-databind</artifactId> </dependency> <!-- 连接池 --> <dependency> <groupId>com.jolbox</groupId> <artifactId>bonecp-spring</artifactId> </dependency> <!-- JSP相关 --> <dependency> <groupId>jstl</groupId> <artifactId>jstl</artifactId> </dependency> <dependency> <groupId>javax.servlet</groupId> <artifactId>servlet-api</artifactId> <scope>provided</scope> </dependency> <dependency> <groupId>javax.servlet</groupId> <artifactId>jsp-api</artifactId> <scope>provided</scope> </dependency> <!-- Apache工具组件 --> <dependency> <groupId>org.apache.commons</groupId> <artifactId>commons-lang3</artifactId> </dependency> <dependency> <groupId>org.apache.commons</groupId> <artifactId>commons-io</artifactId> </dependency> <dependency> <groupId>com.github.pagehelper</groupId> <artifactId>pagehelper</artifactId> </dependency> <dependency> <groupId>com.github.jsqlparser</groupId> <artifactId>jsqlparser</artifactId> </dependency> <dependency> <groupId>com.github.abel533</groupId> <artifactId>mapper</artifactId> </dependency> </dependencies> <build> <plugins> <!-- 配置Tomcat插件 --> <plugin> <groupId>org.apache.tomcat.maven</groupId> <artifactId>tomcat7-maven-plugin</artifactId> <configuration> <port>80</port> <!-- http://127.0.0.1:{port}/{path} --> <path>/</path> </configuration> </plugin> </plugins> </build> </project> ``` 报错问题代码区: ``` Multiple annotations found at this line: - Execution default-resources of goal org.apache.maven.plugins:maven-resources-plugin:2.7:resources failed: Plugin org.apache.maven.plugins:maven-resources-plugin:2.7 or one of its dependencies could not be resolved: The following artifacts could not be resolved: org.apache.maven.doxia:doxia-sink-api:jar:1.1, org.apache.maven.doxia:doxia-logging-api:jar:1.1, org.apache.maven:maven-repository-metadata:jar:2.2.1, org.apache.maven:maven-error-diagnostics:jar:2.2.1, org.apache.maven:maven- plugin-descriptor:jar:2.2.1, org.sonatype.plexus:plexus-sec-dispatcher:jar:1.3, org.sonatype.plexus:plexus-cipher:jar:1.4, org.apache.maven:maven-settings:jar:2.2.1, org.apache.maven:maven-monitor:jar:2.2.1: Failure to transfer org.apache.maven.doxia:doxia- sink-api:jar:1.1 from http://maven.aliyun.com/nexus/content/repositories/central/ was cached in the local repository, resolution will not be reattempted until the update interval of alimaven has elapsed or updates are forced. Original error: Could not transfer artifact org.apache.maven.doxia:doxia-sink-api:jar:1.1 from/to alimaven (http://maven.aliyun.com/nexus/content/repositories/central/): The operation was cancelled. (org.apache.maven.plugins:maven-resources-plugin:2.7:resources:default-resources:process-resources) org.apache.maven.plugin.PluginExecutionException: Execution default-resources of goal org.apache.maven.plugins:maven-resources- plugin:2.7:resources failed: Plugin org.apache.maven.plugins:maven-resources-plugin:2.7 or one of its dependencies could not be resolved: The following artifacts could not be resolved: org.apache.maven.doxia:doxia-sink-api:jar:1.1, org.apache.maven.doxia:doxia- logging-api:jar:1.1, org.apache.maven:maven-repository-metadata:jar:2.2.1, org.apache.maven:maven-error-diagnostics:jar:2.2.1, org.apache.maven:maven-plugin-descriptor:jar:2.2.1, org.sonatype.plexus:plexus-sec-dispatcher:jar:1.3, org.sonatype.plexus:plexus- cipher:jar:1.4, org.apache.maven:maven-settings:jar:2.2.1, org.apache.maven:maven-monitor:jar:2.2.1: Failure to transfer org.apache.maven.doxia:doxia-sink-api:jar:1.1 from http://maven.aliyun.com/nexus/content/repositories/central/ was cached in the local repository, resolution will not be reattempted until the update interval of alimaven has elapsed or updates are forced. Original error: Could not transfer artifact org.apache.maven.doxia:doxia-sink-api:jar:1.1 from/to alimaven (http://maven.aliyun.com/nexus/content/ repositories/central/): The operation was cancelled. at org.apache.maven.plugin.DefaultBuildPluginManager.executeMojo(DefaultBuildPluginManager.java:109) at org.eclipse.m2e.core.internal.embedder.MavenImpl.execute(MavenImpl.java:331) at org.eclipse.m2e.core.internal.embedder.MavenImpl.lambda$7(MavenImpl.java:1342) at org.eclipse.m2e.core.internal.embedder.MavenExecutionContext.executeBare(MavenExecutionContext.java:177) at org.eclipse.m2e.core.internal.embedder.MavenExecutionContext.execute(MavenExecutionContext.java:112) at org.eclipse.m2e.core.internal.embedder.MavenImpl.execute(MavenImpl.java:1341) at org.eclipse.m2e.core.project.configurator.MojoExecutionBuildParticipant.build(MojoExecutionBuildParticipant.java:52) at org.eclipse.m2e.core.internal.builder.MavenBuilderImpl.build(MavenBuilderImpl.java:137) at org.eclipse.m2e.core.internal.builder.MavenBuilder$1.method(MavenBuilder.java:173) at org.eclipse.m2e.core.internal.builder.MavenBuilder$1.method(MavenBuilder.java:1) at org.eclipse.m2e.core.internal.builder.MavenBuilder$BuildMethod$1$1.call(MavenBuilder.java:116) at org.eclipse.m2e.core.internal.embedder.MavenExecutionContext.executeBare(MavenExecutionContext.java:177) at org.eclipse.m2e.core.internal.embedder.MavenExecutionContext.execute(MavenExecutionContext.java:112) at org.eclipse.m2e.core.internal.builder.MavenBuilder$BuildMethod$1.call(MavenBuilder.java:106) at org.eclipse.m2e.core.internal.embedder.MavenExecutionContext.executeBare(MavenExecutionContext.java:177) at org.eclipse.m2e.core.internal.embedder.MavenExecutionContext.execute(MavenExecutionContext.java:151) at org.eclipse.m2e.core.internal.embedder.MavenExecutionContext.execute(MavenExecutionContext.java:99) at org.eclipse.m2e.core.internal.builder.MavenBuilder$BuildMethod.execute(MavenBuilder.java:87) at org.eclipse.m2e.core.internal.builder.MavenBuilder.build(MavenBuilder.java:201) at org.eclipse.core.internal.events.BuildManager$2.run(BuildManager.java:833) at org.eclipse.core.runtime.SafeRunner.run(SafeRunner.java: 45) at org.eclipse.core.internal.events.BuildManager.basicBuild(BuildManager.java:220) at org.eclipse.core.internal.events.BuildManager.basicBuild(BuildManager.java:263) at org.eclipse.core.internal.events.BuildManager$1.run(BuildManager.java:316) at org.eclipse.core.runtime.SafeRunner.run(SafeRunner.java: 45) at org.eclipse.core.internal.events.BuildManager.basicBuild(BuildManager.java:319) at org.eclipse.core.internal.events.BuildManager.basicBuildLoop(BuildManager.java:371) at org.eclipse.core.internal.events.BuildManager.build(BuildManager.java:392) at org.eclipse.core.internal.events.AutoBuildJob.doBuild(AutoBuildJob.java:154) at org.eclipse.core.internal.events.AutoBuildJob.run(AutoBuildJob.java:244) at org.eclipse.core.internal.jobs.Worker.run(Worker.java:63) Caused by: org.apache.maven.plugin.PluginResolutionException: Plugin org.apache.maven.plugins:maven-resources-plugin:2.7 or one of its dependencies could not be resolved: The following artifacts could not be resolved: org.apache.maven.doxia:doxia-sink-api:jar:1.1, org.apache.maven.doxia:doxia-logging-api:jar:1.1, org.apache.maven:maven-repository-metadata:jar:2.2.1, org.apache.maven:maven- error-diagnostics:jar:2.2.1, org.apache.maven:maven-plugin-descriptor:jar:2.2.1, org.sonatype.plexus:plexus-sec-dispatcher:jar:1.3, org.sonatype.plexus:plexus-cipher:jar:1.4, org.apache.maven:maven-settings:jar:2.2.1, org.apache.maven:maven-monitor:jar:2.2.1: Failure to transfer org.apache.maven.doxia:doxia-sink-api:jar:1.1 from http://maven.aliyun.com/nexus/content/repositories/central/ was cached in the local repository, resolution will not be reattempted until the update interval of alimaven has elapsed or updates are forced. Original error: Could not transfer artifact org.apache.maven.doxia:doxia-sink-api:jar:1.1 from/to alimaven (http://maven.aliyun.com/nexus/ content/repositories/central/): The operation was cancelled. at org.apache.maven.plugin.internal.DefaultPluginDependenciesResolver.resolveInternal(DefaultPluginDependenciesResolver.java:218) at org.apache.maven.plugin.internal.DefaultPluginDependenciesResolver.resolve(DefaultPluginDependenciesResolver.java:149) at org.eclipse.m2e.core.internal.project.registry.EclipsePluginDependenciesResolver.resolve(EclipsePluginDependenciesResolver.java:59) at org.apache.maven.plugin.internal.DefaultMavenPluginManager.createPluginRealm(DefaultMavenPluginManager.java:402) at org.apache.maven.plugin.internal.DefaultMavenPluginManager.setupPluginRealm(DefaultMavenPluginManager.java:374) at org.apache.maven.plugin.DefaultBuildPluginManager.getPluginRealm(DefaultBuildPluginManager.java:234) at org.apache.maven.plugin.DefaultBuildPluginManager.executeMojo(DefaultBuildPluginManager.java:105) ... 30 more Caused by: org.eclipse.aether.resolution.ArtifactResolutionException: The following artifacts could not be resolved: org.apache.maven.doxia:doxia- sink-api:jar:1.1, org.apache.maven.doxia:doxia-logging-api:jar:1.1, org.apache.maven:maven-repository-metadata:jar:2.2.1, org.apache.maven:maven-error-diagnostics:jar:2.2.1, org.apache.maven:maven-plugin-descriptor:jar:2.2.1, org.sonatype.plexus:plexus- sec-dispatcher:jar:1.3, org.sonatype.plexus:plexus-cipher:jar:1.4, org.apache.maven:maven-settings:jar:2.2.1, org.apache.maven:maven- monitor:jar:2.2.1: Failure to transfer org.apache.maven.doxia:doxia-sink-api:jar:1.1 from http://maven.aliyun.com/nexus/content/ repositories/central/ was cached in the local repository, resolution will not be reattempted until the update interval of alimaven has elapsed or updates are forced. Original error: Could not transfer artifact org.apache.maven.doxia:doxia-sink-api:jar:1.1 from/to alimaven (http://maven.aliyun.com/nexus/content/repositories/central/): The operation was cancelled. at org.eclipse.aether.internal.impl.DefaultArtifactResolver.resolve(DefaultArtifactResolver.java:422) at org.eclipse.aether.internal.impl.DefaultArtifactResolver.resolveArtifacts(DefaultArtifactResolver.java:224) at org.eclipse.aether.internal.impl.DefaultRepositorySystem.resolveDependencies(DefaultRepositorySystem.java:338) at org.apache.maven.plugin.internal.DefaultPluginDependenciesResolver.resolveInternal(DefaultPluginDependenciesResolver.java:210) ... 36 more Caused by: org.eclipse.aether.transfer.ArtifactTransferException: Failure to transfer org.apache.maven.doxia:doxia-sink-api:jar: 1.1 from http://maven.aliyun.com/nexus/content/repositories/central/ was cached in the local repository, resolution will not be reattempted until the update interval of alimaven has elapsed or updates are forced. Original error: Could not transfer artifact org.apache.maven.doxia:doxia-sink-api:jar:1.1 from/to alimaven (http://maven.aliyun.com/nexus/content/repositories/central/): The operation was cancelled. at org.eclipse.aether.internal.impl.DefaultUpdateCheckManager.newException(DefaultUpdateCheckManager.java:240) at org.eclipse.aether.internal.impl.DefaultUpdateCheckManager.checkArtifact(DefaultUpdateCheckManager.java:208) at org.eclipse.aether.internal.impl.DefaultArtifactResolver.gatherDownloads(DefaultArtifactResolver.java:563) at org.eclipse.aether.internal.impl.DefaultArtifactResolver.performDownloads(DefaultArtifactResolver.java:481) at org.eclipse.aether.internal.impl.DefaultArtifactResolver.resolve(DefaultArtifactResolver.java:399) ... 39 more - Execution default-testResources of goal org.apache.maven.plugins:maven-resources-plugin:2.7:testResources failed: Plugin org.apache.maven.plugins:maven-resources-plugin:2.7 or one of its dependencies could not be resolved: The following artifacts could not be resolved: org.apache.maven.doxia:doxia-sink-api:jar:1.1, org.apache.maven.doxia:doxia-logging-api:jar:1.1, org.apache.maven:maven-repository-metadata:jar:2.2.1, org.apache.maven:maven-error-diagnostics:jar:2.2.1, org.apache.maven:maven- plugin-descriptor:jar:2.2.1, org.sonatype.plexus:plexus-sec-dispatcher:jar:1.3, org.sonatype.plexus:plexus-cipher:jar:1.4, org.apache.maven:maven-settings:jar:2.2.1, org.apache.maven:maven-monitor:jar:2.2.1: Failure to transfer org.apache.maven.doxia:doxia- sink-api:jar:1.1 from http://maven.aliyun.com/nexus/content/repositories/central/ was cached in the local repository, resolution will not be reattempted until the update interval of alimaven has elapsed or updates are forced. Original error: Could not transfer artifact org.apache.maven.doxia:doxia-sink-api:jar:1.1 from/to alimaven (http://maven.aliyun.com/nexus/content/repositories/central/): The operation was cancelled. (org.apache.maven.plugins:maven-resources-plugin:2.7:testResources:default-testResources:process-test- resources) org.apache.maven.plugin.PluginExecutionException: Execution default-testResources of goal org.apache.maven.plugins:maven-resources-plugin:2.7:testResources failed: Plugin org.apache.maven.plugins:maven-resources-plugin: 2.7 or one of its dependencies could not be resolved: The following artifacts could not be resolved: org.apache.maven.doxia:doxia-sink- api:jar:1.1, org.apache.maven.doxia:doxia-logging-api:jar:1.1, org.apache.maven:maven-repository-metadata:jar:2.2.1, org.apache.maven:maven-error-diagnostics:jar:2.2.1, org.apache.maven:maven-plugin-descriptor:jar:2.2.1, org.sonatype.plexus:plexus- sec-dispatcher:jar:1.3, org.sonatype.plexus:plexus-cipher:jar:1.4, org.apache.maven:maven-settings:jar:2.2.1, org.apache.maven:maven- monitor:jar:2.2.1: Failure to transfer org.apache.maven.doxia:doxia-sink-api:jar:1.1 from http://maven.aliyun.com/nexus/content/ repositories/central/ was cached in the local repository, resolution will not be reattempted until the update interval of alimaven has elapsed or updates are forced. Original error: Could not transfer artifact org.apache.maven.doxia:doxia-sink-api:jar:1.1 from/to alimaven (http://maven.aliyun.com/nexus/content/repositories/central/): The operation was cancelled. at org.apache.maven.plugin.DefaultBuildPluginManager.executeMojo(DefaultBuildPluginManager.java:109) at org.eclipse.m2e.core.internal.embedder.MavenImpl.execute(MavenImpl.java:331) at org.eclipse.m2e.core.internal.embedder.MavenImpl.lambda$7(MavenImpl.java:1342) at org.eclipse.m2e.core.internal.embedder.MavenExecutionContext.executeBare(MavenExecutionContext.java:177) at org.eclipse.m2e.core.internal.embedder.MavenExecutionContext.execute(MavenExecutionContext.java:112) at org.eclipse.m2e.core.internal.embedder.MavenImpl.execute(MavenImpl.java:1341) at org.eclipse.m2e.core.project.configurator.MojoExecutionBuildParticipant.build(MojoExecutionBuildParticipant.java:52) at org.eclipse.m2e.core.internal.builder.MavenBuilderImpl.build(MavenBuilderImpl.java:137) at org.eclipse.m2e.core.internal.builder.MavenBuilder$1.method(MavenBuilder.java:173) at org.eclipse.m2e.core.internal.builder.MavenBuilder$1.method(MavenBuilder.java:1) at org.eclipse.m2e.core.internal.builder.MavenBuilder$BuildMethod$1$1.call(MavenBuilder.java:116) at org.eclipse.m2e.core.internal.embedder.MavenExecutionContext.executeBare(MavenExecutionContext.java:177) at org.eclipse.m2e.core.internal.embedder.MavenExecutionContext.execute(MavenExecutionContext.java:112) at org.eclipse.m2e.core.internal.builder.MavenBuilder$BuildMethod$1.call(MavenBuilder.java:106) at org.eclipse.m2e.core.internal.embedder.MavenExecutionContext.executeBare(MavenExecutionContext.java:177) at org.eclipse.m2e.core.internal.embedder.MavenExecutionContext.execute(MavenExecutionContext.java:151) at org.eclipse.m2e.core.internal.embedder.MavenExecutionContext.execute(MavenExecutionContext.java:99) at org.eclipse.m2e.core.internal.builder.MavenBuilder$BuildMethod.execute(MavenBuilder.java:87) at org.eclipse.m2e.core.internal.builder.MavenBuilder.build(MavenBuilder.java:201) at org.eclipse.core.internal.events.BuildManager$2.run(BuildManager.java:833) at org.eclipse.core.runtime.SafeRunner.run(SafeRunner.java: 45) at org.eclipse.core.internal.events.BuildManager.basicBuild(BuildManager.java:220) at org.eclipse.core.internal.events.BuildManager.basicBuild(BuildManager.java:263) at org.eclipse.core.internal.events.BuildManager$1.run(BuildManager.java:316) at org.eclipse.core.runtime.SafeRunner.run(SafeRunner.java: 45) at org.eclipse.core.internal.events.BuildManager.basicBuild(BuildManager.java:319) at org.eclipse.core.internal.events.BuildManager.basicBuildLoop(BuildManager.java:371) at org.eclipse.core.internal.events.BuildManager.build(BuildManager.java:392) at org.eclipse.core.internal.events.AutoBuildJob.doBuild(AutoBuildJob.java:154) at org.eclipse.core.internal.events.AutoBuildJob.run(AutoBuildJob.java:244) at org.eclipse.core.internal.jobs.Worker.run(Worker.java:63) Caused by: org.apache.maven.plugin.PluginResolutionException: Plugin org.apache.maven.plugins:maven-resources-plugin:2.7 or one of its dependencies could not be resolved: The following artifacts could not be resolved: org.apache.maven.doxia:doxia-sink-api:jar:1.1, org.apache.maven.doxia:doxia-logging-api:jar:1.1, org.apache.maven:maven-repository-metadata:jar:2.2.1, org.apache.maven:maven- error-diagnostics:jar:2.2.1, org.apache.maven:maven-plugin-descriptor:jar:2.2.1, org.sonatype.plexus:plexus-sec-dispatcher:jar:1.3, org.sonatype.plexus:plexus-cipher:jar:1.4, org.apache.maven:maven-settings:jar:2.2.1, org.apache.maven:maven-monitor:jar:2.2.1: Failure to transfer org.apache.maven.doxia:doxia-sink-api:jar:1.1 from http://maven.aliyun.com/nexus/content/repositories/central/ was cached in the local repository, resolution will not be reattempted until the update interval of alimaven has elapsed or updates are forced. Original error: Could not transfer artifact org.apache.maven.doxia:doxia-sink-api:jar:1.1 from/to alimaven (http://maven.aliyun.com/nexus/ content/repositories/central/): The operation was cancelled. at org.apache.maven.plugin.internal.DefaultPluginDependenciesResolver.resolveInternal(DefaultPluginDependenciesResolver.java:218) at org.apache.maven.plugin.internal.DefaultPluginDependenciesResolver.resolve(DefaultPluginDependenciesResolver.java:149) at org.eclipse.m2e.core.internal.project.registry.EclipsePluginDependenciesResolver.resolve(EclipsePluginDependenciesResolver.java:59) at org.apache.maven.plugin.internal.DefaultMavenPluginManager.createPluginRealm(DefaultMavenPluginManager.java:402) at org.apache.maven.plugin.internal.DefaultMavenPluginManager.setupPluginRealm(DefaultMavenPluginManager.java:374) at org.apache.maven.plugin.DefaultBuildPluginManager.getPluginRealm(DefaultBuildPluginManager.java:234) at org.apache.maven.plugin.DefaultBuildPluginManager.executeMojo(DefaultBuildPluginManager.java:105) ... 30 more Caused by: org.eclipse.aether.resolution.ArtifactResolutionException: The following artifacts could not be resolved: org.apache.maven.doxia:doxia- sink-api:jar:1.1, org.apache.maven.doxia:doxia-logging-api:jar:1.1, org.apache.maven:maven-repository-metadata:jar:2.2.1, org.apache.maven:maven-error-diagnostics:jar:2.2.1, org.apache.maven:maven-plugin-descriptor:jar:2.2.1, org.sonatype.plexus:plexus- sec-dispatcher:jar:1.3, org.sonatype.plexus:plexus-cipher:jar:1.4, org.apache.maven:maven-settings:jar:2.2.1, org.apache.maven:maven- monitor:jar:2.2.1: Failure to transfer org.apache.maven.doxia:doxia-sink-api:jar:1.1 from http://maven.aliyun.com/nexus/content/ repositories/central/ was cached in the local repository, resolution will not be reattempted until the update interval of alimaven has elapsed or updates are forced. Original error: Could not transfer artifact org.apache.maven.doxia:doxia-sink-api:jar:1.1 from/to alimaven (http://maven.aliyun.com/nexus/content/repositories/central/): The operation was cancelled. at org.eclipse.aether.internal.impl.DefaultArtifactResolver.resolve(DefaultArtifactResolver.java:422) at org.eclipse.aether.internal.impl.DefaultArtifactResolver.resolveArtifacts(DefaultArtifactResolver.java:224) at org.eclipse.aether.internal.impl.DefaultRepositorySystem.resolveDependencies(DefaultRepositorySystem.java:338) at org.apache.maven.plugin.internal.DefaultPluginDependenciesResolver.resolveInternal(DefaultPluginDependenciesResolver.java:210) ... 36 more Caused by: org.eclipse.aether.transfer.ArtifactTransferException: Failure to transfer org.apache.maven.doxia:doxia-sink-api:jar: 1.1 from http://maven.aliyun.com/nexus/content/repositories/central/ was cached in the local repository, resolution will not be reattempted until the update interval of alimaven has elapsed or updates are forced. Original error: Could not transfer artifact org.apache.maven.doxia:doxia-sink-api:jar:1.1 from/to alimaven (http://maven.aliyun.com/nexus/content/repositories/central/): The operation was cancelled. at org.eclipse.aether.internal.impl.DefaultUpdateCheckManager.newException(DefaultUpdateCheckManager.java:240) at org.eclipse.aether.internal.impl.DefaultUpdateCheckManager.checkArtifact(DefaultUpdateCheckManager.java:208) at org.eclipse.aether.internal.impl.DefaultArtifactResolver.gatherDownloads(DefaultArtifactResolver.java:563) at org.eclipse.aether.internal.impl.DefaultArtifactResolver.performDownloads(DefaultArtifactResolver.java:481) at org.eclipse.aether.internal.impl.DefaultArtifactResolver.resolve(DefaultArtifactResolver.java:399) ... 39 more ```
IDEA创建的SpringBoot项目,pom.xml在Eclipse上报错
总监非要我把IDEA换成SpringBoot的开发工具 sts(eclipse), 现在将我idea上的项目导入eclipse后,pom.xml报错: ![图片说明](https://img-ask.csdn.net/upload/201707/27/1501124939_360289.png) ![图片说明](https://img-ask.csdn.net/upload/201707/27/1501124968_8922.png) **完整信息如下:** For artifact {org.springframework.boot:spring-boot-starter-data-api:null:jar}: The version cannot be empty. (org.apache.maven.plugins:maven-resources-plugin:2.6:testResources:default-testResources:process-test-resources) org.apache.maven.artifact.InvalidArtifactRTException: For artifact {org.springframework.boot:spring-boot-starter-data-api:null:jar}: The version cannot be empty. at org.apache.maven.artifact.DefaultArtifact.validateIdentity(DefaultArtifact.java:148) at org.apache.maven.artifact.DefaultArtifact.<init>(DefaultArtifact.java:123) at org.apache.maven.artifact.factory.DefaultArtifactFactory.createArtifact(DefaultArtifactFactory.java:157) at org.apache.maven.artifact.factory.DefaultArtifactFactory.createDependencyArtifact(DefaultArtifactFactory.java:57) at org.apache.maven.project.artifact.MavenMetadataSource.createDependencyArtifact(MavenMetadataSource.java:328) at org.apache.maven.project.artifact.MavenMetadataSource.createArtifacts(MavenMetadataSource.java:503) at org.apache.maven.lifecycle.internal.DefaultProjectArtifactFactory.createArtifacts(DefaultProjectArtifactFactory.java:50) at org.apache.maven.lifecycle.internal.LifecycleDependencyResolver.resolveProjectDependencies(LifecycleDependencyResolver.java:119) at org.apache.maven.lifecycle.internal.MojoExecutor.ensureDependenciesAreResolved(MojoExecutor.java:245) at org.eclipse.m2e.core.internal.embedder.MavenImpl.execute(MavenImpl.java:330) at org.eclipse.m2e.core.internal.embedder.MavenImpl$11.call(MavenImpl.java:1362) at org.eclipse.m2e.core.internal.embedder.MavenImpl$11.call(MavenImpl.java:1) at org.eclipse.m2e.core.internal.embedder.MavenExecutionContext.executeBare(MavenExecutionContext.java:176) at org.eclipse.m2e.core.internal.embedder.MavenExecutionContext.execute(MavenExecutionContext.java:112) at org.eclipse.m2e.core.internal.embedder.MavenImpl.execute(MavenImpl.java:1360) at org.eclipse.m2e.core.project.configurator.MojoExecutionBuildParticipant.build(MojoExecutionBuildParticipant.java:52) at org.eclipse.m2e.core.internal.builder.MavenBuilderImpl.build(MavenBuilderImpl.java:137) at org.eclipse.m2e.core.internal.builder.MavenBuilder$1.method(MavenBuilder.java:172) at org.eclipse.m2e.core.internal.builder.MavenBuilder$1.method(MavenBuilder.java:1) at org.eclipse.m2e.core.internal.builder.MavenBuilder$BuildMethod$1$1.call(MavenBuilder.java:115) at org.eclipse.m2e.core.internal.embedder.MavenExecutionContext.executeBare(MavenExecutionContext.java:176) at org.eclipse.m2e.core.internal.embedder.MavenExecutionContext.execute(MavenExecutionContext.java:112) at org.eclipse.m2e.core.internal.builder.MavenBuilder$BuildMethod$1.call(MavenBuilder.java:105) at org.eclipse.m2e.core.internal.embedder.MavenExecutionContext.executeBare(MavenExecutionContext.java:176) at org.eclipse.m2e.core.internal.embedder.MavenExecutionContext.execute(MavenExecutionContext.java:151) at org.eclipse.m2e.core.internal.embedder.MavenExecutionContext.execute(MavenExecutionContext.java:99) at org.eclipse.m2e.core.internal.builder.MavenBuilder$BuildMethod.execute(MavenBuilder.java:86) at org.eclipse.m2e.core.internal.builder.MavenBuilder.build(MavenBuilder.java:200) at org.eclipse.core.internal.events.BuildManager$2.run(BuildManager.java:735) at org.eclipse.core.runtime.SafeRunner.run(SafeRunner.java:42) at org.eclipse.core.internal.events.BuildManager.basicBuild(BuildManager.java:206) at org.eclipse.core.internal.events.BuildManager.basicBuild(BuildManager.java:246) at org.eclipse.core.internal.events.BuildManager$1.run(BuildManager.java:301) at org.eclipse.core.runtime.SafeRunner.run(SafeRunner.java:42) at org.eclipse.core.internal.events.BuildManager.basicBuild(BuildManager.java:304) at org.eclipse.core.internal.events.BuildManager.basicBuildLoop(BuildManager.java:360) at org.eclipse.core.internal.events.BuildManager.build(BuildManager.java:383) at org.eclipse.core.internal.events.AutoBuildJob.doBuild(AutoBuildJob.java:144) at org.eclipse.core.internal.events.AutoBuildJob.run(AutoBuildJob.java:235) at org.eclipse.core.internal.jobs.Worker.run(Worker.java:55) pom.xml中还有这个也报错: ![图片说明](https://img-ask.csdn.net/upload/201707/27/1501125074_482352.png) ![图片说明](https://img-ask.csdn.net/upload/201707/27/1501125081_51583.png) 求教是什么原因,如何解决?
maven项目中,使用clean tomcat7:run启动时报如下错误,小白,求大神解救。在pom.xml中已经配置了tomcat7-maven-plugin。
maven项目中,使用clean tomcat7:run启动时报如下错误,小白,求大神解救。在pom.xml中已经配置了tomcat7-maven-plugin。 [INFO] Scanning for projects... [INFO] Downloading from : https://repo.maven.apache.org/maven2/org/codehaus/mojo/maven-metadata.xml [INFO] Downloading from : https://repo.maven.apache.org/maven2/org/apache/maven/plugins/maven-metadata.xml [INFO] Downloaded from : https://repo.maven.apache.org/maven2/org/codehaus/mojo/maven-metadata.xml (20 kB at 5.0 kB/s) [INFO] Downloaded from : https://repo.maven.apache.org/maven2/org/apache/maven/plugins/maven-metadata.xml (14 kB at 1.3 kB/s) [INFO] ------------------------------------------------------------------------ [INFO] BUILD FAILURE [INFO] ------------------------------------------------------------------------ [INFO] Total time: 10.812 s [INFO] Finished at: 2019-09-23T21:31:16+08:00 [INFO] ------------------------------------------------------------------------ [ERROR] No plugin found for prefix 'tomcat7' in the current project and in the plugin groups [org.apache.maven.plugins, org.codehaus.mojo] available from the repositories [local (D:\MATERIAL\Maven\repository\repository), central (https://repo.maven.apache.org/maven2)] -> [Help 1] [ERROR] [ERROR] To see the full stack trace of the errors, re-run Maven with the -e switch. [ERROR] Re-run Maven using the -X switch to enable full debug logging. [ERROR] [ERROR] For more information about the errors and possible solutions, please read the following articles: [ERROR] [Help 1] http://cwiki.apache.org/confluence/display/MAVEN/NoPluginFoundForPrefixException
maven pom.xml报错 但是在文件中可以找到相对应的jar包,反复的更新也是这样
The project cn.sunline.ipps.business:sunipps-app:1.0.0-SNAPSHOT (D:\work\workspace_cwf_v7\sunipps.app\pom.xml) has 1 error Non-resolvable parent POM: Failure to find cn.sunline.ipps.business:sunipps-parent:pom:1.0.0-SNAPSHOT in http://proxy.clwj.sunline.cn:8081/nexus/content/groups/public/ was cached in the local repository, resolution will not be reattempted until the update interval of rd-nexus has elapsed or updates are forced and 'parent.relativePath' points at wrong local POM @ line 7, column 13 -> [Help 2]
maven 用Eclipse从svn检出的maven项目,再转为maven管理时,pom.xml报错,什么原因?
Project build error: Non-resolvable parent POM: Could not find artifact com.bjTest:bjTest:pom:0.0.1-SNAPSHOT and 'parent.relativePath' points at wrong local POM
maven配置私服打包报错Failed to execute goal org.apache.maven.plugins:maven-compiler-plugin:3.5:compile
直接使用阿里云镜像仓库打包没问题,替换为私服镜像仓库后报错: 就是pom.xml中的plugin报错 ``` <plugin> <groupId>org.apache.maven.plugins</groupId> <artifactId>maven-compiler-plugin</artifactId> <version>3.5</version> <configuration> <source>1.8</source> <target>1.8</target> <encoding>UTF-8</encoding> </configuration> </plugin> ``` 网上找了半天说这个指定的jdk版本的问题,查了一下版本没问题都是1.8 报错内容: [ERROR] Failed to execute goal org.apache.maven.plugins:maven-compiler-plugin:3.5:compile (default-compile) on project mytest-web: Execution default-compile of goal org.apache.maven.plugins:maven-compiler-plugin:3.5:compile failed: Plugin org.apache.maven.plugins:maven-compiler-plugin:3.5 or one of its dependencies could not be resolved: Failed to collect dependencies at org.apache.maven.plugins:maven-compiler-plugin:jar:3.5 -> org.apache.maven:maven-toolchain:jar:2.2.1 -> org.apache.maven:maven-core:jar:2.2.1 -> commons-cli:commons-cli:jar:1.2: Failed to read artifact descriptor for commons-cli:commons-cli:jar:1.2: Failure to find org.apache:apache:pom:4 in http://localhost:8081/nexus/content/groups/public/ was cached in the local repository, resolution will not be reattempted until the update interval of public has elapsed or updates are forced -> [Help 1] org.apache.maven.lifecycle.LifecycleExecutionException: Failed to execute goal org.apache.maven.plugins:maven-compiler-plugin:3.5:compile (default-compile) on project mytest-web: Execution default-compile of goal org.apache.maven.plugins:maven-compiler-plugin:3.5:compile failed: Plugin org.apache.maven.plugins:maven-compiler-plugin:3.5 or one of its dependencies could not be resolved: Failed to collect dependencies at org.apache.maven.plugins:maven-compiler-plugin:jar:3.5 -> org.apache.maven:maven-toolchain:jar:2.2.1 -> org.apache.maven:maven-core:jar:2.2.1 -> commons-cli:commons-cli:jar:1.2 at org.apache.maven.lifecycle.internal.MojoExecutor.execute(MojoExecutor.java:213) at org.apache.maven.lifecycle.internal.MojoExecutor.execute(MojoExecutor.java:154) at org.apache.maven.lifecycle.internal.MojoExecutor.execute(MojoExecutor.java:146) at org.apache.maven.lifecycle.internal.LifecycleModuleBuilder.buildProject(LifecycleModuleBuilder.java:117) at org.apache.maven.lifecycle.internal.LifecycleModuleBuilder.buildProject(LifecycleModuleBuilder.java:81) at org.apache.maven.lifecycle.internal.builder.singlethreaded.SingleThreadedBuilder.build(SingleThreadedBuilder.java:51) at org.apache.maven.lifecycle.internal.LifecycleStarter.execute(LifecycleStarter.java:128) at org.apache.maven.DefaultMaven.doExecute(DefaultMaven.java:309) at org.apache.maven.DefaultMaven.doExecute(DefaultMaven.java:194) at org.apache.maven.DefaultMaven.execute(DefaultMaven.java:107) at org.apache.maven.cli.MavenCli.execute(MavenCli.java:993) at org.apache.maven.cli.MavenCli.doMain(MavenCli.java:345) at org.apache.maven.cli.MavenCli.main(MavenCli.java:191) at sun.reflect.NativeMethodAccessorImpl.invoke0(Native Method) at sun.reflect.NativeMethodAccessorImpl.invoke(NativeMethodAccessorImpl.java:62) at sun.reflect.DelegatingMethodAccessorImpl.invoke(DelegatingMethodAccessorImpl.java:43) at java.lang.reflect.Method.invoke(Method.java:498) at org.codehaus.plexus.classworlds.launcher.Launcher.launchEnhanced(Launcher.java:289) at org.codehaus.plexus.classworlds.launcher.Launcher.launch(Launcher.java:229) at org.codehaus.plexus.classworlds.launcher.Launcher.mainWithExitCode(Launcher.java:415) at org.codehaus.plexus.classworlds.launcher.Launcher.main(Launcher.java:356) Caused by: org.apache.maven.plugin.PluginExecutionException: Execution default-compile of goal org.apache.maven.plugins:maven-compiler-plugin:3.5:compile failed: Plugin org.apache.maven.plugins:maven-compiler-plugin:3.5 or one of its dependencies could not be resolved: Failed to collect dependencies at org.apache.maven.plugins:maven-compiler-plugin:jar:3.5 -> org.apache.maven:maven-toolchain:jar:2.2.1 -> org.apache.maven:maven-core:jar:2.2.1 -> commons-cli:commons-cli:jar:1.2 at org.apache.maven.plugin.DefaultBuildPluginManager.executeMojo(DefaultBuildPluginManager.java:106) at org.apache.maven.lifecycle.internal.MojoExecutor.execute(MojoExecutor.java:208) ... 20 more Caused by: org.apache.maven.plugin.PluginResolutionException: Plugin org.apache.maven.plugins:maven-compiler-plugin:3.5 or one of its dependencies could not be resolved: Failed to collect dependencies at org.apache.maven.plugins:maven-compiler-plugin:jar:3.5 -> org.apache.maven:maven-toolchain:jar:2.2.1 -> org.apache.maven:maven-core:jar:2.2.1 -> commons-cli:commons-cli:jar:1.2 at org.apache.maven.plugin.internal.DefaultPluginDependenciesResolver.resolveInternal(DefaultPluginDependenciesResolver.java:214) at org.apache.maven.plugin.internal.DefaultPluginDependenciesResolver.resolve(DefaultPluginDependenciesResolver.java:149) at org.apache.maven.plugin.internal.DefaultMavenPluginManager.createPluginRealm(DefaultMavenPluginManager.java:402) at org.apache.maven.plugin.internal.DefaultMavenPluginManager.setupPluginRealm(DefaultMavenPluginManager.java:374) at org.apache.maven.plugin.DefaultBuildPluginManager.getPluginRealm(DefaultBuildPluginManager.java:231) at org.apache.maven.plugin.DefaultBuildPluginManager.executeMojo(DefaultBuildPluginManager.java:102) ... 21 more Caused by: org.eclipse.aether.collection.DependencyCollectionException: Failed to collect dependencies at org.apache.maven.plugins:maven-compiler-plugin:jar:3.5 -> org.apache.maven:maven-toolchain:jar:2.2.1 -> org.apache.maven:maven-core:jar:2.2.1 -> commons-cli:commons-cli:jar:1.2 at org.eclipse.aether.internal.impl.DefaultDependencyCollector.collectDependencies(DefaultDependencyCollector.java:300) at org.eclipse.aether.internal.impl.DefaultRepositorySystem.collectDependencies(DefaultRepositorySystem.java:325) at org.apache.maven.plugin.internal.DefaultPluginDependenciesResolver.resolveInternal(DefaultPluginDependenciesResolver.java:202) ... 26 more Caused by: org.eclipse.aether.resolution.ArtifactDescriptorException: Failed to read artifact descriptor for commons-cli:commons-cli:jar:1.2 at org.apache.maven.repository.internal.DefaultArtifactDescriptorReader.loadPom(DefaultArtifactDescriptorReader.java:330) at org.apache.maven.repository.internal.DefaultArtifactDescriptorReader.readArtifactDescriptor(DefaultArtifactDescriptorReader.java:199) at org.eclipse.aether.internal.impl.DefaultDependencyCollector.resolveCachedArtifactDescriptor(DefaultDependencyCollector.java:544) at org.eclipse.aether.internal.impl.DefaultDependencyCollector.getArtifactDescriptorResult(DefaultDependencyCollector.java:528) at org.eclipse.aether.internal.impl.DefaultDependencyCollector.processDependency(DefaultDependencyCollector.java:418) at org.eclipse.aether.internal.impl.DefaultDependencyCollector.processDependency(DefaultDependencyCollector.java:372) at org.eclipse.aether.internal.impl.DefaultDependencyCollector.process(DefaultDependencyCollector.java:360) at org.eclipse.aether.internal.impl.DefaultDependencyCollector.doRecurse(DefaultDependencyCollector.java:513) at org.eclipse.aether.internal.impl.DefaultDependencyCollector.processDependency(DefaultDependencyCollector.java:467) at org.eclipse.aether.internal.impl.DefaultDependencyCollector.processDependency(DefaultDependencyCollector.java:372) at org.eclipse.aether.internal.impl.DefaultDependencyCollector.process(DefaultDependencyCollector.java:360) at org.eclipse.aether.internal.impl.DefaultDependencyCollector.doRecurse(DefaultDependencyCollector.java:513) at org.eclipse.aether.internal.impl.DefaultDependencyCollector.processDependency(DefaultDependencyCollector.java:467) at org.eclipse.aether.internal.impl.DefaultDependencyCollector.processDependency(DefaultDependencyCollector.java:372) at org.eclipse.aether.internal.impl.DefaultDependencyCollector.process(DefaultDependencyCollector.java:360) at org.eclipse.aether.internal.impl.DefaultDependencyCollector.collectDependencies(DefaultDependencyCollector.java:263) ... 28 more Caused by: org.apache.maven.model.resolution.UnresolvableModelException: Failure to find org.apache:apache:pom:4 in http://localhost:8081/nexus/content/groups/public/ was cached in the local repository, resolution will not be reattempted until the update interval of public has elapsed or updates are forced at org.apache.maven.repository.internal.DefaultModelResolver.resolveModel(DefaultModelResolver.java:178) at org.apache.maven.repository.internal.DefaultModelResolver.resolveModel(DefaultModelResolver.java:224) at org.apache.maven.model.building.DefaultModelBuilder.readParentExternally(DefaultModelBuilder.java:1051) at org.apache.maven.model.building.DefaultModelBuilder.readParent(DefaultModelBuilder.java:829) at org.apache.maven.model.building.DefaultModelBuilder.build(DefaultModelBuilder.java:331) at org.apache.maven.repository.internal.DefaultArtifactDescriptorReader.loadPom(DefaultArtifactDescriptorReader.java:321) ... 43 more Caused by: org.eclipse.aether.resolution.ArtifactResolutionException: Failure to find org.apache:apache:pom:4 in http://localhost:8081/nexus/content/groups/public/ was cached in the local repository, resolution will not be reattempted until the update interval of public has elapsed or updates are forced at org.eclipse.aether.internal.impl.DefaultArtifactResolver.resolve(DefaultArtifactResolver.java:453) at org.eclipse.aether.internal.impl.DefaultArtifactResolver.resolveArtifacts(DefaultArtifactResolver.java:255) at org.eclipse.aether.internal.impl.DefaultArtifactResolver.resolveArtifact(DefaultArtifactResolver.java:232) at org.apache.maven.repository.internal.DefaultModelResolver.resolveModel(DefaultModelResolver.java:174) ... 48 more Caused by: org.eclipse.aether.transfer.ArtifactNotFoundException: Failure to find org.apache:apache:pom:4 in http://localhost:8081/nexus/content/groups/public/ was cached in the local repository, resolution will not be reattempted until the update interval of public has elapsed or updates are forced at org.eclipse.aether.internal.impl.DefaultUpdateCheckManager.newException(DefaultUpdateCheckManager.java:240) at org.eclipse.aether.internal.impl.DefaultUpdateCheckManager.checkArtifact(DefaultUpdateCheckManager.java:215) at org.eclipse.aether.internal.impl.DefaultArtifactResolver.gatherDownloads(DefaultArtifactResolver.java:594) at org.eclipse.aether.internal.impl.DefaultArtifactResolver.performDownloads(DefaultArtifactResolver.java:512) at org.eclipse.aether.internal.impl.DefaultArtifactResolver.resolve(DefaultArtifactResolver.java:430) ... 51 more [ERROR] [ERROR] Re-run Maven using the -X switch to enable full debug logging. [ERROR] [ERROR] For more information about the errors and possible solutions, please read the following articles: [ERROR] [Help 1] http://cwiki.apache.org/confluence/display/MAVEN/PluginResolutionException
maven ${project.name} 显示中文,不显示为ascii码
maven配置pom.xml中的<name>中文</name> , 我在资源文件pom.properties中想引用这个name, 我就name=${project.name} , 可是就直接会变成name=中文, 而不是name=\u4E2D\u6587 ,怎么解决,急求,谢谢
maven3.3.9编译hadoop2.6.5报错 帮忙解决问题
[INFO] Building Apache Hadoop Main 2.6.5 [INFO] ------------------------------------------------------------------------ Downloading: http://mirrors.ibiblio.org/pub/mirrors/maven2/org/apache/maven/plugins/maven-javadoc-plugin/maven-metadata.xml [WARNING] Checksum validation failed, expected <html> but is b113767b47336dcc165c5dd2222b5df4cb86b7ce for http://mirrors.ibiblio.org/pub/mirrors/maven2/org/apache/maven/plugins/maven-javadoc-plugin/maven-metadata.xml [WARNING] Could not validate integrity of download from http://mirrors.ibiblio.org/pub/mirrors/maven2/org/apache/maven/plugins/maven-javadoc-plugin/maven-metadata.xml: Checksum validation failed, expected <html> but is b113767b47336dcc165c5dd2222b5df4cb86b7ce [WARNING] Checksum validation failed, expected <html> but is b113767b47336dcc165c5dd2222b5df4cb86b7ce for http://mirrors.ibiblio.org/pub/mirrors/maven2/org/apache/maven/plugins/maven-javadoc-plugin/maven-metadata.xml Downloaded: http://mirrors.ibiblio.org/pub/mirrors/maven2/org/apache/maven/plugins/maven-javadoc-plugin/maven-metadata.xml (99 KB at 11.8 KB/sec) [WARNING] The metadata /root/.m2/repository/org/apache/maven/plugins/maven-javadoc-plugin/maven-metadata-ibiblio.org.xml is invalid: end tag name </body> must match start tag name <hr> from line 888 (position: START_TAG seen ... 08-Nov-2014 19:04 207\r\n</pre><hr></body>... @888:18) [INFO] ------------------------------------------------------------------------ [INFO] Reactor Summary: [INFO] [INFO] Apache Hadoop Main ................................. FAILURE [ 8.416 s] [INFO] Apache Hadoop Build Tools .......................... SKIPPED [INFO] Apache Hadoop Project POM .......................... SKIPPED [INFO] Apache Hadoop Annotations .......................... SKIPPED [INFO] Apache Hadoop Assemblies ........................... SKIPPED [INFO] Apache Hadoop Project Dist POM ..................... SKIPPED [INFO] Apache Hadoop Maven Plugins ........................ SKIPPED [INFO] Apache Hadoop MiniKDC .............................. SKIPPED [INFO] Apache Hadoop Auth ................................. SKIPPED [INFO] Apache Hadoop Auth Examples ........................ SKIPPED [INFO] Apache Hadoop Common ............................... SKIPPED [INFO] Apache Hadoop NFS .................................. SKIPPED [INFO] Apache Hadoop KMS .................................. SKIPPED [INFO] Apache Hadoop Common Project ....................... SKIPPED [INFO] Apache Hadoop HDFS ................................. SKIPPED [INFO] Apache Hadoop HttpFS ............................... SKIPPED [INFO] Apache Hadoop HDFS BookKeeper Journal .............. SKIPPED [INFO] Apache Hadoop HDFS-NFS ............................. SKIPPED [INFO] Apache Hadoop HDFS Project ......................... SKIPPED [INFO] hadoop-yarn ........................................ SKIPPED [INFO] hadoop-yarn-api .................................... SKIPPED [INFO] hadoop-yarn-common ................................. SKIPPED [INFO] hadoop-yarn-server ................................. SKIPPED [INFO] hadoop-yarn-server-common .......................... SKIPPED [INFO] hadoop-yarn-server-nodemanager ..................... SKIPPED [INFO] hadoop-yarn-server-web-proxy ....................... SKIPPED [INFO] hadoop-yarn-server-applicationhistoryservice ....... SKIPPED [INFO] hadoop-yarn-server-resourcemanager ................. SKIPPED [INFO] hadoop-yarn-server-tests ........................... SKIPPED [INFO] hadoop-yarn-client ................................. SKIPPED [INFO] hadoop-yarn-applications ........................... SKIPPED [INFO] hadoop-yarn-applications-distributedshell .......... SKIPPED [INFO] hadoop-yarn-applications-unmanaged-am-launcher ..... SKIPPED [INFO] hadoop-yarn-site ................................... SKIPPED [INFO] hadoop-yarn-registry ............................... SKIPPED [INFO] hadoop-yarn-project ................................ SKIPPED [INFO] hadoop-mapreduce-client ............................ SKIPPED [INFO] hadoop-mapreduce-client-core ....................... SKIPPED [INFO] hadoop-mapreduce-client-common ..................... SKIPPED [INFO] hadoop-mapreduce-client-shuffle .................... SKIPPED [INFO] hadoop-mapreduce-client-app ........................ SKIPPED [INFO] hadoop-mapreduce-client-hs ......................... SKIPPED [INFO] hadoop-mapreduce-client-jobclient .................. SKIPPED [INFO] hadoop-mapreduce-client-hs-plugins ................. SKIPPED [INFO] Apache Hadoop MapReduce Examples ................... SKIPPED [INFO] hadoop-mapreduce ................................... SKIPPED [INFO] Apache Hadoop MapReduce Streaming .................. SKIPPED [INFO] Apache Hadoop Distributed Copy ..................... SKIPPED [INFO] Apache Hadoop Archives ............................. SKIPPED [INFO] Apache Hadoop Rumen ................................ SKIPPED [INFO] Apache Hadoop Gridmix .............................. SKIPPED [INFO] Apache Hadoop Data Join ............................ SKIPPED [INFO] Apache Hadoop Ant Tasks ............................ SKIPPED [INFO] Apache Hadoop Extras ............................... SKIPPED [INFO] Apache Hadoop Pipes ................................ SKIPPED [INFO] Apache Hadoop OpenStack support .................... SKIPPED [INFO] Apache Hadoop Amazon Web Services support .......... SKIPPED [INFO] Apache Hadoop Client ............................... SKIPPED [INFO] Apache Hadoop Mini-Cluster ......................... SKIPPED [INFO] Apache Hadoop Scheduler Load Simulator ............. SKIPPED [INFO] Apache Hadoop Tools Dist ........................... SKIPPED [INFO] Apache Hadoop Tools ................................ SKIPPED [INFO] Apache Hadoop Distribution ......................... SKIPPED [INFO] ------------------------------------------------------------------------ [INFO] BUILD FAILURE [INFO] ------------------------------------------------------------------------ [INFO] Total time: 06:03 min [INFO] Finished at: 2018-06-23T11:25:17+08:00 [INFO] Final Memory: 27M/69M [INFO] ------------------------------------------------------------------------ [ERROR] Error resolving version for plugin 'org.apache.maven.plugins:maven-javadoc-plugin' from the repositories [local (/root/.m2/repository), ibiblio.org (http://mirrors.ibiblio.org/pub/mirrors/maven2)]: Plugin not found in any plugin repository -> [Help 1] [ERROR] [ERROR] To see the full stack trace of the errors, re-run Maven with the -e switch. [ERROR] Re-run Maven using the -X switch to enable full debug logging. [ERROR] [ERROR] For more information about the errors and possible solutions, please read the following articles: [ERROR] [Help 1] http://cwiki.apache.org/confluence/display/MAVEN/PluginVersionResolutionException You have new mail in /var/spool/mail/root
maven聚合项目启动时pom文件报错
[ERROR] [ERROR] Some problems were encountered while processing the POMs: [FATAL] Non-resolvable parent POM for cn.iclouidt:e06-customer:[unknown-version]: Could not find artifact cn.iclouidt:e06-parent:pom:0.0.1-SNAPSHOT and 'parent.relativePath' points at wrong local POM @ line 4, column 10 @ [ERROR] The build could not read 1 project -> [Help 1] [ERROR] [ERROR] The project cn.iclouidt:e06-customer:[unknown-version] (C:\Users\Administrator\Desktop\ZG\e06-customer\pom.xml) has 1 error [ERROR] Non-resolvable parent POM for cn.iclouidt:e06-customer:[unknown-version]: Could not find artifact cn.iclouidt:e06-parent:pom:0.0.1-SNAPSHOT and 'parent.relativePath' points at wrong local POM @ line 4, column 10 -> [Help 2] [ERROR] [ERROR] To see the full stack trace of the errors, re-run Maven with the -e switch. [ERROR] Re-run Maven using the -X switch to enable full debug logging. [ERROR] [ERROR] For more information about the errors and possible solutions, please read the following articles: [ERROR] [Help 1] http://cwiki.apache.org/confluence/display/MAVEN/ProjectBuildingException [ERROR] [Help 2] http://cwiki.apache.org/confluence/display/MAVEN/UnresolvableModelException
用maven进行install的时候报错Error injecting: org.apache.maven.plugin.install.InstallMojo
[code="java"] ------------------------------------------------------- T E S T S ------------------------------------------------------- There are no tests to run. Results : Tests run: 0, Failures: 0, Errors: 0, Skipped: 0 [INFO] [INFO] --- maven-war-plugin:2.1.1:war (default-war) @ llemaicai --- [INFO] Packaging webapp [INFO] Assembling webapp [llemaicai] in [E:\dev\maicai\pro\llemaicai\target\llemaicai] [INFO] Processing war project [INFO] Copying webapp resources [E:\dev\maicai\pro\llemaicai\src\main\webapp] [INFO] Webapp assembled in [35 msecs] [INFO] Building war: E:\dev\maicai\pro\llemaicai\target\llemaicai.war [WARNING] Warning: selected war files include a WEB-INF/web.xml which will be ignored (webxml attribute is missing from war task, or ignoreWebxml attribute is specified as 'true') [INFO] [INFO] --- maven-install-plugin:2.3.1:install (default-install) @ llemaicai --- [WARNING] The POM for org.codehaus.plexus:plexus-digest:jar:1.0 is invalid, transitive dependencies (if any) will not be available, enable debug logging for more details 2013-2-20 14:41:14 org.sonatype.guice.bean.reflect.LoadedClass 警告: Error injecting: org.apache.maven.plugin.install.InstallMojo java.lang.NoClassDefFoundError: org/codehaus/plexus/digest/DigesterException at java.lang.Class.getDeclaredConstructors0(Native Method) at java.lang.Class.privateGetDeclaredConstructors(Class.java:2389) at java.lang.Class.getDeclaredConstructors(Class.java:1836) at com.google.inject.spi.InjectionPoint.forConstructorOf(InjectionPoint.java:243) at com.google.inject.internal.ConstructorBindingImpl.create(ConstructorBindingImpl.java:96) at com.google.inject.internal.InjectorImpl.createUninitializedBinding(InjectorImpl.java:628) at com.google.inject.internal.InjectorImpl.createJustInTimeBinding(InjectorImpl.java:835) at com.google.inject.internal.InjectorImpl.createJustInTimeBindingRecursive(InjectorImpl.java:769) at com.google.inject.internal.InjectorImpl.getJustInTimeBinding(InjectorImpl.java:254) at com.google.inject.internal.InjectorImpl.getBindingOrThrow(InjectorImpl.java:205) at com.google.inject.internal.InjectorImpl.getInternalFactory(InjectorImpl.java:843) at com.google.inject.internal.InjectorImpl.getProviderOrThrow(InjectorImpl.java:957) at com.google.inject.internal.InjectorImpl.getProvider(InjectorImpl.java:990) at com.google.inject.internal.InjectorImpl.getProvider(InjectorImpl.java:951) at com.google.inject.internal.InjectorImpl.getInstance(InjectorImpl.java:1003) at org.sonatype.guice.bean.reflect.AbstractDeferredClass.get(AbstractDeferredClass.java:47) at com.google.inject.internal.InternalFactoryToProviderAdapter.get(InternalFactoryToProviderAdapter.java:40) at com.google.inject.internal.InjectorImpl$4$1.call(InjectorImpl.java:968) at com.google.inject.internal.InjectorImpl.callInContext(InjectorImpl.java:1014) at com.google.inject.internal.InjectorImpl$4.get(InjectorImpl.java:964) at com.google.inject.Scopes$1$1.get(Scopes.java:59) at org.sonatype.guice.bean.locators.LazyBeanEntry.getValue(LazyBeanEntry.java:79) at org.sonatype.guice.plexus.locators.LazyPlexusBean.getValue(LazyPlexusBean.java:53) at org.codehaus.plexus.DefaultPlexusContainer.lookup(DefaultPlexusContainer.java:243) at org.codehaus.plexus.DefaultPlexusContainer.lookup(DefaultPlexusContainer.java:235) at org.apache.maven.plugin.internal.DefaultMavenPluginManager.getConfiguredMojo(DefaultMavenPluginManager.java:455) at org.apache.maven.plugin.DefaultBuildPluginManager.executeMojo(DefaultBuildPluginManager.java:92) at org.apache.maven.lifecycle.internal.MojoExecutor.execute(MojoExecutor.java:209) at org.apache.maven.lifecycle.internal.MojoExecutor.execute(MojoExecutor.java:153) at org.apache.maven.lifecycle.internal.MojoExecutor.execute(MojoExecutor.java:145) at org.apache.maven.lifecycle.internal.LifecycleModuleBuilder.buildProject(LifecycleModuleBuilder.java:84) at org.apache.maven.lifecycle.internal.LifecycleModuleBuilder.buildProject(LifecycleModuleBuilder.java:59) at org.apache.maven.lifecycle.internal.LifecycleStarter.singleThreadedBuild(LifecycleStarter.java:183) at org.apache.maven.lifecycle.internal.LifecycleStarter.execute(LifecycleStarter.java:161) at org.apache.maven.DefaultMaven.doExecute(DefaultMaven.java:319) at org.apache.maven.DefaultMaven.execute(DefaultMaven.java:156) at org.apache.maven.cli.MavenCli.execute(MavenCli.java:537) at org.apache.maven.cli.MavenCli.doMain(MavenCli.java:196) at org.apache.maven.cli.MavenCli.main(MavenCli.java:141) at sun.reflect.NativeMethodAccessorImpl.invoke0(Native Method) at sun.reflect.NativeMethodAccessorImpl.invoke(NativeMethodAccessorImpl.java:39) at sun.reflect.DelegatingMethodAccessorImpl.invoke(DelegatingMethodAccessorImpl.java:25) at java.lang.reflect.Method.invoke(Method.java:597) at org.codehaus.plexus.classworlds.launcher.Launcher.launchEnhanced(Launcher.java:290) at org.codehaus.plexus.classworlds.launcher.Launcher.launch(Launcher.java:230) at org.codehaus.plexus.classworlds.launcher.Launcher.mainWithExitCode(Launcher.java:409) at org.codehaus.plexus.classworlds.launcher.Launcher.main(Launcher.java:352) Caused by: java.lang.ClassNotFoundException: org.codehaus.plexus.digest.DigesterException at org.codehaus.plexus.classworlds.strategy.SelfFirstStrategy.loadClass(SelfFirstStrategy.java:50) at org.codehaus.plexus.classworlds.realm.ClassRealm.loadClass(ClassRealm.java:244) at org.codehaus.plexus.classworlds.realm.ClassRealm.loadClass(ClassRealm.java:230) ... 47 more [INFO] ------------------------------------------------------------------------ [INFO] BUILD FAILURE [INFO] ------------------------------------------------------------------------ [INFO] Total time: 1.669s [INFO] Finished at: Wed Feb 20 14:41:14 CST 2013 [INFO] Final Memory: 4M/15M [INFO] ------------------------------------------------------------------------ [ERROR] Failed to execute goal org.apache.maven.plugins:maven-install-plugin:2.3.1:install (default-install) on project llemaicai: Execution default-install of goal org.apache.maven.plugins:maven-install-plugin:2.3.1:install failed: Unable to load the mojo 'install' in the plugin 'org.apache.maven.plugins:maven-install-plugin:2.3.1'. A required class is missing: org/codehaus/plexus/digest/DigesterException [ERROR] ----------------------------------------------------- [ERROR] realm = plugin>org.apache.maven.plugins:maven-install-plugin:2.3.1 [ERROR] strategy = org.codehaus.plexus.classworlds.strategy.SelfFirstStrategy [ERROR] urls[0] = file:/D:/javalib/repository/org/apache/maven/plugins/maven-install-plugin/2.3.1/maven-install-plugin-2.3.1.jar [ERROR] urls[1] = file:/D:/javalib/repository/junit/junit/3.8.1/junit-3.8.1.jar [ERROR] urls[2] = file:/D:/javalib/repository/org/codehaus/plexus/plexus-utils/2.0.5/plexus-utils-2.0.5.jar [ERROR] urls[3] = file:/D:/javalib/repository/org/codehaus/plexus/plexus-digest/1.0/plexus-digest-1.0.jar [ERROR] Number of foreign imports: 1 [ERROR] import: Entry[import from realm ClassRealm[maven.api, parent: null]] [ERROR] [ERROR] -----------------------------------------------------: org.codehaus.plexus.digest.DigesterException [ERROR] -> [Help 1] [ERROR] [ERROR] To see the full stack trace of the errors, re-run Maven with the -e switch. [ERROR] Re-run Maven using the -X switch to enable full debug logging. [ERROR] [ERROR] For more information about the errors and possible solutions, please read the following articles: [ERROR] [Help 1] http://cwiki.apache.org/confluence/display/MAVEN/PluginContainerException [/code]
SSM项目pom.xml引用jar包爆红 kaptcha.wso2 就是他
<?xml version="1.0" encoding="UTF-8"?> <project xmlns="http://maven.apache.org/POM/4.0.0" xmlns:xsi="http://www.w3.org/2001/XMLSchema-instance" xsi:schemaLocation="http://maven.apache.org/POM/4.0.0 http://maven.apache.org/maven-v4_0_0.xsd"> <modelVersion>4.0.0</modelVersion> <groupId>orchard</groupId> <artifactId>system</artifactId> <packaging>war</packaging> <version>1.0-SNAPSHOT</version> <name>system Maven Webapp</name> <url>http://www.example.com</url> <properties> <junit.version>4.12</junit.version> <spring.version>4.2.6.RELEASE</spring.version> <mybatis.version>3.2.8</mybatis.version> <mybatis.spring.version>1.2.2</mybatis.spring.version> <mybatis.paginator.version>1.2.15</mybatis.paginator.version> <mysql.version>5.1.32</mysql.version> <slf4j.version>1.7.7</slf4j.version> <logback.version>1.1.7</logback.version> <jackson.version>2.4.2</jackson.version> <druid.version>1.0.9</druid.version> <jstl.version>1.2</jstl.version> <servlet-api.version>2.5</servlet-api.version> <jsp-api.version>2.0</jsp-api.version> <commons-lang3.version>3.3.2</commons-lang3.version> <commons-io.version>1.3.2</commons-io.version> <commons-net.version>3.3</commons-net.version> <commons-logging.version>1.2</commons-logging.version> <pagehelper.version>3.4.2</pagehelper.version> <jsqlparser.version>0.9.1</jsqlparser.version> <commons-fileupload.version>1.3.1</commons-fileupload.version> </properties> <dependencies> <!-- Apache工具组件 --> <dependency> <groupId>org.apache.commons</groupId> <artifactId>commons-lang3</artifactId> <version>${commons-lang3.version}</version> </dependency> <dependency> <groupId>org.apache.commons</groupId> <artifactId>commons-io</artifactId> <version>${commons-io.version}</version> </dependency> <dependency> <groupId>commons-net</groupId> <artifactId>commons-net</artifactId> <version>${commons-net.version}</version> </dependency> <!-- Jackson Json处理工具包 --> <dependency> <groupId>com.fasterxml.jackson.core</groupId> <artifactId>jackson-databind</artifactId> <version>${jackson.version}</version> </dependency> <!-- 单元测试 --> <dependency> <groupId>junit</groupId> <artifactId>junit</artifactId> <version>${junit.version}</version> <scope>test</scope> </dependency> <!-- 日志 --> <dependency> <groupId>org.slf4j</groupId> <artifactId>slf4j-api</artifactId> <version>${slf4j.version}</version> </dependency> <dependency> <groupId>org.slf4j</groupId> <artifactId>jul-to-slf4j</artifactId> <version>${slf4j.version}</version> </dependency> <dependency> <groupId>ch.qos.logback</groupId> <artifactId>logback-core</artifactId> <version>${logback.version}</version> </dependency> <dependency> <groupId>ch.qos.logback</groupId> <artifactId>logback-classic</artifactId> <version>${logback.version}</version> <exclusions> <exclusion> <groupId>org.slf4j</groupId> <artifactId>slf4j-api</artifactId> </exclusion> </exclusions> </dependency> <dependency> <groupId>commons-logging</groupId> <artifactId>commons-logging</artifactId> <version>${commons-logging.version}</version> </dependency> <!-- Mybatis --> <dependency> <groupId>org.mybatis</groupId> <artifactId>mybatis</artifactId> <version>${mybatis.version}</version> </dependency> <dependency> <groupId>org.mybatis</groupId> <artifactId>mybatis-spring</artifactId> <version>${mybatis.spring.version}</version> </dependency> <dependency> <groupId>com.github.miemiedev</groupId> <artifactId>mybatis-paginator</artifactId> <version>${mybatis.paginator.version}</version> </dependency> <!-- 分页 --> <dependency> <groupId>com.github.pagehelper</groupId> <artifactId>pagehelper</artifactId> <version>${pagehelper.version}</version> </dependency> <!-- MySql --> <dependency> <groupId>mysql</groupId> <artifactId>mysql-connector-java</artifactId> <version>${mysql.version}</version> </dependency> <!-- 连接池 --> <dependency> <groupId>com.alibaba</groupId> <artifactId>druid</artifactId> <version>${druid.version}</version> </dependency> <!-- Spring --> <dependency> <groupId>org.springframework</groupId> <artifactId>spring-context</artifactId> <version>${spring.version}</version> </dependency> <dependency> <groupId>org.springframework</groupId> <artifactId>spring-beans</artifactId> <version>${spring.version}</version> </dependency> <dependency> <groupId>org.springframework</groupId> <artifactId>spring-webmvc</artifactId> <version>${spring.version}</version> </dependency> <dependency> <groupId>org.springframework</groupId> <artifactId>spring-jdbc</artifactId> <version>${spring.version}</version> </dependency> <dependency> <groupId>org.springframework</groupId> <artifactId>spring-aspects</artifactId> <version>${spring.version}</version> </dependency> <dependency> <groupId>org.springframework</groupId> <artifactId>spring-context-support</artifactId> <version>${spring.version}</version> </dependency> <!-- 解密的jar包 --> <dependency> <groupId>commons-codec</groupId> <artifactId>commons-codec</artifactId> <version>1.6</version> </dependency> <dependency> <groupId>org.bouncycastle</groupId> <artifactId>bcprov-jdk15</artifactId> <version>1.46</version> </dependency> <!-- JSONObject --> <dependency> <groupId>top.jfunc.common</groupId> <artifactId>converter</artifactId> <version>1.8.0</version> </dependency> <!-- 微信小程序 --> <dependency> <groupId>kaptcha.wso2</groupId> <artifactId>kaptcha</artifactId> <version>2.3.0.wso2v1</version> </dependency> <!-- JSP相关 --> <dependency> <groupId>jstl</groupId> <artifactId>jstl</artifactId> <version>${jstl.version}</version> </dependency> <dependency> <groupId>javax.servlet</groupId> <artifactId>servlet-api</artifactId> <version>${servlet-api.version}</version> <scope>provided</scope> </dependency> <dependency> <groupId>javax.servlet</groupId> <artifactId>jsp-api</artifactId> <version>${jsp-api.version}</version> <scope>provided</scope> </dependency> <!-- 文件上传组件 --> <dependency> <groupId>commons-fileupload</groupId> <artifactId>commons-fileupload</artifactId> <version>${commons-fileupload.version}</version> </dependency> </dependencies> <build> <finalName>${project.artifactId}</finalName> <defaultGoal>compile</defaultGoal> <plugins> <!-- 资源文件拷贝插件 --> <plugin> <groupId>org.apache.maven.plugins</groupId> <artifactId>maven-resources-plugin</artifactId> <version>2.7</version> <configuration> <encoding>UTF-8</encoding> </configuration> </plugin> <!-- java编译插件 --> <plugin> <groupId>org.apache.maven.plugins</groupId> <artifactId>maven-compiler-plugin</artifactId> <version>3.2</version> <configuration> <source>1.7</source> <target>1.7</target> <encoding>UTF-8</encoding> </configuration> </plugin> <!-- 配置Tomcat插件 --> <plugin> <groupId>org.apache.tomcat.maven</groupId> <artifactId>tomcat7-maven-plugin</artifactId> <version>2.2</version> <configuration> <port>8080</port> <path>/</path> </configuration> </plugin> <plugin> <groupId>org.mybatis.generator</groupId> <artifactId>mybatis-generator-maven-plugin</artifactId> <version>1.3.2</version> <configuration> <!--配置文件的位置--> <configurationFile>src/main/resources/generatorConfig.xml</configurationFile> <verbose>true</verbose> <overwrite>true</overwrite> </configuration> <executions> <execution> <id>Generate MyBatis Artifacts</id> <goals> <goal>generate</goal> </goals> </execution> </executions> <dependencies> <dependency> <groupId>org.mybatis.generator</groupId> <artifactId>mybatis-generator-core</artifactId> <version>1.3.2</version> </dependency> </dependencies> </plugin> </plugins> <resources> <resource> <directory>src/main/resources</directory> <includes> <include>**/*.xml</include> <include>**/*.properties</include> <include>**/*.ini</include> </includes> <filtering>false</filtering> </resource> <resource> <directory>src/main/java</directory> <includes> <include>**/*.xml</include> </includes> <filtering>false</filtering> </resource> </resources> </build> </project>
在中国程序员是青春饭吗?
今年,我也32了 ,为了不给大家误导,咨询了猎头、圈内好友,以及年过35岁的几位老程序员……舍了老脸去揭人家伤疤……希望能给大家以帮助,记得帮我点赞哦。 目录: 你以为的人生 一次又一次的伤害 猎头界的真相 如何应对互联网行业的「中年危机」 一、你以为的人生 刚入行时,拿着傲人的工资,想着好好干,以为我们的人生是这样的: 等真到了那一天,你会发现,你的人生很可能是这样的: ...
《MySQL 性能优化》之理解 MySQL 体系结构
本文介绍 MySQL 的体系结构,包括物理结构、逻辑结构以及插件式存储引擎。
程序员请照顾好自己,周末病魔差点一套带走我。
程序员在一个周末的时间,得了重病,差点当场去世,还好及时挽救回来了。
复习一周,京东+百度一面,不小心都拿了Offer
京东和百度一面都问了啥,面试官百般刁难,可惜我全会。
Java 14 都快来了,为什么还有这么多人固守Java 8?
从Java 9开始,Java版本的发布就让人眼花缭乱了。每隔6个月,都会冒出一个新版本出来,Java 10 , Java 11, Java 12, Java 13, 到2020年3月份,...
达摩院十大科技趋势发布:2020 非同小可!
【CSDN编者按】1月2日,阿里巴巴发布《达摩院2020十大科技趋势》,十大科技趋势分别是:人工智能从感知智能向认知智能演进;计算存储一体化突破AI算力瓶颈;工业互联网的超融合;机器间大规模协作成为可能;模块化降低芯片设计门槛;规模化生产级区块链应用将走入大众;量子计算进入攻坚期;新材料推动半导体器件革新;保护数据隐私的AI技术将加速落地;云成为IT技术创新的中心 。 新的画卷,正在徐徐展开。...
轻松搭建基于 SpringBoot + Vue 的 Web 商城应用
首先介绍下在本文出现的几个比较重要的概念: 函数计算(Function Compute): 函数计算是一个事件驱动的服务,通过函数计算,用户无需管理服务器等运行情况,只需编写代码并上传。函数计算准备计算资源,并以弹性伸缩的方式运行用户代码,而用户只需根据实际代码运行所消耗的资源进行付费。Fun: Fun 是一个用于支持 Serverless 应用部署的工具,能帮助您便捷地管理函数计算、API ...
讲真,这两个IDE插件,可以让你写出质量杠杠的代码
周末躺在床上看《拯救大兵瑞恩》 周末在闲逛的时候,发现了两个优秀的 IDE 插件,据说可以提高代码的质量,我就安装了一下,试了试以后发现,确实很不错,就推荐给大家。 01、Alibaba Java 代码规范插件 《阿里巴巴 Java 开发手册》,相信大家都不会感到陌生,其 IDEA 插件的下载次数据说达到了 80 万次,我今天又贡献了一次。嘿嘿。 该项目的插件地址: https://github....
Python+OpenCV实时图像处理
目录 1、导入库文件 2、设计GUI 3、调用摄像头 4、实时图像处理 4.1、阈值二值化 4.2、边缘检测 4.3、轮廓检测 4.4、高斯滤波 4.5、色彩转换 4.6、调节对比度 5、退出系统 初学OpenCV图像处理的小伙伴肯定对什么高斯函数、滤波处理、阈值二值化等特性非常头疼,这里给各位分享一个小项目,可通过摄像头实时动态查看各类图像处理的特点,也可对各位调参、测试...
2020年一线城市程序员工资大调查
人才需求 一线城市共发布岗位38115个,招聘120827人。 其中 beijing 22805 guangzhou 25081 shanghai 39614 shenzhen 33327 工资分布 2020年中国一线城市程序员的平均工资为16285元,工资中位数为14583元,其中95%的人的工资位于5000到20000元之间。 和往年数据比较: yea...
为什么猝死的都是程序员,基本上不见产品经理猝死呢?
相信大家时不时听到程序员猝死的消息,但是基本上听不到产品经理猝死的消息,这是为什么呢? 我们先百度搜一下:程序员猝死,出现将近700多万条搜索结果: 搜索一下:产品经理猝死,只有400万条的搜索结果,从搜索结果数量上来看,程序员猝死的搜索结果就比产品经理猝死的搜索结果高了一倍,而且从下图可以看到,首页里面的五条搜索结果,其实只有两条才是符合条件。 所以程序员猝死的概率真的比产品经理大,并不是错...
害怕面试被问HashMap?这一篇就搞定了!
声明:本文以jdk1.8为主! 搞定HashMap 作为一个Java从业者,面试的时候肯定会被问到过HashMap,因为对于HashMap来说,可以说是Java集合中的精髓了,如果你觉得自己对它掌握的还不够好,我想今天这篇文章会非常适合你,至少,看了今天这篇文章,以后不怕面试被问HashMap了 其实在我学习HashMap的过程中,我个人觉得HashMap还是挺复杂的,如果真的想把它搞得明明白...
毕业5年,我问遍了身边的大佬,总结了他们的学习方法
我问了身边10个大佬,总结了他们的学习方法,原来成功都是有迹可循的。
python爬取百部电影数据,我分析出了一个残酷的真相
2019年就这么匆匆过去了,就在前几天国家电影局发布了2019年中国电影市场数据,数据显示去年总票房为642.66亿元,同比增长5.4%;国产电影总票房411.75亿元,同比增长8.65%,市场占比 64.07%;城市院线观影人次17.27亿,同比增长0.64%。 看上去似乎是一片大好对不对?不过作为一名严谨求实的数据分析师,我从官方数据中看出了一点端倪:国产票房增幅都已经高达8.65%了,为什...
推荐10个堪称神器的学习网站
每天都会收到很多读者的私信,问我:“二哥,有什么推荐的学习网站吗?最近很浮躁,手头的一些网站都看烦了,想看看二哥这里有什么新鲜货。” 今天一早做了个恶梦,梦到被老板辞退了。虽然说在我们公司,只有我辞退老板的份,没有老板辞退我这一说,但是还是被吓得 4 点多都起来了。(主要是因为我掌握着公司所有的核心源码,哈哈哈) 既然 4 点多起来,就得好好利用起来。于是我就挑选了 10 个堪称神器的学习网站,推...
这些软件太强了,Windows必装!尤其程序员!
Windows可谓是大多数人的生产力工具,集娱乐办公于一体,虽然在程序员这个群体中都说苹果是信仰,但是大部分不都是从Windows过来的,而且现在依然有很多的程序员用Windows。 所以,今天我就把我私藏的Windows必装的软件分享给大家,如果有一个你没有用过甚至没有听过,那你就赚了????,这可都是提升你幸福感的高效率生产力工具哦! 走起!???? NO、1 ScreenToGif 屏幕,摄像头和白板...
阿里面试,面试官没想到一个ArrayList,我都能跟他扯半小时
我是真的没想到,面试官会这样问我ArrayList。
曾经优秀的人,怎么就突然不优秀了。
职场上有很多辛酸事,很多合伙人出局的故事,很多技术骨干被裁员的故事。说来模板都类似,曾经是名校毕业,曾经是优秀员工,曾经被领导表扬,曾经业绩突出,然而突然有一天,因为种种原因,被裁员了,...
大学四年因为知道了这32个网站,我成了别人眼中的大神!
依稀记得,毕业那天,我们导员发给我毕业证的时候对我说“你可是咱们系的风云人物啊”,哎呀,别提当时多开心啦????,嗯,我们导员是所有导员中最帅的一个,真的???? 不过,导员说的是实话,很多人都叫我大神的,为啥,因为我知道这32个网站啊,你说强不强????,这次是绝对的干货,看好啦,走起来! PS:每个网站都是学计算机混互联网必须知道的,真的牛杯,我就不过多介绍了,大家自行探索,觉得没用的,尽管留言吐槽吧???? 社...
良心推荐,我珍藏的一些Chrome插件
上次搬家的时候,发了一个朋友圈,附带的照片中不小心暴露了自己的 Chrome 浏览器插件之多,于是就有小伙伴评论说分享一下我觉得还不错的浏览器插件。 我下面就把我日常工作和学习中经常用到的一些 Chrome 浏览器插件分享给大家,随便一个都能提高你的“生活品质”和工作效率。 Markdown Here Markdown Here 可以让你更愉快的写邮件,由于支持 Markdown 直接转电子邮...
看完这篇HTTP,跟面试官扯皮就没问题了
我是一名程序员,我的主要编程语言是 Java,我更是一名 Web 开发人员,所以我必须要了解 HTTP,所以本篇文章就来带你从 HTTP 入门到进阶,看完让你有一种恍然大悟、醍醐灌顶的感觉。 最初在有网络之前,我们的电脑都是单机的,单机系统是孤立的,我还记得 05 年前那会儿家里有个电脑,想打电脑游戏还得两个人在一个电脑上玩儿,及其不方便。我就想为什么家里人不让上网,我的同学 xxx 家里有网,每...
2020 年,大火的 Python 和 JavaScript 是否会被取而代之?
Python 和 JavaScript 是目前最火的两大编程语言,但是2020 年,什么编程语言将会取而代之呢? 作者 |Richard Kenneth Eng 译者 |明明如月,责编 | 郭芮 出品 | CSDN(ID:CSDNnews) 以下为译文: Python 和 JavaScript 是目前最火的两大编程语言。然而,他们不可能永远屹立不倒。最终,必将像其他编程语言一...
史上最全的IDEA快捷键总结
现在Idea成了主流开发工具,这篇博客对其使用的快捷键做了总结,希望对大家的开发工作有所帮助。
阿里程序员写了一个新手都写不出的低级bug,被骂惨了。
这种新手都不会范的错,居然被一个工作好几年的小伙子写出来,差点被当场开除了。
谁是华为扫地僧?
是的,华为也有扫地僧!2020年2月11-12日,“养在深闺人不知”的华为2012实验室扫地僧们,将在华为开发者大会2020(Cloud)上,和大家见面。到时,你可以和扫地僧们,吃一个洋...
Idea 中最常用的10款插件(提高开发效率),一定要学会使用!
学习使用一些插件,可以提高开发效率。对于我们开发人员很有帮助。这篇博客介绍了开发中使用的插件。
AI 没让人类失业,搞 AI 的人先失业了
最近和几个 AI 领域的大佬闲聊 根据他们讲的消息和段子 改编出下面这个故事 如有雷同 都是巧合 1. 老王创业失败,被限制高消费 “这里写我跑路的消息实在太夸张了。” 王葱葱哼笑一下,把消息分享给群里。 阿杰也看了消息,笑了笑。在座几位也都笑了。 王葱葱是个有名的人物,21岁那年以全额奖学金进入 KMU 攻读人工智能博士,累计发表论文 40 余篇,个人技术博客更是成为深度学习领域内风向标。 ...
2020年,冯唐49岁:我给20、30岁IT职场年轻人的建议
点击“技术领导力”关注∆每天早上8:30推送 作者|Mr.K 编辑| Emma 来源|技术领导力(ID:jishulingdaoli) 前天的推文《冯唐:职场人35岁以后,方法论比经验重要》,收到了不少读者的反馈,觉得挺受启发。其实,冯唐写了不少关于职场方面的文章,都挺不错的。可惜大家只记住了“春风十里不如你”、“如何避免成为油腻腻的中年人”等不那么正经的文章。 本文整理了冯...
作为一名大学生,如何在B站上快乐的学习?
B站是个宝,谁用谁知道???? 作为一名大学生,你必须掌握的一项能力就是自学能力,很多看起来很牛X的人,你可以了解下,人家私底下一定是花大量的时间自学的,你可能会说,我也想学习啊,可是嘞,该学习啥嘞,不怕告诉你,互联网时代,最不缺的就是学习资源,最宝贵的是啥? 你可能会说是时间,不,不是时间,而是你的注意力,懂了吧! 那么,你说学习资源多,我咋不知道,那今天我就告诉你一个你必须知道的学习的地方,人称...
那些年,我们信了课本里的那些鬼话
教材永远都是有错误的,从小学到大学,我们不断的学习了很多错误知识。 斑羚飞渡 在我们学习的很多小学课文里,有很多是错误文章,或者说是假课文。像《斑羚飞渡》: 随着镰刀头羊的那声吼叫,整个斑羚群迅速分成两拨,老年斑羚为一拨,年轻斑羚为一拨。 就在这时,我看见,从那拨老斑羚里走出一只公斑羚来。公斑羚朝那拨年轻斑羚示意性地咩了一声,一只半大的斑羚应声走了出来。一老一少走到伤心崖,后退了几步,突...
立即提问