android studio里配置C++报错? 5C

org.gradle.api.tasks.TaskExecutionException: Execution failed for task ':app:transformNativeLibsWithMergeJniLibsForDebug'.
at org.gradle.api.internal.tasks.execution.ExecuteActionsTaskExecuter.executeActions(ExecuteActionsTaskExecuter.java:103)
at org.gradle.api.internal.tasks.execution.ExecuteActionsTaskExecuter.execute(ExecuteActionsTaskExecuter.java:73)
at org.gradle.api.internal.tasks.execution.OutputDirectoryCreatingTaskExecuter.execute(OutputDirectoryCreatingTaskExecuter.java:51)
at org.gradle.api.internal.tasks.execution.SkipUpToDateTaskExecuter.execute(SkipUpToDateTaskExecuter.java:59)
at org.gradle.api.internal.tasks.execution.ResolveTaskOutputCachingStateExecuter.execute(ResolveTaskOutputCachingStateExecuter.java:54)
at org.gradle.api.internal.tasks.execution.ValidatingTaskExecuter.execute(ValidatingTaskExecuter.java:59)
at org.gradle.api.internal.tasks.execution.SkipEmptySourceFilesTaskExecuter.execute(SkipEmptySourceFilesTaskExecuter.java:101)
at org.gradle.api.internal.tasks.execution.FinalizeInputFilePropertiesTaskExecuter.execute(FinalizeInputFilePropertiesTaskExecuter.java:44)
at org.gradle.api.internal.tasks.execution.CleanupStaleOutputsExecuter.execute(CleanupStaleOutputsExecuter.java:91)
at org.gradle.api.internal.tasks.execution.ResolveTaskArtifactStateTaskExecuter.execute(ResolveTaskArtifactStateTaskExecuter.java:62)
at org.gradle.api.internal.tasks.execution.SkipTaskWithNoActionsExecuter.execute(SkipTaskWithNoActionsExecuter.java:59)
at org.gradle.api.internal.tasks.execution.SkipOnlyIfTaskExecuter.execute(SkipOnlyIfTaskExecuter.java:54)
at org.gradle.api.internal.tasks.execution.ExecuteAtMostOnceTaskExecuter.execute(ExecuteAtMostOnceTaskExecuter.java:43)
at org.gradle.api.internal.tasks.execution.CatchExceptionTaskExecuter.execute(CatchExceptionTaskExecuter.java:34)
at org.gradle.execution.taskgraph.DefaultTaskGraphExecuter$EventFiringTaskWorker$1.run(DefaultTaskGraphExecuter.java:256)
at org.gradle.internal.progress.DefaultBuildOperationExecutor$RunnableBuildOperationWorker.execute(DefaultBuildOperationExecutor.java:336)
at org.gradle.internal.progress.DefaultBuildOperationExecutor$RunnableBuildOperationWorker.execute(DefaultBuildOperationExecutor.java:328)
at org.gradle.internal.progress.DefaultBuildOperationExecutor.execute(DefaultBuildOperationExecutor.java:199)
at org.gradle.internal.progress.DefaultBuildOperationExecutor.run(DefaultBuildOperationExecutor.java:110)
at org.gradle.execution.taskgraph.DefaultTaskGraphExecuter$EventFiringTaskWorker.execute(DefaultTaskGraphExecuter.java:249)
at org.gradle.execution.taskgraph.DefaultTaskGraphExecuter$EventFiringTaskWorker.execute(DefaultTaskGraphExecuter.java:238)
at org.gradle.execution.taskgraph.DefaultTaskPlanExecutor$TaskExecutorWorker.processTask(DefaultTaskPlanExecutor.java:123)
at org.gradle.execution.taskgraph.DefaultTaskPlanExecutor$TaskExecutorWorker.access$200(DefaultTaskPlanExecutor.java:79)
at org.gradle.execution.taskgraph.DefaultTaskPlanExecutor$TaskExecutorWorker$1.execute(DefaultTaskPlanExecutor.java:104)
at org.gradle.execution.taskgraph.DefaultTaskPlanExecutor$TaskExecutorWorker$1.execute(DefaultTaskPlanExecutor.java:98)
at org.gradle.execution.taskgraph.DefaultTaskExecutionPlan.execute(DefaultTaskExecutionPlan.java:663)
at org.gradle.execution.taskgraph.DefaultTaskExecutionPlan.executeWithTask(DefaultTaskExecutionPlan.java:597)
at org.gradle.execution.taskgraph.DefaultTaskPlanExecutor$TaskExecutorWorker.run(DefaultTaskPlanExecutor.java:98)
at org.gradle.internal.concurrent.ExecutorPolicy$CatchAndRecordFailures.onExecute(ExecutorPolicy.java:63)
at org.gradle.internal.concurrent.ManagedExecutorImpl$1.run(ManagedExecutorImpl.java:46)
at java.util.concurrent.ThreadPoolExecutor.runWorker(ThreadPoolExecutor.java:1142)
at java.util.concurrent.ThreadPoolExecutor$Worker.run(ThreadPoolExecutor.java:617)
at org.gradle.internal.concurrent.ThreadFactoryImpl$ManagedThreadRunnable.run(ThreadFactoryImpl.java:55)
at java.lang.Thread.run(Thread.java:745)
Caused by: java.io.UncheckedIOException: java.nio.file.AccessDeniedException: C:\WINDOWS\Temp
at com.android.builder.merge.LazyIncrementalFileMergerInputs.load(LazyIncrementalFileMergerInputs.java:88)
at com.android.builder.merge.LazyIncrementalFileMergerInputs.lambda$fromNew$0(LazyIncrementalFileMergerInputs.java:59)
at com.android.tools.build.apkzlib.utils.CachedSupplier.get(CachedSupplier.java:72)
at com.android.builder.merge.LazyIncrementalFileMergerInput.lambda$new$2(LazyIncrementalFileMergerInput.java:138)
at com.android.tools.build.apkzlib.utils.CachedSupplier.get(CachedSupplier.java:72)
at com.android.builder.merge.LazyIncrementalFileMergerInput.open(LazyIncrementalFileMergerInput.java:225)
at com.android.builder.merge.DelegateIncrementalFileMergerInput.open(DelegateIncrementalFileMergerInput.java:49)
at com.google.common.collect.ImmutableList.forEach(ImmutableList.java:406)
at com.android.builder.merge.IncrementalFileMerger.merge(IncrementalFileMerger.java:73)
at com.android.build.gradle.internal.transforms.MergeJavaResourcesTransform.transform(MergeJavaResourcesTransform.java:411)
at com.android.build.gradle.internal.pipeline.TransformTask$2.call(TransformTask.java:239)
at com.android.build.gradle.internal.pipeline.TransformTask$2.call(TransformTask.java:235)
at com.android.builder.profile.ThreadRecorder.record(ThreadRecorder.java:102)
at com.android.build.gradle.internal.pipeline.TransformTask.transform(TransformTask.java:230)
at sun.reflect.NativeMethodAccessorImpl.invoke0(Native Method)
at sun.reflect.NativeMethodAccessorImpl.invoke(NativeMethodAccessorImpl.java:62)
at sun.reflect.DelegatingMethodAccessorImpl.invoke(DelegatingMethodAccessorImpl.java:43)
at java.lang.reflect.Method.invoke(Method.java:498)
at org.gradle.internal.reflect.JavaMethod.invoke(JavaMethod.java:73)
at org.gradle.api.internal.project.taskfactory.IncrementalTaskAction.doExecute(IncrementalTaskAction.java:50)
at org.gradle.api.internal.project.taskfactory.StandardTaskAction.execute(StandardTaskAction.java:39)
at org.gradle.api.internal.project.taskfactory.StandardTaskAction.execute(StandardTaskAction.java:26)
at org.gradle.api.internal.tasks.execution.ExecuteActionsTaskExecuter$1.run(ExecuteActionsTaskExecuter.java:124)
at org.gradle.internal.progress.DefaultBuildOperationExecutor$RunnableBuildOperationWorker.execute(DefaultBuildOperationExecutor.java:336)
at org.gradle.internal.progress.DefaultBuildOperationExecutor$RunnableBuildOperationWorker.execute(DefaultBuildOperationExecutor.java:328)
at org.gradle.internal.progress.DefaultBuildOperationExecutor.execute(DefaultBuildOperationExecutor.java:199)
at org.gradle.internal.progress.DefaultBuildOperationExecutor.run(DefaultBuildOperationExecutor.java:110)
at org.gradle.api.internal.tasks.execution.ExecuteActionsTaskExecuter.executeAction(ExecuteActionsTaskExecuter.java:113)
at org.gradle.api.internal.tasks.execution.ExecuteActionsTaskExecuter.executeActions(ExecuteActionsTaskExecuter.java:95)
... 33 more
Caused by: java.nio.file.AccessDeniedException: C:\WINDOWS\Temp
at sun.nio.fs.WindowsException.translateToIOException(WindowsException.java:83)
at sun.nio.fs.WindowsException.rethrowAsIOException(WindowsException.java:97)
at sun.nio.fs.WindowsException.rethrowAsIOException(WindowsException.java:102)
at sun.nio.fs.WindowsDirectoryStream.(WindowsDirectoryStream.java:86)
at sun.nio.fs.WindowsFileSystemProvider.newDirectoryStream(WindowsFileSystemProvider.java:518)
at java.nio.file.Files.newDirectoryStream(Files.java:457)
at com.google.common.io.MoreFiles.deleteRecursively(MoreFiles.java:516)
at com.android.tools.build.apkzlib.bytestorage.TemporaryFile.deleteFile(TemporaryFile.java:57)
at com.android.tools.build.apkzlib.bytestorage.TemporaryFile.close(TemporaryFile.java:48)
at com.android.tools.build.apkzlib.bytestorage.TemporaryDirectory$1.close(TemporaryDirectory.java:50)
at com.android.tools.build.apkzlib.bytestorage.TemporaryDirectoryStorage.close(TemporaryDirectoryStorage.java:101)
at com.android.tools.build.apkzlib.bytestorage.OverflowToDiskByteStorage.close(OverflowToDiskByteStorage.java:167)
at com.android.tools.build.apkzlib.bytestorage.ChunkBasedByteStorage.close(ChunkBasedByteStorage.java:142)
at com.android.tools.build.apkzlib.zip.ZFile.close(ZFile.java:1210)
at com.android.builder.files.RelativeFiles.fromZip(RelativeFiles.java:125)
at com.android.builder.merge.LazyIncrementalFileMergerInputs.load(LazyIncrementalFileMergerInputs.java:86)
... 61 more

1个回答

Caused by: java.nio.file.AccessDeniedException: C:\WINDOWS\Temp
权限问题,无法访问临时文件夹,用管理员权限运行,另外检查下C:\WINDOWS\Temp目录是否存在,是否有权限,磁盘是否有空间

jinyu_mobao
jinyu_mobao 目录存在,可以被打开,可还是报错呀
10 个月之前 回复
Csdn user default icon
上传中...
上传图片
插入图片
抄袭、复制答案,以达到刷声望分或其他目的的行为,在CSDN问答是严格禁止的,一经发现立刻封号。是时候展现真正的技术了!
其他相关推荐
android studio里配置C++报错?

org.gradle.api.tasks.TaskExecutionException: Execution failed for task ':app:transformNativeLibsWithMergeJniLibsForDebug'. at org.gradle.api.internal.tasks.execution.ExecuteActionsTaskExecuter.executeActions(ExecuteActionsTaskExecuter.java:103) at org.gradle.api.internal.tasks.execution.ExecuteActionsTaskExecuter.execute(ExecuteActionsTaskExecuter.java:73) at org.gradle.api.internal.tasks.execution.OutputDirectoryCreatingTaskExecuter.execute(OutputDirectoryCreatingTaskExecuter.java:51) at org.gradle.api.internal.tasks.execution.SkipUpToDateTaskExecuter.execute(SkipUpToDateTaskExecuter.java:59) at org.gradle.api.internal.tasks.execution.ResolveTaskOutputCachingStateExecuter.execute(ResolveTaskOutputCachingStateExecuter.java:54) at org.gradle.api.internal.tasks.execution.ValidatingTaskExecuter.execute(ValidatingTaskExecuter.java:59) at org.gradle.api.internal.tasks.execution.SkipEmptySourceFilesTaskExecuter.execute(SkipEmptySourceFilesTaskExecuter.java:101) at org.gradle.api.internal.tasks.execution.FinalizeInputFilePropertiesTaskExecuter.execute(FinalizeInputFilePropertiesTaskExecuter.java:44) at org.gradle.api.internal.tasks.execution.CleanupStaleOutputsExecuter.execute(CleanupStaleOutputsExecuter.java:91) at org.gradle.api.internal.tasks.execution.ResolveTaskArtifactStateTaskExecuter.execute(ResolveTaskArtifactStateTaskExecuter.java:62) at org.gradle.api.internal.tasks.execution.SkipTaskWithNoActionsExecuter.execute(SkipTaskWithNoActionsExecuter.java:59) at org.gradle.api.internal.tasks.execution.SkipOnlyIfTaskExecuter.execute(SkipOnlyIfTaskExecuter.java:54) at org.gradle.api.internal.tasks.execution.ExecuteAtMostOnceTaskExecuter.execute(ExecuteAtMostOnceTaskExecuter.java:43) at org.gradle.api.internal.tasks.execution.CatchExceptionTaskExecuter.execute(CatchExceptionTaskExecuter.java:34) at org.gradle.execution.taskgraph.DefaultTaskGraphExecuter$EventFiringTaskWorker$1.run(DefaultTaskGraphExecuter.java:256) at org.gradle.internal.progress.DefaultBuildOperationExecutor$RunnableBuildOperationWorker.execute(DefaultBuildOperationExecutor.java:336) at org.gradle.internal.progress.DefaultBuildOperationExecutor$RunnableBuildOperationWorker.execute(DefaultBuildOperationExecutor.java:328) at org.gradle.internal.progress.DefaultBuildOperationExecutor.execute(DefaultBuildOperationExecutor.java:199) at org.gradle.internal.progress.DefaultBuildOperationExecutor.run(DefaultBuildOperationExecutor.java:110) at org.gradle.execution.taskgraph.DefaultTaskGraphExecuter$EventFiringTaskWorker.execute(DefaultTaskGraphExecuter.java:249) at org.gradle.execution.taskgraph.DefaultTaskGraphExecuter$EventFiringTaskWorker.execute(DefaultTaskGraphExecuter.java:238) at org.gradle.execution.taskgraph.DefaultTaskPlanExecutor$TaskExecutorWorker.processTask(DefaultTaskPlanExecutor.java:123) at org.gradle.execution.taskgraph.DefaultTaskPlanExecutor$TaskExecutorWorker.access$200(DefaultTaskPlanExecutor.java:79) at org.gradle.execution.taskgraph.DefaultTaskPlanExecutor$TaskExecutorWorker$1.execute(DefaultTaskPlanExecutor.java:104) at org.gradle.execution.taskgraph.DefaultTaskPlanExecutor$TaskExecutorWorker$1.execute(DefaultTaskPlanExecutor.java:98) at org.gradle.execution.taskgraph.DefaultTaskExecutionPlan.execute(DefaultTaskExecutionPlan.java:663) at org.gradle.execution.taskgraph.DefaultTaskExecutionPlan.executeWithTask(DefaultTaskExecutionPlan.java:597) at org.gradle.execution.taskgraph.DefaultTaskPlanExecutor$TaskExecutorWorker.run(DefaultTaskPlanExecutor.java:98) at org.gradle.internal.concurrent.ExecutorPolicy$CatchAndRecordFailures.onExecute(ExecutorPolicy.java:63) at org.gradle.internal.concurrent.ManagedExecutorImpl$1.run(ManagedExecutorImpl.java:46) at java.util.concurrent.ThreadPoolExecutor.runWorker(ThreadPoolExecutor.java:1142) at java.util.concurrent.ThreadPoolExecutor$Worker.run(ThreadPoolExecutor.java:617) at org.gradle.internal.concurrent.ThreadFactoryImpl$ManagedThreadRunnable.run(ThreadFactoryImpl.java:55) at java.lang.Thread.run(Thread.java:745) Caused by: java.io.UncheckedIOException: java.nio.file.AccessDeniedException: C:\WINDOWS\Temp at com.android.builder.merge.LazyIncrementalFileMergerInputs.load(LazyIncrementalFileMergerInputs.java:88) at com.android.builder.merge.LazyIncrementalFileMergerInputs.lambda$fromNew$0(LazyIncrementalFileMergerInputs.java:59) at com.android.tools.build.apkzlib.utils.CachedSupplier.get(CachedSupplier.java:72) at com.android.builder.merge.LazyIncrementalFileMergerInput.lambda$new$2(LazyIncrementalFileMergerInput.java:138) at com.android.tools.build.apkzlib.utils.CachedSupplier.get(CachedSupplier.java:72) at com.android.builder.merge.LazyIncrementalFileMergerInput.open(LazyIncrementalFileMergerInput.java:225) at com.android.builder.merge.DelegateIncrementalFileMergerInput.open(DelegateIncrementalFileMergerInput.java:49) at com.google.common.collect.ImmutableList.forEach(ImmutableList.java:406) at com.android.builder.merge.IncrementalFileMerger.merge(IncrementalFileMerger.java:73) at com.android.build.gradle.internal.transforms.MergeJavaResourcesTransform.transform(MergeJavaResourcesTransform.java:411) at com.android.build.gradle.internal.pipeline.TransformTask$2.call(TransformTask.java:239) at com.android.build.gradle.internal.pipeline.TransformTask$2.call(TransformTask.java:235) at com.android.builder.profile.ThreadRecorder.record(ThreadRecorder.java:102) at com.android.build.gradle.internal.pipeline.TransformTask.transform(TransformTask.java:230) at sun.reflect.NativeMethodAccessorImpl.invoke0(Native Method) at sun.reflect.NativeMethodAccessorImpl.invoke(NativeMethodAccessorImpl.java:62) at sun.reflect.DelegatingMethodAccessorImpl.invoke(DelegatingMethodAccessorImpl.java:43) at java.lang.reflect.Method.invoke(Method.java:498) at org.gradle.internal.reflect.JavaMethod.invoke(JavaMethod.java:73) at org.gradle.api.internal.project.taskfactory.IncrementalTaskAction.doExecute(IncrementalTaskAction.java:50) at org.gradle.api.internal.project.taskfactory.StandardTaskAction.execute(StandardTaskAction.java:39) at org.gradle.api.internal.project.taskfactory.StandardTaskAction.execute(StandardTaskAction.java:26) at org.gradle.api.internal.tasks.execution.ExecuteActionsTaskExecuter$1.run(ExecuteActionsTaskExecuter.java:124) at org.gradle.internal.progress.DefaultBuildOperationExecutor$RunnableBuildOperationWorker.execute(DefaultBuildOperationExecutor.java:336) at org.gradle.internal.progress.DefaultBuildOperationExecutor$RunnableBuildOperationWorker.execute(DefaultBuildOperationExecutor.java:328) at org.gradle.internal.progress.DefaultBuildOperationExecutor.execute(DefaultBuildOperationExecutor.java:199) at org.gradle.internal.progress.DefaultBuildOperationExecutor.run(DefaultBuildOperationExecutor.java:110) at org.gradle.api.internal.tasks.execution.ExecuteActionsTaskExecuter.executeAction(ExecuteActionsTaskExecuter.java:113) at org.gradle.api.internal.tasks.execution.ExecuteActionsTaskExecuter.executeActions(ExecuteActionsTaskExecuter.java:95) ... 33 more Caused by: java.nio.file.AccessDeniedException: C:\WINDOWS\Temp at sun.nio.fs.WindowsException.translateToIOException(WindowsException.java:83) at sun.nio.fs.WindowsException.rethrowAsIOException(WindowsException.java:97) at sun.nio.fs.WindowsException.rethrowAsIOException(WindowsException.java:102) at sun.nio.fs.WindowsDirectoryStream.<init>(WindowsDirectoryStream.java:86) at sun.nio.fs.WindowsFileSystemProvider.newDirectoryStream(WindowsFileSystemProvider.java:518) at java.nio.file.Files.newDirectoryStream(Files.java:457) at com.google.common.io.MoreFiles.deleteRecursively(MoreFiles.java:516) at com.android.tools.build.apkzlib.bytestorage.TemporaryFile.deleteFile(TemporaryFile.java:57) at com.android.tools.build.apkzlib.bytestorage.TemporaryFile.close(TemporaryFile.java:48) at com.android.tools.build.apkzlib.bytestorage.TemporaryDirectory$1.close(TemporaryDirectory.java:50) at com.android.tools.build.apkzlib.bytestorage.TemporaryDirectoryStorage.close(TemporaryDirectoryStorage.java:101) at com.android.tools.build.apkzlib.bytestorage.OverflowToDiskByteStorage.close(OverflowToDiskByteStorage.java:167) at com.android.tools.build.apkzlib.bytestorage.ChunkBasedByteStorage.close(ChunkBasedByteStorage.java:142) at com.android.tools.build.apkzlib.zip.ZFile.close(ZFile.java:1210) at com.android.builder.files.RelativeFiles.fromZip(RelativeFiles.java:125) at com.android.builder.merge.LazyIncrementalFileMergerInputs.load(LazyIncrementalFileMergerInputs.java:86) ... 61 more

Android Studio如何配置环境变量

想请教一下,用Android Studio开发时,需要配置ANDROID_SDK_HOME环境变量吗?我设置的是sdk文件夹所在的路径: ``` C:\Users\acer\AppData\Local\Android\sdk ``` 有没有错呢?或者说是否需要配置呢?因为当我启动模拟器或者启动手机编译的时候,会有提示信息: ``` Waiting for device. C:\Users\acer\AppData\Local\Android\sdk\tools\emulator.exe -avd Nexus_5_API_21_x86 -netspeed full -netdelay none ``` 以及gradle console的报错信息: ``` FAILURE: Build failed with an exception. * What went wrong: Execution failed for task ':app:preDexDebug'. > com.android.ide.common.internal.LoggedErrorException: Failed to run command: C:\Users\acer\AppData\Local\Android\sdk\build-tools\21.1.1\dx.bat --dex --output C:\Users\acer\AndroidStudioProjects\AndroidTutorial\app\build\intermediates\pre-dexed\debug\classes-88c274548bdbb2cca7c59c342ef8955f7e09092a.jar C:\Users\acer\AndroidStudioProjects\AndroidTutorial\app\build\intermediates\exploded-aar\com.android.support\support-v4\21.0.3\classes.jar Error Code: 255 Output: 'reg' 不是内部或外部命令,也不是可运行的程序 或批处理文件。 ```

android studio插件jrebel for android报错

报错信息,请问怎么解决,或者提供思路 ``` :app:processDebugResources FAILED Error:failed to create directory 'C:\Users\Administrator\.jrebel-android\gradle\0\debug\build-dir\WAvatar\app\build\generated\source\r\debug\android\support\v7\appcompat', error: 13 Permission denied. Error:Execution failed for task ':app:processDebugResources'. > Process 'C:\Users\Administrator\.jrebel-android\distributions\2.5.14_20171220124024\bin\win32\aapt2.exe' finished with non-zero exit value 1 ```

androidstudio运行时总是报错:求大神指教

报的错:Error:Execution failed for task ':app:dexDebug'. > com.android.ide.common.process.ProcessException: org.gradle.process.internal.ExecException: Process 'command 'C:\Program Files (x86)\Java\jdk1.7.0\bin\java.exe'' finished with non-zero exit value 2 网上说的更改架包,和设置studio里的默认路径等,试过了,不是这个问题; dos系统里用cmd以及javac都试过了,jdk、sdk都配置好了工作空间里也试过新建一个工程验证是否是代码问题,但都不是; 工程里build.gradle文件里更改sdk版本,也试过了没反应。 所以,现在很肯定是androidstudio里系统配置的问题,因为此问题对我很重要,所以请教大神,求指教

Android Studio配置SDK时发生错误,求大家帮帮忙

![图片说明](https://img-ask.csdn.net/upload/201912/27/1577432733_1367.png) 今天配置Android Studio,SDK是安卓4.2.2版本的,JDK是1.8版本的。前期配置完进入程序后再配置出现问题了,不知道哪里搞错了

Android Studio的项目运行时报错:Error configuring CMake server

# 问题背景 我在跟着csdn上的一个教程尝试用Android Studio(3.4.1) 做一个变声器的app项目,fmod的so库都导入进项目的libs了 ,build.gradle和cmakelist.txt也都按照那个教程配置了。 [AS制作变声器](https://blog.csdn.net/a_thousand_miles/article/details/81150906 "") 后来报错说不支持armeabi,网上查了下发现NDK17以上都不 支持了,遂下载了ndk16b替换之前的ndk17,ndk的location 也都改过了,然后终于build成功,开心。 但是插上usb准备在手机上运行测试下的时候,出现这个报错 ,Google了也没解决掉。报错:Error configuring CMake server (E:\Android\Sdk\cmake\3.10.2.4988404\bin). ![图片说明](https://img-ask.csdn.net/upload/201909/29/1569748738_97421.png) ** 有大佬知道怎么回事儿吗?** ###代码(build.gradle) ``` apply plugin: 'com.android.application' android { compileSdkVersion 29 buildToolsVersion "29.0.2" defaultConfig { applicationId "com.example.qq_voicechanger01" minSdkVersion 15 targetSdkVersion 29 versionCode 1 versionName "1.0" testInstrumentationRunner "androidx.test.runner.AndroidJUnitRunner" externalNativeBuild { cmake { cppFlags "" abiFilters 'armeabi','x86' } } //编译平台 ndk{ abiFilters "armeabi","x86" } } buildTypes { release { minifyEnabled false proguardFiles getDefaultProguardFile('proguard-android-optimize.txt'), 'proguard-rules.pro' } } externalNativeBuild { cmake { path "src/main/cpp/CMakeLists.txt" version "3.10.2" } } //目录 sourceSets.main{ jniLibs.srcDirs = ['libs'] jni.srcDirs = [] } } dependencies { implementation fileTree(dir: 'libs', include: ['*.jar']) implementation 'androidx.appcompat:appcompat:1.1.0' implementation 'androidx.constraintlayout:constraintlayout:1.1.3' testImplementation 'junit:junit:4.12' androidTestImplementation 'androidx.test:runner:1.2.0' androidTestImplementation 'androidx.test.espresso:espresso-core:3.2.0' } ``` ###代码(cmakelist.txt) ``` cmake_minimum_required(VERSION 3.4.1) find_library(log-lib log ) set(my_lib_path ${CMAKE_SOURECE_DIR}/libs) #添加第三方的so库 add_library( libfomd SHARED IMPORTED) #指明第三方so库的绝对路径 set_target_properties( libfmod PROPERTIES IMPORTED_LOCATION ${my_lib_path}/${ANDROID_ABI}/libfmod.so ) add_library( libfmodL SHARED IMPORTED ) set_target_properties( libfmodL PROPERTIES IMPORTED_LOCATION ${my_lib_path}/${ANDROID_ABI}/libfmodL.so ) set(CMAKE_CXX_FLAGS "${CMAKE_CXX_FLAGS} -std=gnu++11") #添加我们需要编译的cpp绝对路径 add_library( changeVoice SHARED src/main/cpp/play_sound.cpp src/main/cpp/common.cpp src/main/cpp/common_platform.cpp ) #导入路径,使编译时能找到这个文件夹 include_directories(src/main/cpp/inc) #连接好三个路径 target_link_libraries( changeVoice libfmod libfmodL ${log-lib} ) ```

android studio 混淆文件配置

![据说android studio 默认将libs的第三方jar包忽略混淆,所以就没有将类似#-libraryjars libs/umeng-analytics-v5.2.4.jar的操作写入到配置文件,只是将-keep class com.umeng.**{*;}和忽略警告的操作写入配置文件。但是发现gradle在.idea/libraries中引入了其他很多jar包以及这些包的存储地址。刚好程序报错中的com.b.a.a.a 就是指的idea/libraries中的一个包中的类,即为com.loopj.android.http.AsyncHttpClient,不知道怎么在混淆配置文件中忽略这些包的混淆。最后通过配置,发现这些包还是被混淆了,不知道怎么才能配置好这些包不被混淆](https://img-ask.csdn.net/upload/201511/10/1447140316_8891.jpg) 下面是我的配置文件: -optimizationpasses 5 -dontusemixedcaseclassnames -verbose -dontpreverify -optimizations !code/simplification/arithmetic,!field/*,!class/merging/* -keepattributes *Annotation* -keepattributes Signature -keep class android.**{*;} -keep public class * extends android.view -keep public class * extends android.app.Fragment -keep public class * extends android.app.Activity -keep public class * extends android.app.Application -keep public class * extends android.app.Service -keep public class * extends android.content.BroadcastReceiver -keep public class * extends android.content.ContentProvider -keep public class * extends android.app.backup.BackupAgentHelper -keep public class * extends android.preference.Preference -keep public class * extends android.support.V4.** -keep public class * extends android.vending.licensing.ILicensingService -dontwarn android.support.v4.** -keep class * extends android.support.v4.**{*;} -dontwarn android.support.v7.** -keep class * extends android.support.v7.**{*;} /* 将libs文件下的三方包忽略混淆*/ -keep class com.mob.logcolletor.**{ *;} -dontwarn com.mob.tools.** -keep class com.mob.tools.**{ *;} -dontwarn com.mob.baidu.** -keep class com.mob.baidu.**{ *;} -dontwarn cn.sharesdk.framework.** -keep class cn.sharesdk.framework.**{ *;} -dontwarn cn.sharesdk.system.email.** -keep class cn.sharesdk.system.email.**{ *;} -dontwarn cn.sharesdk.tencent.qq.** -keep class cn.sharesdk.tencent.qq.**{ *;} -dontwarn cn.sharesdk.system.text.** -keep class cn.sharesdk.system.text.**{ *;} -dontwarn cn.sharesdk.wechat.friends.** -keep class cn.sharesdk.wechat.friends.**{ *;} -dontwarn cn.sharesdk.wechat.utils.** -keep class cn.sharesdk.wechat.utils.**{ *;} -dontwarn cn.sharesdk.wechat.favorite.** -keep class cn.sharesdk.wechat.favorite.**{ *;} -dontwarn cn.sharesdk.wechat.moments.** -keep class cn.sharesdk.wechat.moments.**{ *;} -dontwarn com.tencent.** -keep class com.tencent..**{ *;} -keep public interface com.mob.logcolletor.** -keep public interface com.mob.tools.** -keep public interface com.mob.baidu.** -keep public interface cn.sharesdk.framework.** -keep public interface cn.sharesdk.system.email.** -keep public interface cn.sharesdk.tencent.qq.** -keep public interface cn.sharesdk.system.text.** -keep public interface cn.sharesdk.wechat.friends.** -keep public interface cn.sharesdk.wechat.utils.** -keep public interface cn.sharesdk.wechat.favorite.** -keep public interface cn.sharesdk.wechat.moments.** -keepclasseswithmembernames class * { native <methods>; } -keepclassmembers public class * extends android.view.View { void set*(***); *** get*(); } -keepclasseswithmembernames class * { void onClick*(...); } -keepclasseswithmembernames class * { *** *Callback(...); } -keepclasseswithmembernames class * { public <init>(android.content.Context,android.util.AttributeSet,int); } -keepclasseswithmembernames class * { public <init>(android.content.Context,android.util.AttributeSet); } -keepclassmembers class * extends android.app.Activity { public void *(android.view.View); } -keepclassmembers enum * { public static **[] values(); public static ** valueOf(java.lang.String); } -keep class * implements android.os.Parcelable { public static final android.os.Parcelable$Creator *; } -keep class org.apache.http.**{*;} -keepclassmembers class **.R$* { public static <fields>; } /* 将External Libraries文件下的三方包忽略混淆*/ -libraryjars $USER_HOME$/.gradle/caches/modules-2/files-2.1/com.loopj.android/android-async-http/1.4.8/77bbfe240e437ecb396d982afa0d3bd4f9090ba7/android-async-http-1.4.8.jar -libraryjars $USER_HOME$/.gradle/caches/modules-2/files-2.1/com.loopj.android/android-async-http/1.4.8/ec314dce534e83c93364388d023625bb8e605e38/android-async-http-1.4.8-sources.jar! -libraryjars build/intermediates/exploded-aar/com.soundcloud.android/android-crop/1.0.0/jars/classes.jar -libraryjars build/intermediates/exploded-aar/com.android.support/appcompat-v7/23.0.0/jars/classes.jar -libraryjars $USER_HOME$/Documents/androidWorkSpace/android-sdk-macosx/extras/android/m2repository/com/android/support/appcompat-v7/23.0.0/appcompat-v7-23.0.0-sources.jar -libraryjars $USER_HOME$/.gradle/caches/modules-2/files-2.1/com.jakewharton/butterknife/7.0.1/d5d13ea991eab0252e3710e5df3d6a9d4b21d461/butterknife-7.0.1.jar -libraryjars $USER_HOME$/.gradle/caches/modules-2/files-2.1/com.jakewharton/butterknife/7.0.1/ad53343e57ae0969aaf451a19eef381abe2ad3a1/butterknife-7.0.1-sources.jar -libraryjars build/intermediates/exploded-aar/com.android.support/cardview-v7/23.0.0/jars/classes.jar -libraryjars $USER_HOME$/Documents/androidWorkSpace/android-sdk-macosx/extras/android/m2repository/com/android/support/cardview-v7/23.0.0/cardview-v7-23.0.0-sources.jar -libraryjars build/intermediates/exploded-aar/com.android.support/design/23.0.0/jars/classes.jar -libraryjars $USER_HOME$/.gradle/caches/modules-2/files-2.1/com.github.bumptech.glide/glide/3.6.1/86b122e640af09b0723e1fa44083c354ba6d9089/glide-3.6.1.jar -libraryjars $USER_HOME$/.gradle/caches/modules-2/files-2.1/com.github.bumptech.glide/glide/3.6.1/c84c6f18844d9ae76308619008d40277de5e77d3/glide-3.6.1-sources.jar -libraryjars $USER_HOME$/.gradle/caches/modules-2/files-2.1/com.google.code.gson/gson/2.3/5fc52c41ef0239d1093a1eb7c3697036183677ce/gson-2.3.jar -libraryjars $USER_HOME$/.gradle/caches/modules-2/files-2.1/com.google.code.gson/gson/2.3/21e31b9298ed677b17fcac6dd0eb0a82ec35adc2/gson-2.3-sources.jar -libraryjars $USER_HOME$/.gradle/caches/modules-2/files-2.1/org.apache.httpcomponents/httpcore/4.3.2/31fbbff1ddbf98f3aa7377c94d33b0447c646b6e/httpcore-4.3.2.jar -libraryjars $USER_HOME$/.gradle/caches/modules-2/files-2.1/org.apache.httpcomponents/httpcore/4.3.2/4809f38359edeea9487f747e09aa58ec8d3a54c5/httpcore-4.3.2-sources.jar -libraryjars build/intermediates/exploded-aar/com.rengwuxian.materialedittext/library/2.1.4/jars/classes.jar -libraryjars $USER_HOME$/.gradle/caches/modules-2/files-2.1/com.nineoldandroids/library/2.4.0/e9b63380f3a242dbdbf103a2355ad7e43bad17cb/library-2.4.0.jar -libraryjars $USER_HOME$/.gradle/caches/modules-2/files-2.1/com.nineoldandroids/library/2.4.0/83d41901478fa8795254244acbafd03f14224dab/library-2.4.0-sources.jar -libraryjars build/intermediates/exploded-aar/com.orhanobut/logger/1.10/jars/classes.jar -libraryjars build/intermediates/exploded-aar/com.android.support/recyclerview-v7/23.0.0/jars/classes.jar -libraryjars $USER_HOME$/Documents/androidWorkSpace/android-sdk-macosx/extras/android/m2repository/com/android/support/recyclerview-v7/23.0.0/recyclerview-v7-23.0.0-sources.jar -libraryjars $USER_HOME$/Documents/androidWorkSpace/android-sdk-macosx/extras/android/m2repository/com/android/support/support-annotations/23.0.0/support-annotations-23.0.0.jar -libraryjars $USER_HOME$/Documents/androidWorkSpace/android-sdk-macosx/extras/android/m2repository/com/android/support/support-annotations/23.0.0/support-annotations-23.0.0-sources.jar -libraryjars build/intermediates/exploded-aar/com.android.support/support-v4/23.0.0/jars/classes.jar -libraryjars build/intermediates/exploded-aar/com.android.support/support-v4/23.0.0/jars/libs/internal_impl-23.0.0.jar -libraryjars $USER_HOME$/Documents/androidWorkSpace/android-sdk-macosx/extras/android/m2repository/com/android/support/support-v4/23.0.0/support-v4-23.0.0-sources.jar -dontwarn com.loopj.android.http.** -keep class com.loopj.android.http.**{ *;} -dontwarn com.baidu.** -keep class com.baidu.**{ *;} -dontwarn com.bumptech.glide.** -keep class com.bumptech.glide.**{ *;} -dontwarn com.google.gson.** -keep class com.google.gson.http.**{ *;} -dontwarn com.nineoldandroids.** -keep class com.nineoldandroids.**{ *;} -dontwarn com.orhanobut.logger.** -keep class com.orhanobut.logger.**{ *;} -dontwarn com.rengwuxian.materialedittext.** -keep class com.rengwuxian.materialedittext.**{ *;} -dontwarn com.soundcloud.android.crop.** -keep class com.soundcloud.android.crop.**{ *;} -ignorewarning -dump class_files.txt -printseeds seeds.txt -printusage unused.txt -printmapping mapping.txt

android studio ndk support 问题,jni.h红

android studio打开.c .h, 一片红,提示 ndk support is an experimental feature and all use case are not yet supported 。 设置了android.useDeprecatedNdk=true 也是不行。求解答

android studio 导入工程报错

![图片说明](https://img-ask.csdn.net/upload/201506/06/1433563889_719656.png)

Android studio配置Gradle路径错误

Gradle location is incorrect.这是怎么回事呀,百度上找不到答案

求助,android studio编译问题

这是什么错误,在用android 4.4时出现错误,但在android7.0中编译通过,不知怎么回事![图片](https://img-ask.csdn.net/upload/201704/19/1492612076_318020.png)

android studio修改minSdkVersion

导入第三方的sdk'需要修改minSdkVersion,可是改了之后一直报以下错误: Error:Execution failed for task ':app:processDebugManifest'. > Manifest merger failed : uses-sdk:minSdkVersion 8 cannot be smaller than version 9 declared in library [com.android.support:appcompat-v7:25.3.1] C:\Users\Weizhi.Shi\.android\build-cache\e14beb946f83c1364b932d1d0a8187ffcbf64ba2\output\AndroidManifest.xml Suggestion: use tools:overrideLibrary="android.support.v7.appcompat" to force usage 运行第三方的demo又运行不来,请大神帮忙!!!

AndroidStudio配置annotation出现的错误 求大神指点

我按照网上的教程配置之后运行时报如下异常 (此为网上的配置教程(http://www.cnblogs.com/ismars/p/4855551.html)) Error:Execution failed for task ':androidannotation:transformResourcesWithMergeJavaResForDebug'. > com.android.build.api.transform.TransformException: com.android.builder.packaging.DuplicateFileException: Duplicate files copied in APK androidannotations-api.properties File1: C:\Users\Cooyw\AndroidStudioProjects\MyApplication\androidannotation\libs\androidannotations-api-3.2.jar File2: C:\Users\Cooyw\.gradle\caches\modules-2\files-2.1\org.androidannotations\androidannotations-api\3.2\89b33bb1e996eb2c4089f79d1b8651c71fe8e2d1\androidannotations-api-3.2.jar

Android Studio 运行程序Message出现错误提示,程序可以运行,求大神解答!

Message错误提示: Information:Gradle tasks [:app:clean, :app:generateDebugSources, :app:generateDebugAndroidTestSources, :app:mockableAndroidJar, :app:prepareDebugUnitTestDependencies, :app:assembleDebug] build.gradle配置文件: android { compileSdkVersion 25 buildToolsVersion "24.0.3" defaultConfig { applicationId "com.lx.weatherday" minSdkVersion 17 targetSdkVersion 25 versionCode 1 versionName "1.0" testInstrumentationRunner "android.support.test.runner.AndroidJUnitRunner" } buildTypes { release { minifyEnabled false proguardFiles getDefaultProguardFile('proguard-android.txt'), 'proguard-rules.pro' } } } dependencies { compile fileTree(include: ['*.jar'], dir: 'libs') androidTestCompile('com.android.support.test.espresso:espresso-core:2.2.2', { exclude group: 'com.android.support', module: 'support-annotations' }) compile 'com.android.support:appcompat-v7:25.1.0' testCompile 'junit:junit:4.12' compile 'com.android.support:design:25.1.0' compile files('libs/BaiduLBS_Android.jar') compile 'fr.baloomba:viewpagerindicator:2.4.2' compile 'com.squareup.okhttp3:okhttp:3.6.0' compile 'io.github.openfeign:feign-gson:9.4.0' } 请求大神解答?

AndroidStudio无法启动Gradle守护进程

![图片说明](https://img-ask.csdn.net/upload/201801/08/1515391936_466522.png)![图片说明](https://img-ask.csdn.net/upload/201801/08/1515391946_396376.png) 1.删除文件夹c:\users\{username}\.gradle然后重启Android Studiao,更新gradle。 2.打开工程的gradle.properties文件,添加如下配置项org.gradle.jvmargs=-Xmx512m -XX:MaxPermSize=512m 这两种方法都试过,studio我都重装过,还是一打开项目就报错(项目没问题,因为新建一个项目也报这种错),studio版本是3.0的 ,有没有遇到这种问题并解决的高手啊

Android 导入jar外包时编译出错

![图片说明](https://img-ask.csdn.net/upload/201904/05/1554450436_461843.png)

android studio运行项目时出现的问题

错误如下,大概是某临时文件vfs-1487593167450-0'关闭失败导致无法删除,请问有什么解决办法吗 Error:Library writing phase: I/O error when accessing file 'E:\workspace\Ruisi-master\app\build\intermediates\transforms\preJackRuntimeLibraries\debug\jars\8000\40\android-75cb5e563818b5d3af7f64011947256b86f43128.jar': directory 'C:\Users\ADMINI~1\AppData\Local\Temp\vfs-1487593167450-0' failed to be closed: Failed to delete directory 'C:\Users\ADMINI~1\AppData\Local\Temp\vfs-1487593167450-0'

配置Android环境后,eclipse启动报错

在配置完Android环境后,且创建了Android应用程序,此后每次启动eclipse,都会报以下错误: Error: Error parsing D:\Program Files\Java\Android\android-sdk\system-images\android-23\android-wear\armeabi-v7a\devices.xml cvc-complex-type.2.4.d: 发现了以元素 'd:skin' 开头的无效内容。此处不应含有子元素。 Error: Error parsing D:\Program Files\Java\Android\android-sdk\system-images\android-23\android-wear\x86\devices.xml cvc-complex-type.2.4.d: 发现了以元素 'd:skin' 开头的无效内容。此处不应含有子元素。 Error: Error parsing D:\Program Files\Java\Android\android-sdk\system-images\android-23\android-wear\armeabi-v7a\devices.xml cvc-complex-type.2.4.d: 发现了以元素 'd:skin' 开头的无效内容。此处不应含有子元素。 Error: Error parsing D:\Program Files\Java\Android\android-sdk\system-images\android-23\android-wear\x86\devices.xml cvc-complex-type.2.4.d: 发现了以元素 'd:skin' 开头的无效内容。此处不应含有子元素。 不清楚是什么原因,求解答?

ANDROID STUDIO网络问题

报错为: 01/09 11:01:50: Launching app $ adb push C:\Users\Administrator\AndroidStudioProjects\MyApplication13\app\build\outputs\apk\app-debug.apk /data/local/tmp/com.example.administrator.myapplication $ adb shell pm install -r "/data/local/tmp/com.example.administrator.myapplication" Success $ adb shell am start -n "com.example.administrator.myapplication/com.example.administrator.myapplication.MainActivity" -a android.intent.action.MAIN -c android.intent.category.LAUNCHER Client not ready yet..Connected to process 2346 on device emulator-5554 W/System: ClassLoader referenced unknown path: /data/app/com.example.administrator.myapplication-1/lib/x86 I/InstantRun: Instant Run Runtime started. Android package is com.example.administrator.myapplication, real application class is null. W/System: ClassLoader referenced unknown path: /data/app/com.example.administrator.myapplication-1/lib/x86 W/art: Verification of void android.support.v7.app.AppCompatActivity.onSupportActionModeFinished(android.support.v7.view.ActionMode) took 1.372s W/art: Before Android 4.1, method android.graphics.PorterDuffColorFilter android.support.graphics.drawable.VectorDrawableCompat.updateTintFilter(android.graphics.PorterDuffColorFilter, android.content.res.ColorStateList, android.graphics.PorterDuff$Mode) would have incorrectly overridden the package-private method in android.graphics.drawable.Drawable W/gralloc_ranchu: Gralloc pipe failed [ 01-09 03:02:02.837 2346: 2346 D/ ] HostConnection::get() New Host Connection established 0x9daf8380, tid 2346 I/OpenGLRenderer: Initialized EGL, version 1.4 D/OpenGLRenderer: Swap behavior 1 D/NetworkSecurityConfig: No Network Security Config specified, using platform default Application terminated. 在权限中,我已经添加了网络权限。 但是不知道为什么就是不行。 源代码如下: package com.example.administrator.myapplication; import android.os.Bundle; import android.support.v7.app.AppCompatActivity; import android.view.View; import android.widget.Button; import android.widget.TextView; import java.io.BufferedReader; import java.io.IOException; import java.io.InputStream; import java.io.InputStreamReader; import java.net.HttpURLConnection; import java.net.URL; import static android.icu.lang.UCharacter.GraphemeClusterBreak.V; public class MainActivity extends AppCompatActivity implements View.OnClickListener{ TextView responseText; @Override protected void onCreate(Bundle savedInstanceState) { super.onCreate(savedInstanceState); setContentView(R.layout.activity_main); Button sendRquest=(Button)findViewById(R.id.send_request); responseText=(TextView)findViewById(R.id.requestion_text); sendRquest.setOnClickListener(this); } public void onClick(View v) { if(v.getId()==R.id.send_request) { sendResquestWithHttpURLConnection(); } } private void sendResquestWithHttpURLConnection() { new Thread(new Runnable() { @Override public void run() { HttpURLConnection connection=null; BufferedReader reader=null; try{ URL url=new URL("http://www.baidu.com"); connection=(HttpURLConnection)url.openConnection(); connection.setRequestMethod("GET"); connection.setConnectTimeout(8000); connection.setReadTimeout(8000); InputStream in=connection.getInputStream(); reader=new BufferedReader(new InputStreamReader(in)); StringBuilder response=new StringBuilder(); String line; while((line=reader.readLine())!=null) { response.append(in); } showResponse(response.toString()); } catch(Exception e) { e.printStackTrace(); } finally { if(reader!=null){ try{ reader.close(); }catch (IOException e) { e.printStackTrace(); } } if(connection!=null) { connection.disconnect(); } } } }).start(); } private void showResponse(final String response){ runOnUiThread(new Runnable(){ public void run(){ responseText.setText(response); } }); } }

在Android studio运行模拟器时报错Emulator: qemu_ram_alloc_user_backed: call

每次启动模拟器都会报这个错误,刚接触Android开发不知道为啥,有没有大佬解答一下。 ``` package com.example.lenovo.myapplication; import android.content.Context; import android.graphics.Canvas; import android.graphics.Color; import android.graphics.Paint; import android.os.Handler; import android.os.Message; import android.support.v7.app.AppCompatActivity; import android.os.Bundle; import android.util.DisplayMetrics; import android.view.Display; import android.view.View; import android.view.WindowManager; public class MainActivity extends AppCompatActivity { private int zmkuan; int zmGao; //小球的变量 float qiu_size = 16; float qiu_sudu =3; float qiu_shang = 90; float qiuX; float qiuY; //柱子的变量 float zhu_gao ; float zhu_gao_2; float zhu_kaun = 80; float zhu_kaun_2 = 80; float zhuX; float zhuY; float zhuX_2; float zhuY_2; float zhu_sudu; int num = 0;//小球通过柱子数 boolean jieshu = false;//盘孤单小球是否结束 MyGameView myGameView;//为了能在全局访问到这个变量 @Override protected void onCreate(Bundle savedInstanceState) { super.onCreate(savedInstanceState); //设置为全屏,固定写法 getWindow().setFlags(WindowManager.LayoutParams.FLAG_FORCE_NOT_FULLSCREEN,WindowManager.LayoutParams.FLAG_FULLSCREEN); //使游戏横屏,修改配置文件AndroidMainifest.xml: <activity android:name=".MainActivity" android:screenOrientation="landscape"> //获取游戏视图 MyGameView myGameView = new MyGameView(this); setContentView(myGameView); //获取窗口的一个管理器,固定写法 WindowManager windowManager = getWindowManager(); Display display = windowManager.getDefaultDisplay(); DisplayMetrics metrics = new DisplayMetrics(); display.getMetrics(metrics); //获取屏幕的宽和高 zmkuan = metrics.widthPixels; zmGao = metrics.heightPixels; play(); } public void play(){ jieshu = false; //设置两根柱子的初始位置 zhuX = zmkuan - zhu_kaun; zhuY = 0; zhuX_2 = zmkuan - zhu_kaun_2; zhuY_2 = zmGao; zhu_gao = zmGao/2 - 200; zhu_gao_2 = zmGao -zhu_gao -200; num = 0; zhu_sudu = 5; qiu_sudu = 3.5f; qiu_shang = 90; qiuX = 50; qiuY = zmGao/2; handler.sendEmptyMessage(0x123); } Handler handler = new Handler(){ @Override public void handleMessage(Message msg) { super.handleMessage(msg); if (msg.what == 0x123){ myGameView.invalidate(); } } }; class MyGameView extends View { Paint paint = new Paint(); public MyGameView(Context context) { super(context); } @Override protected void onDraw(Canvas canvas) { super.onDraw(canvas); paint.setStyle(Paint.Style.FILL); paint.setAntiAlias(true);//设置抗锯齿 if (jieshu){ //执行游戏结束后的效果 }else { paint.setColor(Color.RED); paint.setTextSize(80); canvas.drawText(num+"",zmkuan/2-10,80,paint); canvas.drawCircle(qiuX, qiuY, qiu_size, paint); //绘制上柱子 paint.setColor(Color.rgb(80,80,200)); canvas.drawRect(zhuX,zhuY,zhuX+zhu_kaun,zhuY+zhu_gao,paint); //绘制下柱子 canvas.drawRect(zhuX_2,zhuY_2,zhuX_2+zhu_kaun_2,zhuY_2+zhu_gao_2,paint); } } } } ``` event log报错信息:![图片说明](https://img-ask.csdn.net/upload/201904/16/1555399509_788338.png)

4小时玩转微信小程序——基础入门与微信支付实战

这是一个门针对零基础学员学习微信小程序开发的视频教学课程。课程采用腾讯官方文档作为教程的唯一技术资料来源。杜绝网络上质量良莠不齐的资料给学员学习带来的障碍。 视频课程按照开发工具的下载、安装、使用、程序结构、视图层、逻辑层、微信小程序等几个部分组织课程,详细讲解整个小程序的开发过程

Python可以这样学(第四季:数据分析与科学计算可视化)

董付国老师系列教材《Python程序设计(第2版)》(ISBN:9787302436515)、《Python可以这样学》(ISBN:9787302456469)配套视频,在教材基础上又增加了大量内容,通过实例讲解numpy、scipy、pandas、statistics、matplotlib等标准库和扩展库用法。

组成原理课程设计(实现机器数的真值还原等功能)

实现机器数的真值还原(定点小数)、定点小数的单符号位补码加减运算、定点小数的补码乘法运算和浮点数的加减运算。

javaWeb图书馆管理系统源码mysql版本

系统介绍 图书馆管理系统主要的目的是实现图书馆的信息化管理。图书馆的主要业务就是新书的借阅和归还,因此系统最核心的功能便是实现图书的借阅和归还。此外,还需要提供图书的信息查询、读者图书借阅情况的查询等

土豆浏览器

土豆浏览器可以用来看各种搞笑、电影、电视剧视频

Java面试题大全(2020版)

发现网上很多Java面试题都没有答案,所以花了很长时间搜集整理出来了这套Java面试题大全,希望对大家有帮助哈~ 本套Java面试题大全,全的不能再全,哈哈~ 一、Java 基础 1. JDK 和 JRE 有什么区别? JDK:Java Development Kit 的简称,java 开发工具包,提供了 java 的开发环境和运行环境。 JRE:Java Runtime Environ...

Java8零基础入门视频教程

这门课程基于主流的java8平台,由浅入深的详细讲解了java SE的开发技术,可以使java方向的入门学员,快速扎实的掌握java开发技术!

Java基础知识面试题(2020最新版)

文章目录Java概述何为编程什么是Javajdk1.5之后的三大版本JVM、JRE和JDK的关系什么是跨平台性?原理是什么Java语言有哪些特点什么是字节码?采用字节码的最大好处是什么什么是Java程序的主类?应用程序和小程序的主类有何不同?Java应用程序与小程序之间有那些差别?Java和C++的区别Oracle JDK 和 OpenJDK 的对比基础语法数据类型Java有哪些数据类型switc...

TTP229触摸代码以及触摸返回值处理

自己总结的ttp229触摸代码,触摸代码以及触摸按键处理

网络工程师小白入门--【思科CCNA、华为HCNA等网络工程师认证】

本课程适合CCNA或HCNA网络小白同志,高手请绕道,可以直接学习进价课程。通过本预科课程的学习,为学习网络工程师、思科CCNA、华为HCNA这些认证打下坚实的基础! 重要!思科认证2020年2月24日起,已启用新版认证和考试,包括题库都会更新,由于疫情原因,请关注官网和本地考点信息。题库网络上很容易下载到。

深度学习原理+项目实战+算法详解+主流框架(套餐)

深度学习系列课程从深度学习基础知识点开始讲解一步步进入神经网络的世界再到卷积和递归神经网络,详解各大经典网络架构。实战部分选择当下最火爆深度学习框架PyTorch与Tensorflow/Keras,全程实战演示框架核心使用与建模方法。项目实战部分选择计算机视觉与自然语言处理领域经典项目,从零开始详解算法原理,debug模式逐行代码解读。适合准备就业和转行的同学们加入学习! 建议按照下列课程顺序来进行学习 (1)掌握深度学习必备经典网络架构 (2)深度框架实战方法 (3)计算机视觉与自然语言处理项目实战。(按照课程排列顺序即可)

java jdk 8 帮助文档 中文 文档 chm 谷歌翻译

JDK1.8 API 中文谷歌翻译版 java帮助文档 JDK API java 帮助文档 谷歌翻译 JDK1.8 API 中文 谷歌翻译版 java帮助文档 Java最新帮助文档 本帮助文档是使用谷

Ubuntu18.04安装教程

Ubuntu18.04.1安装一、准备工作1.下载Ubuntu18.04.1 LTS2.制作U盘启动盘3.准备 Ubuntu18.04.1 的硬盘空间二、安装Ubuntu18.04.1三、安装后的一些工作1.安装输入法2.更换软件源四、双系统如何卸载Ubuntu18.04.1新的改变功能快捷键合理的创建标题,有助于目录的生成如何改变文本的样式插入链接与图片如何插入一段漂亮的代码片生成一个适合你的列...

快速排序---(面试碰到过好几次)

原理:    快速排序,说白了就是给基准数据找其正确索引位置的过程.    如下图所示,假设最开始的基准数据为数组第一个元素23,则首先用一个临时变量去存储基准数据,即tmp=23;然后分别从数组的两端扫描数组,设两个指示标志:low指向起始位置,high指向末尾.    首先从后半部分开始,如果扫描到的值大于基准数据就让high减1,如果发现有元素比该基准数据的值小(如上图中18&amp;lt...

手把手实现Java图书管理系统(附源码)

【超实用课程内容】 本课程演示的是一套基于Java的SSM框架实现的图书管理系统,主要针对计算机相关专业的正在做毕设的学生与需要项目实战练习的java人群。详细介绍了图书管理系统的实现,包括:环境搭建、系统业务、技术实现、项目运行、功能演示、系统扩展等,以通俗易懂的方式,手把手的带你从零开始运行本套图书管理系统,该项目附带全部源码可作为毕设使用。 【课程如何观看?】 PC端:https://edu.csdn.net/course/detail/27513 移动端:CSDN 学院APP(注意不是CSDN APP哦) 本课程为录播课,课程2年有效观看时长,大家可以抓紧时间学习后一起讨论哦~ 【学员专享增值服务】 源码开放 课件、课程案例代码完全开放给你,你可以根据所学知识,自行修改、优化 下载方式:电脑登录https://edu.csdn.net/course/detail/27513,点击右下方课程资料、代码、课件等打包下载

HTML期末大作业

这是我自己做的HTML期末大作业,花了很多时间,稍加修改就可以作为自己的作业了,而且也可以作为学习参考

Python数据挖掘简易入门

&nbsp; &nbsp; &nbsp; &nbsp; 本课程为Python数据挖掘方向的入门课程,课程主要以真实数据为基础,详细介绍数据挖掘入门的流程和使用Python实现pandas与numpy在数据挖掘方向的运用,并深入学习如何运用scikit-learn调用常用的数据挖掘算法解决数据挖掘问题,为进一步深入学习数据挖掘打下扎实的基础。

极简JAVA学习营第四期(报名以后加助教微信:eduxy-1)

想学好JAVA必须要报两万的培训班吗? Java大神勿入 如果你: 零基础想学JAVA却不知道从何入手 看了一堆书和视频却还是连JAVA的环境都搭建不起来 囊中羞涩面对两万起的JAVA培训班不忍直视 在职没有每天大块的时间专门学习JAVA 那么恭喜你找到组织了,在这里有: 1. 一群志同道合立志学好JAVA的同学一起学习讨论JAVA 2. 灵活机动的学习时间完成特定学习任务+每日编程实战练习 3. 热心助人的助教和讲师及时帮你解决问题,不按时完成作业小心助教老师的家访哦 上一张图看看前辈的感悟: &nbsp; &nbsp; 大家一定迫不及待想知道什么是极简JAVA学习营了吧,下面就来给大家说道说道: 什么是极简JAVA学习营? 1. 针对Java小白或者初级Java学习者; 2. 利用9天时间,每天1个小时时间; 3.通过 每日作业 / 组队PK / 助教答疑 / 实战编程 / 项目答辩 / 社群讨论 / 趣味知识抢答等方式让学员爱上学习编程 , 最终实现能独立开发一个基于控制台的‘库存管理系统’ 的学习模式 极简JAVA学习营是怎么学习的? &nbsp; 如何报名? 只要购买了极简JAVA一:JAVA入门就算报名成功! &nbsp;本期为第四期极简JAVA学习营,我们来看看往期学员的学习状态: 作业看这里~ &nbsp; 助教的作业报告是不是很专业 不交作业打屁屁 助教答疑是不是很用心 &nbsp; 有奖抢答大家玩的很嗨啊 &nbsp; &nbsp; 项目答辩终于开始啦 &nbsp; 优秀者的获奖感言 &nbsp; 这是答辩项目的效果 &nbsp; &nbsp; 这么细致的服务,这么好的氛围,这样的学习效果,需要多少钱呢? 不要1999,不要199,不要99,只要9.9 是的你没听错,只要9.9以上所有就都属于你了 如果你: 1、&nbsp;想学JAVA没有基础 2、&nbsp;想学JAVA没有整块的时间 3、&nbsp;想学JAVA没有足够的预算 还等什么?赶紧报名吧,抓紧抢位,本期只招300人,错过只有等时间待定的下一期了 &nbsp; 报名请加小助手微信:eduxy-1 &nbsp; &nbsp;

C++语言基础视频教程

C++语言基础视频培训课程:本课与主讲者在大学开出的程序设计课程直接对接,准确把握知识点,注重教学视频与实践体系的结合,帮助初学者有效学习。本教程详细介绍C++语言中的封装、数据隐藏、继承、多态的实现等入门知识;主要包括类的声明、对象定义、构造函数和析构函数、运算符重载、继承和派生、多态性实现等。 课程需要有C语言程序设计的基础(可以利用本人开出的《C语言与程序设计》系列课学习)。学习者能够通过实践的方式,学会利用C++语言解决问题,具备进一步学习利用C++开发应用程序的基础。

UnityLicence

UnityLicence

软件测试2小时入门

本课程内容系统、全面、简洁、通俗易懂,通过2个多小时的介绍,让大家对软件测试有个系统的理解和认识,具备基本的软件测试理论基础。 主要内容分为5个部分: 1 软件测试概述,了解测试是什么、测试的对象、原则、流程、方法、模型;&nbsp; 2.常用的黑盒测试用例设计方法及示例演示;&nbsp; 3 常用白盒测试用例设计方法及示例演示;&nbsp; 4.自动化测试优缺点、使用范围及示例‘;&nbsp; 5.测试经验谈。

YOLOv3目标检测实战:训练自己的数据集

YOLOv3是一种基于深度学习的端到端实时目标检测方法,以速度快见长。本课程将手把手地教大家使用labelImg标注和使用YOLOv3训练自己的数据集。课程分为三个小项目:足球目标检测(单目标检测)、梅西目标检测(单目标检测)、足球和梅西同时目标检测(两目标检测)。 本课程的YOLOv3使用Darknet,在Ubuntu系统上做项目演示。包括:安装Darknet、给自己的数据集打标签、整理自己的数据集、修改配置文件、训练自己的数据集、测试训练出的网络模型、性能统计(mAP计算和画出PR曲线)和先验框聚类。 Darknet是使用C语言实现的轻型开源深度学习框架,依赖少,可移植性好,值得深入探究。 除本课程《YOLOv3目标检测实战:训练自己的数据集》外,本人推出了有关YOLOv3目标检测的系列课程,请持续关注该系列的其它课程视频,包括: 《YOLOv3目标检测实战:交通标志识别》 《YOLOv3目标检测:原理与源码解析》 《YOLOv3目标检测:网络模型改进方法》 敬请关注并选择学习!

Python数据分析师-实战系列

系列课程主要包括Python数据分析必备工具包,数据分析案例实战,核心算法实战与企业级数据分析与建模解决方案实战,建议大家按照系列课程阶段顺序进行学习。所有数据集均为企业收集的真实数据集,整体风格以实战为导向,通俗讲解Python数据分析核心技巧与实战解决方案。

YOLOv3目标检测实战系列课程

《YOLOv3目标检测实战系列课程》旨在帮助大家掌握YOLOv3目标检测的训练、原理、源码与网络模型改进方法。 本课程的YOLOv3使用原作darknet(c语言编写),在Ubuntu系统上做项目演示。 本系列课程包括三门课: (1)《YOLOv3目标检测实战:训练自己的数据集》 包括:安装darknet、给自己的数据集打标签、整理自己的数据集、修改配置文件、训练自己的数据集、测试训练出的网络模型、性能统计(mAP计算和画出PR曲线)和先验框聚类。 (2)《YOLOv3目标检测:原理与源码解析》讲解YOLOv1、YOLOv2、YOLOv3的原理、程序流程并解析各层的源码。 (3)《YOLOv3目标检测:网络模型改进方法》讲解YOLOv3的改进方法,包括改进1:不显示指定类别目标的方法 (增加功能) ;改进2:合并BN层到卷积层 (加快推理速度) ; 改进3:使用GIoU指标和损失函数 (提高检测精度) ;改进4:tiny YOLOv3 (简化网络模型)并介绍 AlexeyAB/darknet项目。

超详细MySQL安装及基本使用教程

一、下载MySQL 首先,去数据库的官网http://www.mysql.com下载MySQL。 点击进入后的首页如下:  然后点击downloads,community,选择MySQL Community Server。如下图:  滑到下面,找到Recommended Download,然后点击go to download page。如下图:  点击download进入下载页面选择No...

一学即懂的计算机视觉(第一季)

图像处理和计算机视觉的课程大家已经看过很多,但总有“听不透”,“用不了”的感觉。课程致力于创建人人都能听的懂的计算机视觉,通过生动、细腻的讲解配合实战演练,让学生真正学懂、用会。 【超实用课程内容】 课程内容分为三篇,包括视觉系统构成,图像处理基础,特征提取与描述,运动跟踪,位姿估计,三维重构等内容。课程理论与实战结合,注重教学内容的可视化和工程实践,为人工智能视觉研发及算法工程师等相关高薪职位就业打下坚实基础。 【课程如何观看?】 PC端:https://edu.csdn.net/course/detail/26281 移动端:CSDN 学院APP(注意不是CSDN APP哦) 本课程为录播课,课程2年有效观看时长,但是大家可以抓紧时间学习后一起讨论哦~ 【学员专享增值服务】 源码开放 课件、课程案例代码完全开放给你,你可以根据所学知识,自行修改、优化 下载方式:电脑登录https://edu.csdn.net/course/detail/26281,点击右下方课程资料、代码、课件等打包下载

董付国老师Python全栈学习优惠套餐

购买套餐的朋友可以关注微信公众号“Python小屋”,上传付款截图,然后领取董老师任意图书1本。

爬取妹子图片(简单入门)

安装第三方请求库 requests 被网站禁止了访问 原因是我们是Python过来的 重新给一段 可能还是存在用不了,使用网页的 编写代码 上面注意看匹配内容 User-Agent:请求对象 AppleWebKit:请求内核 Chrome浏览器 //请求网页 import requests import re //正则表达式 就是去不规则的网页里面提取有规律的信息 headers = { 'User-Agent':'存放浏览器里面的' } response = requests.get

web网页制作期末大作业

分享思维,改变世界. web网页制作,期末大作业. 所用技术:html css javascript 分享所学所得

技术大佬:我去,你写的 switch 语句也太老土了吧

昨天早上通过远程的方式 review 了两名新来同事的代码,大部分代码都写得很漂亮,严谨的同时注释也很到位,这令我非常满意。但当我看到他们当中有一个人写的 switch 语句时,还是忍不住破口大骂:“我擦,小王,你丫写的 switch 语句也太老土了吧!” 来看看小王写的代码吧,看完不要骂我装逼啊。 private static String createPlayer(PlayerTypes p...

相关热词 c# 开发接口 c# 中方法上面的限制 c# java 时间戳 c#单元测试入门 c# 数组转化成文本 c#实体类主外键关系设置 c# 子函数 局部 c#窗口位置设置 c# list 查询 c# 事件 执行顺序
立即提问
相关内容推荐