python3.6安装pypsa包时报错,无法安装。

在使用pip install pypsa,安装报错如下图片说明图片说明

ERROR: Command errored out with exit status 1:
command: 'd:\python3\python.exe' 'd:\python3\lib\site-packages\pip_vendor\pep517_in_process.py' get_requires_for_build_wheel 'C:\Users\xyrrrr\AppData\Local\Temp\tmpk8s4cp1x'
cwd: C:\Users\xyrrrr\AppData\Local\Temp\pip-install-y9r5hyt9\cartopy
Complete output (3 lines):
setup.py:171: UserWarning: Unable to determine GEOS version. Ensure you have 3.3.3 or later installed, or installation may fail.
'.'.join(str(v) for v in GEOS_MIN_VERSION), ))
Proj 4.9.0 must be installed.


ERROR: Command errored out with exit status 1: 'd:\python3\python.exe' 'd:\python3\lib\site-packages\pip_vendor\pep517_in_process.py' get_requires_for_build_wheel 'C:\Users\xyrrrr\AppData\Local\Temp\tmpk8s4cp1x' Check the logs for full command output.

查了很多,真的不懂如何解决,小白求专业人士帮助!谢谢。
一天也没解决,我就是一个刚下载python的小白 饶了我吧

1个回答

pythonv版本不兼容,很常见的问题

xxxxxxxxyrrrrrr
xxxxxxxxyrrrrrr 是pip版本太低?谁和谁不兼容呢?╥﹏╥
3 个月之前 回复
xxxxxxxxyrrrrrr
xxxxxxxxyrrrrrr 请问应该怎么解决呢?刚刚学python,实在不懂。
3 个月之前 回复
Csdn user default icon
上传中...
上传图片
插入图片
抄袭、复制答案,以达到刷声望分或其他目的的行为,在CSDN问答是严格禁止的,一经发现立刻封号。是时候展现真正的技术了!
其他相关推荐
python3.7安装email库出现报错
下面是全部报错信息 ``` Collecting email Downloading https://files.pythonhosted.org/packages/71/e7/816030d3b0426c130040bd068be62b9213357ed02896f5d9badcf46d1b5f/email-4.0.2.tar.gz (1.2MB) |████████████████████████████████| 1.2MB 11kB/s ERROR: Complete output from command python setup.py egg_info: ERROR: Traceback (most recent call last): File "<string>", line 1, in <module> File "d:\软件\python3.7.3\lib\site-packages\setuptools\__init__.py", line 18, in <module> import setuptools.version File "d:\软件\python3.7.3\lib\site-packages\setuptools\version.py", line 1, in <module> import pkg_resources File "d:\软件\python3.7.3\lib\site-packages\pkg_resources\__init__.py", line 36, in <module> import email.parser File "C:\Users\wenrui\AppData\Local\Temp\pip-install-zuekqdy0\email\email\parser.py", line 10, in <module> from cStringIO import StringIO ModuleNotFoundError: No module named 'cStringIO' ---------------------------------------- ERROR: Command "python setup.py egg_info" failed with error code 1 in C:\Users\wenrui\AppData\Local\Temp\pip-install-zuekqdy0\email\ ```
ubuntu18.04 python3.6 pip安装mysqlclient报错
ubuntu18.04 python3.6 pip安装mysqlclient报错 求大佬解答 ``` Building wheels for collected packages: mysqlclient Running setup.py bdist_wheel for mysqlclient ... error Complete output from command /usr/bin/python3 -u -c "import setuptools, tokenize;__file__='/tmp/pip-build-njxuuzpo/mysqlclient/setup.py';f=getattr(tokenize, 'open', open)(__file__);code=f.read().replace('\r\n', '\n');f.close();exec(compile(code, __file__, 'exec'))" bdist_wheel -d /tmp/tmpzs54ny_2pip-wheel- --python-tag cp36: running bdist_wheel running build running build_py creating build creating build/lib.linux-x86_64-3.6 creating build/lib.linux-x86_64-3.6/MySQLdb copying MySQLdb/__init__.py -> build/lib.linux-x86_64-3.6/MySQLdb copying MySQLdb/_exceptions.py -> build/lib.linux-x86_64-3.6/MySQLdb copying MySQLdb/compat.py -> build/lib.linux-x86_64-3.6/MySQLdb copying MySQLdb/connections.py -> build/lib.linux-x86_64-3.6/MySQLdb copying MySQLdb/converters.py -> build/lib.linux-x86_64-3.6/MySQLdb copying MySQLdb/cursors.py -> build/lib.linux-x86_64-3.6/MySQLdb copying MySQLdb/release.py -> build/lib.linux-x86_64-3.6/MySQLdb copying MySQLdb/times.py -> build/lib.linux-x86_64-3.6/MySQLdb creating build/lib.linux-x86_64-3.6/MySQLdb/constants copying MySQLdb/constants/__init__.py -> build/lib.linux-x86_64-3.6/MySQLdb/constants copying MySQLdb/constants/CLIENT.py -> build/lib.linux-x86_64-3.6/MySQLdb/constants copying MySQLdb/constants/CR.py -> build/lib.linux-x86_64-3.6/MySQLdb/constants copying MySQLdb/constants/ER.py -> build/lib.linux-x86_64-3.6/MySQLdb/constants copying MySQLdb/constants/FIELD_TYPE.py -> build/lib.linux-x86_64-3.6/MySQLdb/constants copying MySQLdb/constants/FLAG.py -> build/lib.linux-x86_64-3.6/MySQLdb/constants running build_ext building 'MySQLdb._mysql' extension creating build/temp.linux-x86_64-3.6 creating build/temp.linux-x86_64-3.6/MySQLdb x86_64-linux-gnu-gcc -pthread -DNDEBUG -g -fwrapv -O2 -Wall -g -fstack-protector-strong -Wformat -Werror=format-security -Wdate-time -D_FORTIFY_SOURCE=2 -fPIC -Dversion_info=(1,4,5,'final',0) -D__version__=1.4.5 -I/usr/include/mysql -I/usr/include/python3.6m -c MySQLdb/_mysql.c -o build/temp.linux-x86_64-3.6/MySQLdb/_mysql.o x86_64-linux-gnu-gcc -pthread -shared -Wl,-O1 -Wl,-Bsymbolic-functions -Wl,-Bsymbolic-functions -Wl,-z,relro -Wl,-Bsymbolic-functions -Wl,-z,relro -g -fstack-protector-strong -Wformat -Werror=format-security -Wdate-time -D_FORTIFY_SOURCE=2 build/temp.linux-x86_64-3.6/MySQLdb/_mysql.o -lmysqlclient -lpthread -lz -lm -lrt -latomic -lssl -lcrypto -ldl -o build/lib.linux-x86_64-3.6/MySQLdb/_mysql.cpython-36m-x86_64-linux-gnu.so /usr/bin/ld: cannot find -lssl /usr/bin/ld: cannot find -lcrypto collect2: error: ld returned 1 exit status error: command 'x86_64-linux-gnu-gcc' failed with exit status 1 ---------------------------------------- Failed building wheel for mysqlclient Running setup.py clean for mysqlclient Failed to build mysqlclient Installing collected packages: mysqlclient Running setup.py install for mysqlclient ... error Complete output from command /usr/bin/python3 -u -c "import setuptools, tokenize;__file__='/tmp/pip-build-njxuuzpo/mysqlclient/setup.py';f=getattr(tokenize, 'open', open)(__file__);code=f.read().replace('\r\n', '\n');f.close();exec(compile(code, __file__, 'exec'))" install --record /tmp/pip-ldoqhl56-record/install-record.txt --single-version-externally-managed --compile --user --prefix=: running install running build running build_py creating build creating build/lib.linux-x86_64-3.6 creating build/lib.linux-x86_64-3.6/MySQLdb copying MySQLdb/__init__.py -> build/lib.linux-x86_64-3.6/MySQLdb copying MySQLdb/_exceptions.py -> build/lib.linux-x86_64-3.6/MySQLdb copying MySQLdb/compat.py -> build/lib.linux-x86_64-3.6/MySQLdb copying MySQLdb/connections.py -> build/lib.linux-x86_64-3.6/MySQLdb copying MySQLdb/converters.py -> build/lib.linux-x86_64-3.6/MySQLdb copying MySQLdb/cursors.py -> build/lib.linux-x86_64-3.6/MySQLdb copying MySQLdb/release.py -> build/lib.linux-x86_64-3.6/MySQLdb copying MySQLdb/times.py -> build/lib.linux-x86_64-3.6/MySQLdb creating build/lib.linux-x86_64-3.6/MySQLdb/constants copying MySQLdb/constants/__init__.py -> build/lib.linux-x86_64-3.6/MySQLdb/constants copying MySQLdb/constants/CLIENT.py -> build/lib.linux-x86_64-3.6/MySQLdb/constants copying MySQLdb/constants/CR.py -> build/lib.linux-x86_64-3.6/MySQLdb/constants copying MySQLdb/constants/ER.py -> build/lib.linux-x86_64-3.6/MySQLdb/constants copying MySQLdb/constants/FIELD_TYPE.py -> build/lib.linux-x86_64-3.6/MySQLdb/constants copying MySQLdb/constants/FLAG.py -> build/lib.linux-x86_64-3.6/MySQLdb/constants running build_ext building 'MySQLdb._mysql' extension creating build/temp.linux-x86_64-3.6 creating build/temp.linux-x86_64-3.6/MySQLdb x86_64-linux-gnu-gcc -pthread -DNDEBUG -g -fwrapv -O2 -Wall -g -fstack-protector-strong -Wformat -Werror=format-security -Wdate-time -D_FORTIFY_SOURCE=2 -fPIC -Dversion_info=(1,4,5,'final',0) -D__version__=1.4.5 -I/usr/include/mysql -I/usr/include/python3.6m -c MySQLdb/_mysql.c -o build/temp.linux-x86_64-3.6/MySQLdb/_mysql.o x86_64-linux-gnu-gcc -pthread -shared -Wl,-O1 -Wl,-Bsymbolic-functions -Wl,-Bsymbolic-functions -Wl,-z,relro -Wl,-Bsymbolic-functions -Wl,-z,relro -g -fstack-protector-strong -Wformat -Werror=format-security -Wdate-time -D_FORTIFY_SOURCE=2 build/temp.linux-x86_64-3.6/MySQLdb/_mysql.o -lmysqlclient -lpthread -lz -lm -lrt -latomic -lssl -lcrypto -ldl -o build/lib.linux-x86_64-3.6/MySQLdb/_mysql.cpython-36m-x86_64-linux-gnu.so /usr/bin/ld: cannot find -lssl /usr/bin/ld: cannot find -lcrypto collect2: error: ld returned 1 exit status error: command 'x86_64-linux-gnu-gcc' failed with exit status 1 ---------------------------------------- Command "/usr/bin/python3 -u -c "import setuptools, tokenize;__file__='/tmp/pip-build-njxuuzpo/mysqlclient/setup.py';f=getattr(tokenize, 'open', open)(__file__);code=f.read().replace('\r\n', '\n');f.close();exec(compile(code, __file__, 'exec'))" install --record /tmp/pip-ldoqhl56-record/install-record.txt --single-version-externally-managed --compile --user --prefix=" failed with error code 1 in /tmp/pip-build-njxuuzpo/mysqlclient/ ```
关于centos6.8 安装python3.5.2 关于pip的问题
centos内默认有python2.6,后来新安装python3.5.2版本,(不是覆盖安装,原有Python2.6继续保留),问题:新版本的python pip如何安装,还是用原有老版本python2.6 中的pip? 2.pip安装的模块一般路径在哪里,可否改变安装路径,如何处理? 感谢阅读!
centos7.6 安装python3.执行/configure时,gcc异常
安装python时,执行./configure初始编译,报gcc没有工作: 错误信息: ``` checking build system type... x86_64-unknown-linux-gnu checking host system type... x86_64-unknown-linux-gnu checking for python3.6... no checking for python3... no checking for python... python checking for --enable-universalsdk... no checking for --with-universal-archs... no checking MACHDEP... linux checking for --without-gcc... no checking for --with-icc... no checking for gcc... gcc checking whether the C compiler works... no configure: error: in `/opt/Python-3.6.0': configure: error: C compiler cannot create executables ``` config.log信息: ![图片说明](https://img-ask.csdn.net/upload/201909/09/1568015863_225982.png) 去看日志发现ld找不到 执行which ld确实找不到。 ![图片说明](https://img-ask.csdn.net/upload/201909/09/1568015884_257870.png) 去搜索资料,都说安装gcc即可,可是我已经把python所需的依赖全部安装了,c编译器还是没有工作,我想可能是ld问题,我在安装pydoop时也遇到ld问题,很头疼,求解!!!
python3.7.0安装aiodns包出现问题
python3.7.0安装whl包出现问题,提示缺少C++14.0 ![![图片说明](https://img-ask.csdn.net/upload/201807/28/1532745998_112893.png) 图片说明](https://img-ask.csdn.net/upload/201807/28/1532745984_838831.png)
python3.7 安装requests报错,求大神支招?
python3.7 通过pip 安装requests 报错,百度上也查过很多方法 1、通过更改源 2、通过wheel安装 3、pip --timout=60000等方式都不能解决 公司每台电脑上都装了赛门铁克(Symantec),会不会与这个有影响。 求详细解决方式 报错如下: ![图片说明](https://img-ask.csdn.net/upload/201906/10/1560136696_190131.jpg) Retrying (Retry(total=4, connect=None, read=None, redirect=None, status=None)) after connection broken by 'ConnectTimeoutError(<pip._vendor.urllib3.connection.VerifiedHTTPSConnection object at 0x0000000003F7B588>, 'Connection to pypi.org timed out. (connect timeout=15)')': /simple/requests/
Python2.7里的intobject和stringobject在python3.6里去哪了?
最近在看python源码,python2.7里的intobject和stringobject在python3.6里面没找到。
python3.6numpy的whl在cmd安装报错
![图片说明](https://img-ask.csdn.net/upload/201708/04/1501841933_819482.jpg)![图片说明](https://img-ask.csdn.net/upload/201708/04/1501841953_294720.jpg) python3.6.2,windows64位,下载了numpy的whl文件后在cmd安装,但是报错说文件不存在,请问这是什么问题??
安装python3.3.3+pywin32-219.win32-py3.3.exe报错
安装python3.3.3+pywin32-219.win32-py3.3.exe报错,错误如下,麻烦大师指导,谢谢!![图片说明](https://img-ask.csdn.net/upload/201510/26/1445840075_922784.png)
monkeyrunner下跑Python3.6的代码老报错:no module named:com
最近在用Python 进行 Android 的自动化测试,Python 3.0之前可以通过 from com.android.monkeyrunner import MonkeyRunner 导入MonkryRunner方法的,但是在Python 3.6 中使用这种方法失败了,提示如下: Traceback (most recent call last): File "<pyshell#0>", line 1, in <module> from com.android.monkeyrunner import MonkeyRunner ImportError: No module named 'com'
python3.6打包成exe执行报错。
![图片说明](https://img-ask.csdn.net/upload/201709/05/1504604853_397678.png) 如图,pyinstaller已经安装好,但是打包成exe还是报了错误,折腾了半天,请教各位大神,这是什么问题?
python3.5中安装PIL包,显示成功,但是导入的时候报错 ImportError
我是windows64位的系统,在网上找到了支持python3.x的PIL包,在命令行里使用pip命令安装,显示successfully成功,但是编写文件的时候from PIL import Image出现错误,ImportError:DLL load failed: 找不到指定的模块。网上搜了下,好像是动态链接库目录的问题,具体怎么回事我也不清楚,也不知道去哪找.dll文件,哪位大神帮忙解答一下 ,万分感谢! python3.x的64位系统的PIL网址:http://www.lfd.uci.edu/~gohlke/pythonlibs/#pil 对了,我下载的是Pillow-3.0.0-cp35-none-win_amd64.whl这个包
python2.7导入goose包失败
安装goose包时失败,报如下错: File "F:\python2.7.13\lib\site-packages\goose\__init__.py", line 26, in <module> from goose.crawler import CrawlCandidate File "F:\python2.7.13\lib\site-packages\goose\crawler.py", line 28, in <module> from goose.extractors import StandardContentExtractor ImportError: cannot import name StandardContentExtractor 请问要怎么解决?
各位朋友好,请教ubuntu系统python3.4环境下安装matplotlib报错的解决办法
具体的问题是这样的: 我的系统是Ubuntu14.04 的64位系统,python3.4版本下,想使用matplotlib来做图。 由于matplotlib依赖numpy和python的图像库PIL,因此我先安装numpy和PIL然后,再安装matplotlib, 这里附上我的安装matplotlib的shell命令 #安装科学计算库numpy sudo pip3 install numpy #安装图像处理库PIL sudo apt-get install python3.4-dev -y sudo apt-get install libjpeg8-dev zlib1g-dev libfreetype6-dev -y sudo ln -s /usr/lib/x86_64-linux-gnu/libjpeg.so /usr/lib sudo ln -s /usr/lib/x86_64-linux-gnu/libfreetype.so /usr/lib sudo ln -s /usr/lib/x86_64-linux-gnu/libz.so /usr/lib sudo apt-get install python3-pil #安装画图库matplotlib sudo pip3 install matplotlib 但是发现虽然安装成功(在python3的shell交互环境下, import matplotlib 是可以的),但是 执行如下语句 from matplotlib import pyplot as plt 报错: "/usr/local/lib/python3.4/dist-packages/matplotlib-1.5.1-py3.4-linux-x86_64.egg/matplotlib/backends/backend_gtk3.py", line 58, in <module> cursors.MOVE : Gdk.Cursor.new(Gdk.CursorType.FLEUR), TypeError: constructor returned NULL 希望各位朋友能指点一下,十分感谢
python3.7 下载email包,一直报错
C:\Users\111>pip -V pip 19.1.1 from D:\Python37\lib\site-packages\pip-19.1.1-py3.7.egg\pip (python 3.7) C:\Users\111>pip install email Collecting email Using cached https://files.pythonhosted.org/packages/71/e7/816030d3b0426c130040bd068be62b9213357ed02896f5d9badcf46d1b5f/email-4.0.2.tar.gz ERROR: Complete output from command python setup.py egg_info: ERROR: Traceback (most recent call last): File "<string>", line 1, in <module> File "D:\Python37\lib\site-packages\setuptools\__init__.py", line 12, in <module> import setuptools.version File "D:\Python37\lib\site-packages\setuptools\version.py", line 1, in <module> import pkg_resources File "D:\Python37\lib\site-packages\pkg_resources\__init__.py", line 36, in <module> import email.parser File "C:\Users\111\AppData\Local\Temp\pip-install-i6c6xiar\email\email\parser.py", line 10, in <module> from cStringIO import StringIO ModuleNotFoundError: No module named 'cStringIO' ---------------------------------------- ERROR: Command "python setup.py egg_info" failed with error code 1 in C:\Users\111\AppData\Local\Temp\pip-install-i6c6xiar\email\ ``` ```
已经装了python3.6(官网下载的),现在装不了对应3.6版本的pywin32
这是我在cmd输入python得到的python版本的说明 Python 3.6.0 (v3.6.0:41df79263a11, Dec 23 2016, 07:18:10) [MSC v.1900 32 bit (Intel)] on win32 Type "help", "copyright", "credits" or "license" for more information. 然后我去sourceforge.net下载pywin32对应的32位的版本,安装的时候说在registry中没有找到python3.6,是我哪里没有设置么,求帮助~
python 3.7引用docx操作word文档报错exception
python 3.7引用docx操作word文档报错“docx.opc.exceptions.PackageNotFoundError: Package not found at.....”,网上搜的方法都尝试过了,没有用。python__docx-0.8.6-py2.py3-none-any.whl这个包已经没有了,下载了python__docx-0.8.7-py2.py3-none-any.whl。但是仍然报错。求大神帮忙,给个终极解决办法。
python2.6安装报_ssl模块错误
在ubuntu系统中安装Python2.6,执行./configure后,在执行make报fail to build the module _ssl,大神给指点下怎么解决啊?搞了两天了,各种查资料,尝试都没解决
/usr/bin/yum: /usr/bin/python2.6: bad interpreter
redhat7.0更新了yum后报错 -bash: /usr/bin/yum: /usr/bin/python2.6: bad interpreter: No such file [root@localhost bin]# whereis python python: /usr/bin/python2.6 /usr/bin/python /usr/lib/python2.7 /usr/lib/python2.6 /usr/lib64/python2.7 /usr/lib64/python2.6 /usr/include/python2.7 /usr/share/man/man1/python.1.gz #vi yum改成 #!/usr/bin/python2.6 还是不行 执行了sudo ln -s /usr/bin/python2.6 /usr/bin/python
相见恨晚的超实用网站
搞学习 知乎:www.zhihu.com 简答题:http://www.jiandati.com/ 网易公开课:https://open.163.com/ted/ 网易云课堂:https://study.163.com/ 中国大学MOOC:www.icourse163.org 网易云课堂:study.163.com 哔哩哔哩弹幕网:www.bilibili.com 我要自学网:www.51zxw
爬虫福利二 之 妹子图网MM批量下载
爬虫福利一:27报网MM批量下载    点击 看了本文,相信大家对爬虫一定会产生强烈的兴趣,激励自己去学习爬虫,在这里提前祝:大家学有所成! 目标网站:妹子图网 环境:Python3.x 相关第三方模块:requests、beautifulsoup4 Re:各位在测试时只需要将代码里的变量 path 指定为你当前系统要保存的路径,使用 python xxx.py 或IDE运行即可。
字节跳动视频编解码面经
引言 本文主要是记录一下面试字节跳动的经历。 三四月份投了字节跳动的实习(图形图像岗位),然后hr打电话过来问了一下会不会opengl,c++,shador,当时只会一点c++,其他两个都不会,也就直接被拒了。 七月初内推了字节跳动的提前批,因为内推没有具体的岗位,hr又打电话问要不要考虑一下图形图像岗,我说实习投过这个岗位不合适,不会opengl和shador,然后hr就说秋招更看重基础。我当时
开源一个功能完整的SpringBoot项目框架
福利来了,给大家带来一个福利。 最近想了解一下有关Spring Boot的开源项目,看了很多开源的框架,大多是一些demo或者是一个未成形的项目,基本功能都不完整,尤其是用户权限和菜单方面几乎没有完整的。 想到我之前做的框架,里面通用模块有:用户模块,权限模块,菜单模块,功能模块也齐全了,每一个功能都是完整的。 打算把这个框架分享出来,供大家使用和学习。 为什么用框架? 框架可以学习整体
源码阅读(19):Java中主要的Map结构——HashMap容器(下1)
(接上文《源码阅读(18):Java中主要的Map结构——HashMap容器(中)》) 3.4.4、HashMap添加K-V键值对(红黑树方式) 上文我们介绍了在HashMap中table数组的某个索引位上,基于单向链表添加新的K-V键值对对象(HashMap.Node&lt;K, V&gt;类的实例),但是我们同时知道在某些的场景下,HashMap中table数据的某个索引位上,数据是按照红黑树
c++制作的植物大战僵尸,开源,一代二代结合游戏
    此游戏全部由本人自己制作完成。游戏大部分的素材来源于原版游戏素材,少部分搜集于网络,以及自己制作。 此游戏为同人游戏而且仅供学习交流使用,任何人未经授权,不得对本游戏进行更改、盗用等,否则后果自负。 目前有六种僵尸和六种植物,植物和僵尸的动画都是本人做的。qq:2117610943 开源代码下载 提取码:3vzm 点击下载--&gt; 11月28日 新增四种植物 统一植物画风,全部修
Java学习的正确打开方式
在博主认为,对于入门级学习java的最佳学习方法莫过于视频+博客+书籍+总结,前三者博主将淋漓尽致地挥毫于这篇博客文章中,至于总结在于个人,实际上越到后面你会发现学习的最好方式就是阅读参考官方文档其次就是国内的书籍,博客次之,这又是一个层次了,这里暂时不提后面再谈。博主将为各位入门java保驾护航,各位只管冲鸭!!!上天是公平的,只要不辜负时间,时间自然不会辜负你。 何谓学习?博主所理解的学习,它
程序员必须掌握的核心算法有哪些?
由于我之前一直强调数据结构以及算法学习的重要性,所以就有一些读者经常问我,数据结构与算法应该要学习到哪个程度呢?,说实话,这个问题我不知道要怎么回答你,主要取决于你想学习到哪些程度,不过针对这个问题,我稍微总结一下我学过的算法知识点,以及我觉得值得学习的算法。这些算法与数据结构的学习大多数是零散的,并没有一本把他们全部覆盖的书籍。下面是我觉得值得学习的一些算法以及数据结构,当然,我也会整理一些看过
Python——画一棵漂亮的樱花树(不同种樱花+玫瑰+圣诞树喔)
最近翻到一篇知乎,上面有不少用Python(大多是turtle库)绘制的树图,感觉很漂亮,我整理了一下,挑了一些我觉得不错的代码分享给大家(这些我都测试过,确实可以生成喔~) one 樱花树 动态生成樱花 效果图(这个是动态的): 实现代码 import turtle as T import random import time # 画樱花的躯干(60,t) def Tree(branch
linux系列之常用运维命令整理笔录
本博客记录工作中需要的linux运维命令,大学时候开始接触linux,会一些基本操作,可是都没有整理起来,加上是做开发,不做运维,有些命令忘记了,所以现在整理成博客,当然vi,文件操作等就不介绍了,慢慢积累一些其它拓展的命令,博客不定时更新 顺便拉下票,我在参加csdn博客之星竞选,欢迎投票支持,每个QQ或者微信每天都可以投5票,扫二维码即可,http://m234140.nofollow.ax.
Python 基础(一):入门必备知识
目录1 标识符2 关键字3 引号4 编码5 输入输出6 缩进7 多行8 注释9 数据类型10 运算符10.1 常用运算符10.2 运算符优先级 1 标识符 标识符是编程时使用的名字,用于给变量、函数、语句块等命名,Python 中标识符由字母、数字、下划线组成,不能以数字开头,区分大小写。 以下划线开头的标识符有特殊含义,单下划线开头的标识符,如:_xxx ,表示不能直接访问的类属性,需通过类提供
深度学习图像算法在内容安全领域的应用
互联网给人们生活带来便利的同时也隐含了大量不良信息,防范互联网平台有害内容传播引起了多方面的高度关注。本次演讲从技术层面分享网易易盾在内容安全领域的算法实践经验,包括深度学习图
程序员接私活怎样防止做完了不给钱?
首先跟大家说明一点,我们做 IT 类的外包开发,是非标品开发,所以很有可能在开发过程中会有这样那样的需求修改,而这种需求修改很容易造成扯皮,进而影响到费用支付,甚至出现做完了项目收不到钱的情况。 那么,怎么保证自己的薪酬安全呢? 我们在开工前,一定要做好一些证据方面的准备(也就是“讨薪”的理论依据),这其中最重要的就是需求文档和验收标准。一定要让需求方提供这两个文档资料作为开发的基础。之后开发
网页实现一个简单的音乐播放器(大佬别看。(⊙﹏⊙))
今天闲着无事,就想写点东西。然后听了下歌,就打算写个播放器。 于是乎用h5 audio的加上js简单的播放器完工了。 欢迎 改进 留言。 演示地点跳到演示地点 html代码如下`&lt;!DOCTYPE html&gt; &lt;html&gt; &lt;head&gt; &lt;title&gt;music&lt;/title&gt; &lt;meta charset="utf-8"&gt
Python十大装B语法
Python 是一种代表简单思想的语言,其语法相对简单,很容易上手。不过,如果就此小视 Python 语法的精妙和深邃,那就大错特错了。本文精心筛选了最能展现 Python 语法之精妙的十个知识点,并附上详细的实例代码。如能在实战中融会贯通、灵活使用,必将使代码更为精炼、高效,同时也会极大提升代码B格,使之看上去更老练,读起来更优雅。 1. for - else 什么?不是 if 和 else 才
数据库优化 - SQL优化
前面一篇文章从实例的角度进行数据库优化,通过配置一些参数让数据库性能达到最优。但是一些“不好”的SQL也会导致数据库查询变慢,影响业务流程。本文从SQL角度进行数据库优化,提升SQL运行效率。 判断问题SQL 判断SQL是否有问题时可以通过两个表象进行判断: 系统级别表象 CPU消耗严重 IO等待严重 页面响应时间过长
2019年11月中国大陆编程语言排行榜
2019年11月2日,我统计了某招聘网站,获得有效程序员招聘数据9万条。针对招聘信息,提取编程语言关键字,并统计如下: 编程语言比例 rank pl_ percentage 1 java 33.62% 2 c/c++ 16.42% 3 c_sharp 12.82% 4 javascript 12.31% 5 python 7.93% 6 go 7.25% 7
通俗易懂地给女朋友讲:线程池的内部原理
餐厅的约会 餐盘在灯光的照耀下格外晶莹洁白,女朋友拿起红酒杯轻轻地抿了一小口,对我说:“经常听你说线程池,到底线程池到底是个什么原理?”我楞了一下,心里想女朋友今天是怎么了,怎么突然问出这么专业的问题,但做为一个专业人士在女朋友面前也不能露怯啊,想了一下便说:“我先给你讲讲我前同事老王的故事吧!” 大龄程序员老王 老王是一个已经北漂十多年的程序员,岁数大了,加班加不动了,升迁也无望,于是拿着手里
经典算法(5)杨辉三角
杨辉三角 是经典算法,这篇博客对它的算法思想进行了讲解,并有完整的代码实现。
腾讯算法面试题:64匹马8个跑道需要多少轮才能选出最快的四匹?
昨天,有网友私信我,说去阿里面试,彻底的被打击到了。问了为什么网上大量使用ThreadLocal的源码都会加上private static?他被难住了,因为他从来都没有考虑过这个问题。无独有偶,今天笔者又发现有网友吐槽了一道腾讯的面试题,我们一起来看看。 腾讯算法面试题:64匹马8个跑道需要多少轮才能选出最快的四匹? 在互联网职场论坛,一名程序员发帖求助到。二面腾讯,其中一个算法题:64匹
面试官:你连RESTful都不知道我怎么敢要你?
面试官:了解RESTful吗? 我:听说过。 面试官:那什么是RESTful? 我:就是用起来很规范,挺好的 面试官:是RESTful挺好的,还是自我感觉挺好的 我:都挺好的。 面试官:… 把门关上。 我:… 要干嘛?先关上再说。 面试官:我说出去把门关上。 我:what ?,夺门而去 文章目录01 前言02 RESTful的来源03 RESTful6大原则1. C-S架构2. 无状态3.统一的接
为啥国人偏爱Mybatis,而老外喜欢Hibernate/JPA呢?
关于SQL和ORM的争论,永远都不会终止,我也一直在思考这个问题。昨天又跟群里的小伙伴进行了一番讨论,感触还是有一些,于是就有了今天这篇文。 声明:本文不会下关于Mybatis和JPA两个持久层框架哪个更好这样的结论。只是摆事实,讲道理,所以,请各位看官勿喷。 一、事件起因 关于Mybatis和JPA孰优孰劣的问题,争论已经很多年了。一直也没有结论,毕竟每个人的喜好和习惯是大不相同的。我也看
项目中的if else太多了,该怎么重构?
介绍 最近跟着公司的大佬开发了一款IM系统,类似QQ和微信哈,就是聊天软件。我们有一部分业务逻辑是这样的 if (msgType = "文本") { // dosomething } else if(msgType = "图片") { // doshomething } else if(msgType = "视频") { // doshomething } else { // doshom...
致 Python 初学者
欢迎来到“Python进阶”专栏!来到这里的每一位同学,应该大致上学习了很多 Python 的基础知识,正在努力成长的过程中。在此期间,一定遇到了很多的困惑,对未来的学习方向感到迷茫。我非常理解你们所面临的处境。我从2007年开始接触 python 这门编程语言,从2009年开始单一使用 python 应对所有的开发工作,直至今天。回顾自己的学习过程,也曾经遇到过无数的困难,也曾经迷茫过、困惑过。开办这个专栏,正是为了帮助像我当年一样困惑的 Python 初学者走出困境、快速成长。希望我的经验能真正帮到你
Python 编程实用技巧
Python是一门很灵活的语言,也有很多实用的方法,有时候实现一个功能可以用多种方法实现,我这里总结了一些常用的方法,并会持续更新。
“狗屁不通文章生成器”登顶GitHub热榜,分分钟写出万字形式主义大作
一、垃圾文字生成器介绍 最近在浏览GitHub的时候,发现了这样一个骨骼清奇的雷人项目,而且热度还特别高。 项目中文名:狗屁不通文章生成器 项目英文名:BullshitGenerator 根据作者的介绍,他是偶尔需要一些中文文字用于GUI开发时测试文本渲染,因此开发了这个废话生成器。但由于生成的废话实在是太过富于哲理,所以最近已经被小伙伴们给玩坏了。 他的文风可能是这样的: 你发现,...
程序员:我终于知道post和get的区别
是一个老生常谈的话题,然而随着不断的学习,对于以前的认识有很多误区,所以还是需要不断地总结的,学而时习之,不亦说乎
"狗屁不通文章生成器"登顶GitHub热榜,分分钟写出万字形式主义大作
GitHub 被誉为全球最大的同性交友网站,……,陪伴我们已经走过 10+ 年时间,它托管了大量的软件代码,同时也承载了程序员无尽的欢乐。 万字申请,废话报告,魔幻形式主义大作怎么写?兄dei,狗屁不通文章生成器了解一下。这个富有灵魂的项目名吸引了众人的目光。项目仅仅诞生一周,便冲上了GitHub趋势榜榜首(Js中文网 -前端进阶资源教程)、是榜首哦
推荐几款比较实用的工具,网站
1.盘百度PanDownload 这个云盘工具是免费的,可以进行资源搜索,提速(偶尔会抽风????) 不要去某站买付费的???? PanDownload下载地址 2.BeJSON 这是一款拥有各种在线工具的网站,推荐它的主要原因是网站简洁,功能齐全,广告相比其他广告好太多了 bejson网站 3.二维码美化 这个网站的二维码美化很好看,网站界面也很...
《程序人生》系列-这个程序员只用了20行代码就拿了冠军
你知道的越多,你不知道的越多 点赞再看,养成习惯GitHub上已经开源https://github.com/JavaFamily,有一线大厂面试点脑图,欢迎Star和完善 前言 这一期不算《吊打面试官》系列的,所有没前言我直接开始。 絮叨 本来应该是没有这期的,看过我上期的小伙伴应该是知道的嘛,双十一比较忙嘛,要值班又要去帮忙拍摄年会的视频素材,还得搞个程序员一天的Vlog,还要写BU...
相关热词 c# plc s1200 c#里氏转换原则 c# 主界面 c# do loop c#存为组套 模板 c# 停掉协程 c# rgb 读取图片 c# 图片颜色调整 最快 c#多张图片上传 c#密封类与密封方法
立即提问