Error:(16, 32) 错误: 不兼容的类型: View无法转换为TextView,这是怎么回事?

package com.example.lm.myapplication;

import android.support.v7.app.ActionBarActivity;
import android.os.Bundle;
import android.util.Log;
import android.widget.TextView;

public class MainActivity extends ActionBarActivity {
//String TAG ="myTag";
TextView textView;

@Override
protected void onCreate(Bundle savedInstanceState) {
    super.onCreate(savedInstanceState);
    setContentView(R.layout.activity_main);
    textView = findViewById(R.id.textView);
    //Log.d(TAG, "执行了onCreate()方法");

}

@Override
protected void onStart() {
    super.onStart();
    //Log.d(TAG, "执行了onStart()方法");
}

@Override
protected void onResume() {
    super.onResume();
    //Log.d(TAG, "执行了onResume()方法");
}

@Override
protected void onPause() {
    super.onPause();
    //Log.d(TAG, "执行了onPause()方法");
    textView.setText("pause");
}

@Override
protected void onStop() {
    super.onStop();
    //Log.d(TAG, "执行了onStop()方法");

}

@Override
protected void onRestart() {
    super.onRestart();
    //Log.d(TAG, "执行了onRestart()方法");
}

@Override
protected void onDestroy() {
    super.onDestroy();
    //Log.d(TAG, "执行了onDestroy()方法");
}

}


Csdn user default icon
上传中...
上传图片
插入图片
抄袭、复制答案,以达到刷声望分或其他目的的行为,在CSDN问答是严格禁止的,一经发现立刻封号。是时候展现真正的技术了!
其他相关推荐
Error:(16, 47) 错误: 不兼容的类型: View无法转换为Button
小白求助0.0 Error:(10, 36) 错误: 找不到符号 符号: 类 OnClickListener 位置: 类 Button Error:(16, 47) 错误: 不兼容的类型: View无法转换为Button Error:Execution failed for task ':app:compileDebugJavaWithJavac'. > Compilation failed; see the compiler error output for details. 以下是Android studio编写的activity ``` package com.example.activitytest; import android.support.v7.app.AppCompatActivity; import android.os.Bundle; import android.view.View; import android.widget.Toast; import static com.example.activitytest.R.*; public class FirstActivity extends AppCompatActivity { @Override protected void onCreate(Bundle savedInstanceState) { super.onCreate(savedInstanceState); setContentView(layout.first_layout); Button button1 = (Button) findViewById(R.id.button_1); button1.setOnClickListener(new View.OnClickListener() { @Override public void onClick(View v) { Toast.makeText(FirstActivity.this, "You clicked Button 1", Toast.LENGTH_SHORT).show(); } }); } } ```
Error:warning: Ignoring InnerClasses
Information:Gradle tasks [:app:clean, :app:generateDebugSources, :app:mockableAndroidJar, :app:prepareDebugUnitTestDependencies, :app:generateDebugAndroidTestSources, :app:assembleDebug] Error:warning: Ignoring InnerClasses attribute for an anonymous inner class Error:(com.tencent.mm.opensdk.diffdev.a.b) that doesn't come with an Error:associated EnclosingMethod attribute. This class was probably produced by a Error:compiler that did not target the modern .class file format. The recommended Error:solution is to recompile the class from source, using an up-to-date compiler Error:and without specifying any "-target" type options. The consequence of ignoring Error:this warning is that reflective operations on this class will incorrectly Error:indicate that it is *not* an inner class. Error:warning: Ignoring InnerClasses attribute for an anonymous inner class Error:(com.tencent.mm.opensdk.diffdev.a.c) that doesn't come with an Error:associated EnclosingMethod attribute. This class was probably produced by a Error:compiler that did not target the modern .class file format. The recommended Error:solution is to recompile the class from source, using an up-to-date compiler Error:and without specifying any "-target" type options. The consequence of ignoring Error:this warning is that reflective operations on this class will incorrectly Error:indicate that it is *not* an inner class. Error:warning: Ignoring InnerClasses attribute for an anonymous inner class Error:(com.tencent.mm.opensdk.openapi.WXApiImplV10$1) that doesn't come with an Error:associated EnclosingMethod attribute. This class was probably produced by a Error:compiler that did not target the modern .class file format. The recommended Error:solution is to recompile the class from source, using an up-to-date compiler Error:and without specifying any "-target" type options. The consequence of ignoring Error:this warning is that reflective operations on this class will incorrectly Error:indicate that it is *not* an inner class. Error:warning: Ignoring InnerClasses attribute for an anonymous inner class Error:(com.tencent.mm.opensdk.openapi.WXApiImplV10$ActivityLifecycleCb$1) that doesn't come with an Error:associated EnclosingMethod attribute. This class was probably produced by a Error:compiler that did not target the modern .class file format. The recommended Error:solution is to recompile the class from source, using an up-to-date compiler Error:and without specifying any "-target" type options. The consequence of ignoring Error:this warning is that reflective operations on this class will incorrectly Error:indicate that it is *not* an inner class. Error:warning: Ignoring InnerClasses attribute for an anonymous inner class Error:(com.tencent.mm.opensdk.openapi.WXApiImplV10$ActivityLifecycleCb$2) that doesn't come with an Error:associated EnclosingMethod attribute. This class was probably produced by a Error:compiler that did not target the modern .class file format. The recommended Error:solution is to recompile the class from source, using an up-to-date compiler Error:and without specifying any "-target" type options. The consequence of ignoring Error:this warning is that reflective operations on this class will incorrectly Error:indicate that it is *not* an inner class. Information:BUILD SUCCESSFUL Information:Total time: 36.571 secs Information:40 errors Information:0 warnings Information:See complete output in console 大神们看下这个怎么解决, multiDexEnabled true,这个我已经加上了,application也加上了,上面的错误有一个com.tencent.mm.opensdk.diffdev.a.b提示,我是之前做微信第三方登陆加了他们的库,不知道是不是这个原因
Error:(68, 39) java: 不兼容的类型: com.easy.demo.entity.User无法转换为int
``` @RequestMapping(value = {"/loginUser"},method = RequestMethod.GET) public ModelAndView login(User user, HttpServletRequest request, HttpSession session) throws UnsupportedEncodingException, NoSuchAlgorithmException { int i=0; String s=user.getPassword(); String md=HexUtil.getEncryptedPwd(s); //对比数据库密码 user.setPassword(md); try { i=userMapper.loginUser(user); }catch (Exception e){ e.printStackTrace(); } System.out.println(i); if (i==1){ System.out.println("账号或密码输入错误"); }else { System.out.println("登陆成功"); } return null; } ``` 要如何转换?为什么我的这里会无法转换,我看别人的就可以啊?附上链接:https://blog.csdn.net/nihaoa50/article/details/61415945
请问:客户端访问服务器,报:Error: 请求的名称有效,但是找不到请求的类型的数据
请问:客户端访问服务器,报:Error: 请求的名称有效,但是找不到请求的类型的数据,怎么回事
unix网络编程卷2门代码编译中报错:error: ‘door_arg_t’ undeclared (first use in this function),环境是centos6
gcc client1.c -lunpipc -lrt -ldoor client1.c: In function ‘main’: client1.c:8: error: ‘door_arg_t’ undeclared (first use in this function) client1.c:8: error: (Each undeclared identifier is reported only once client1.c:8: error: for each function it appears in.) client1.c:8: error: expected ‘;’ before ‘arg’ client1.c:17: error: ‘arg’ undeclared (first use in this function)
运行Java程序时报错Error:(3001, 19) java: ncCommonSvc.AsyncClient.microprobe_call不是抽象的
运行Java程序时报错Error:(3001, 19) java: ncCommonSvc.AsyncClient.microprobe_call不是抽象的, 并且未覆盖org.apache.thrift.async.TAsyncMethodCall中的抽象方法getResult();Error:(3013, 19) java: ncCommonSvc.AsyncClient.microprobe_call中的getResult()无法覆盖org.apache.thrift.async.TAsyncMethodCall中的getResult()返回类型void与java.lang.Object不兼容 报这个错误可能是什么原因呢,代码是由C++转成java测试thrift接口的,所以应该不是代码本身的问题,是代码里面实现的方法与引入的thrift库有冲突么 没有接触过Java的小白求教,要用Jmeter工具才用Java的
C语言报错error C2143: syntax error : missing ')' before '['怎么办
题目是一个数组只有大小写字母,要求转换大小写字母,用子函数实现 我写的代码如下: #include<stdio.h> void main() { char a[26]; int i; char ZH(a[26]); for(i=0;i<26;i++) { a[i]=i+'a'; } a[i]=ZH(a[26]); for(i=0;i<26;i++) printf("%d",a[i]); } char ZH(a[26]) { int n; for(n=o;n<26;n++) { a[n]=n+'a'+32; } return(a[26]); } 报错如下: C:\Users\SN-crush\Desktop\6.c(6) : error C2143: syntax error : missing ')' before '[' C:\Users\SN-crush\Desktop\6.c(6) : error C2090: function returns array C:\Users\SN-crush\Desktop\6.c(6) : error C2059: syntax error : ')' C:\Users\SN-crush\Desktop\6.c(13) : warning C4047: '=' : 'char ' differs in levels of indirection from 'char *' C:\Users\SN-crush\Desktop\6.c(19) : error C2143: syntax error : missing ')' before '[' C:\Users\SN-crush\Desktop\6.c(19) : error C2090: function returns array C:\Users\SN-crush\Desktop\6.c(19) : error C2059: syntax error : ')' C:\Users\SN-crush\Desktop\6.c(23) : error C2065: 'o' : undeclared identifier C:\Users\SN-crush\Desktop\6.c(24) : error C2109: subscript requires array or pointer type C:\Users\SN-crush\Desktop\6.c(24) : error C2106: '=' : left operand must be l-value C:\Users\SN-crush\Desktop\6.c(26) : error C2109: subscript requires array or pointer type C:\Users\SN-crush\Desktop\6.c(26) : warning C4047: 'return' : 'char *' differs in levels of indirection from 'int ' Error executing cl.exe. 6.obj - 10 error(s), 2 warning(s) 看不懂,这咋改you
启动mysql服务报ERROR:1067错误
这里是日志: 2014-09-01T06:12:49.816554Z 0 [Note] Plugin 'FEDERATED' is disabled. 2014-09-01T06:12:49.818554Z 0 [Note] InnoDB: Using atomics to ref count buffer pool pages 2014-09-01T06:12:49.820554Z 0 [Note] InnoDB: Mutexes and rw_locks use Windows interlocked functions 2014-09-01T06:12:49.822554Z 0 [Note] InnoDB: Uses system mutexes 2014-09-01T06:12:49.824554Z 0 [Note] InnoDB: Compressed tables use zlib 1.2.3 2014-09-01T06:12:49.825555Z 0 [Warning] InnoDB: Adjusting innodb_buffer_pool_instances from 8 to 1 since innodb_buffer_pool_size is less than 1024 MiB 2014-09-01T06:12:49.830555Z 0 [Note] InnoDB: Number of pools: 1 2014-09-01T06:12:49.832555Z 0 [Note] InnoDB: Not using CPU crc32 instructions 2014-09-01T06:12:49.834555Z 0 [ERROR] InnoDB: Unable to create temporary file; errno: 2 2014-09-01T06:12:49.835555Z 0 [ERROR] Plugin 'InnoDB' init function returned error. 2014-09-01T06:12:49.837555Z 0 [ERROR] Plugin 'InnoDB' registration as a STORAGE ENGINE failed. 2014-09-01T06:12:49.840555Z 0 [ERROR] Unknown/unsupported storage engine: innodb 2014-09-01T06:12:49.841555Z 0 [ERROR] Aborting 2014-09-01T06:12:49.842556Z 0 [Note] Binlog end 2014-09-01T06:12:50.010565Z 0 [Note] Shutting down plugin 'partition' 2014-09-01T06:12:50.015565Z 0 [Note] Shutting down plugin 'PERFORMANCE_SCHEMA' 2014-09-01T06:12:50.021566Z 0 [Note] Shutting down plugin 'INNODB_SYS_DATAFILES' 2014-09-01T06:12:50.027566Z 0 [Note] Shutting down plugin 'INNODB_SYS_TABLESPACES' 2014-09-01T06:12:50.033566Z 0 [Note] Shutting down plugin 'INNODB_SYS_FOREIGN_COLS' 2014-09-01T06:12:50.039567Z 0 [Note] Shutting down plugin 'INNODB_SYS_FOREIGN' 2014-09-01T06:12:50.043567Z 0 [Note] Shutting down plugin 'INNODB_SYS_FIELDS' 2014-09-01T06:12:50.045567Z 0 [Note] Shutting down plugin 'INNODB_SYS_COLUMNS' 2014-09-01T06:12:50.048567Z 0 [Note] Shutting down plugin 'INNODB_SYS_INDEXES' 2014-09-01T06:12:50.050567Z 0 [Note] Shutting down plugin 'INNODB_SYS_TABLESTATS' 2014-09-01T06:12:50.052568Z 0 [Note] Shutting down plugin 'INNODB_SYS_TABLES' 2014-09-01T06:12:50.054568Z 0 [Note] Shutting down plugin 'INNODB_FT_INDEX_TABLE' 2014-09-01T06:12:50.057568Z 0 [Note] Shutting down plugin 'INNODB_FT_INDEX_CACHE' 2014-09-01T06:12:50.059568Z 0 [Note] Shutting down plugin 'INNODB_FT_CONFIG' 2014-09-01T06:12:50.061568Z 0 [Note] Shutting down plugin 'INNODB_FT_BEING_DELETED' 2014-09-01T06:12:50.064568Z 0 [Note] Shutting down plugin 'INNODB_FT_DELETED' 2014-09-01T06:12:50.066568Z 0 [Note] Shutting down plugin 'INNODB_FT_DEFAULT_STOPWORD' 2014-09-01T06:12:50.068568Z 0 [Note] Shutting down plugin 'INNODB_METRICS' 2014-09-01T06:12:50.071569Z 0 [Note] Shutting down plugin 'INNODB_TEMP_TABLE_INFO' 2014-09-01T06:12:50.073569Z 0 [Note] Shutting down plugin 'INNODB_BUFFER_POOL_STATS' 2014-09-01T06:12:50.074569Z 0 [Note] Shutting down plugin 'INNODB_BUFFER_PAGE_LRU' 2014-09-01T06:12:50.076569Z 0 [Note] Shutting down plugin 'INNODB_BUFFER_PAGE' 2014-09-01T06:12:50.078569Z 0 [Note] Shutting down plugin 'INNODB_CMP_PER_INDEX_RESET' 2014-09-01T06:12:50.079569Z 0 [Note] Shutting down plugin 'INNODB_CMP_PER_INDEX' 2014-09-01T06:12:50.081569Z 0 [Note] Shutting down plugin 'INNODB_CMPMEM_RESET' 2014-09-01T06:12:50.083569Z 0 [Note] Shutting down plugin 'INNODB_CMPMEM' 2014-09-01T06:12:50.084569Z 0 [Note] Shutting down plugin 'INNODB_CMP_RESET' 2014-09-01T06:12:50.086569Z 0 [Note] Shutting down plugin 'INNODB_CMP' 2014-09-01T06:12:50.087570Z 0 [Note] Shutting down plugin 'INNODB_LOCK_WAITS' 2014-09-01T06:12:50.089570Z 0 [Note] Shutting down plugin 'INNODB_LOCKS' 2014-09-01T06:12:50.091570Z 0 [Note] Shutting down plugin 'INNODB_TRX' 2014-09-01T06:12:50.092570Z 0 [Note] Shutting down plugin 'BLACKHOLE' 2014-09-01T06:12:50.094570Z 0 [Note] Shutting down plugin 'ARCHIVE' 2014-09-01T06:12:50.096570Z 0 [Note] Shutting down plugin 'MRG_MYISAM' 2014-09-01T06:12:50.097570Z 0 [Note] Shutting down plugin 'MyISAM' 2014-09-01T06:12:50.099570Z 0 [Note] Shutting down plugin 'MEMORY' 2014-09-01T06:12:50.100570Z 0 [Note] Shutting down plugin 'CSV' 2014-09-01T06:12:50.101570Z 0 [Note] Shutting down plugin 'sha256_password' 2014-09-01T06:12:50.103570Z 0 [Note] Shutting down plugin 'mysql_old_password' 2014-09-01T06:12:50.105571Z 0 [Note] Shutting down plugin 'mysql_native_password' 2014-09-01T06:12:50.107571Z 0 [Note] Shutting down plugin 'binlog' 2014-09-01T06:12:50.108571Z 0 [Note] F:\mysqlpath\MySQL\MySQL Server 5.7\bin\mysqld: Shutdown complete 有谁知道的吗?谢谢。。。
Error:(35, 30) 错误: 找不到符号
我自定义了一个Convert,代码如下 public final class MyConvert extends Converter.Factory { private final Gson gson; public static MyConvert create(Gson gson) { return new MyConvert(gson); } public static MyConvert create(){ return create(new Gson()); } public MyConvert(Gson gson) { this.gson = gson; } @Override public Converter<ResponseBody, ?> responseBodyConverter(Type type, Annotation[] annotations, Retrofit retrofit) { TypeAdapter<?> adapter=gson.getAdapter(TypeToken.get(type)); return super.responseBodyConverter(type, annotations, retrofit); } } TypeAdapter<?> adapter=gson.getAdapter(TypeToken.get(type)); 这句代码死活编译不过去,报错信息如下: Error:(35, 30) 错误: 找不到符号 符号: 方法 getAdapter(TypeToken<CAP#1>) 位置: 类型为Gson的变量 gson 其中, CAP#1是新类型变量: CAP#1从?的捕获扩展Object 困扰了好几天,求大神帮忙解答~~~~
改了一个指针就出现了cpp(49) : error C2146: syntax error : missing ';' before identifier 'malloc'的报错,?
改了一个指针就出现了cpp(49) : error C2146: syntax error : missing ';' before identifier 'malloc'的报错,?改了一个指针就出现了cpp(49) : error C2146: syntax error : missing ';' before identifier 'malloc'的报错,?改了一个指针就出现了cpp(49) : error C2146: syntax error : missing ';' before identifier 'malloc'的报错,?
mysql 数据库update时出错,错误代码 SQL ERROR :1213
mysql 数据库update时出错,错误代码 SQL ERROR :1213 SQLSTATE: 40001
App自动化报错:Proxy error: Could not proxy command to remote server. Original error: 404 - undefined
    App启动参数如下(存放在Yaml文件中): ``` automationName: UiAutomator2 platformName: Android platformVersion: 7 deviceName: Android Emulator appPackage: com.ellabook appActivity: com.ellabook.startup.StartActivity noReset: False unicodeKeyboard: True # 将键盘给隐藏起来 resetKeyboard: True ```      其他信息:       Appium 1.15       模拟器: 雷电模拟器4.0.7       测试框架: pytest conftest.py内容如下: ``` def basedriver(port=4723, **kwargs): """ 根据设置的参数,启动会话,并返回会话对象 :param port: 会话启动端口号---int :param kwargs: 启动参数 :return: 会话对象 """ yamls = YAML(typ='safe') yaml_path = os.path.join(CAPS_PATH, "desire_caps.yaml") fs = open(yaml_path, encoding='UTF-8') desire_caps = yamls.load(fs) if kwargs: for key, value in kwargs.items(): desire_caps[key] = value driver = webdriver.Remote("http://localhost:{}/wd/hub".format(port), desire_caps) return driver @pytest.fixture(scope="class") def initdriver_first_start(): """App首次启动""" driver = basedriver(noReset=False) yield driver driver.close() ```     测试用例py文件内容: ``` @pytest.mark.usefixtures("initdriver_first_start") class TestAPPStart: """APP启动页测试: 是否进入启动页 、banner图正常滑动、点击"开始看书吧"进入登录界面 """ def test_0_into_start(self, initdriver_first_start): """APP首次启动,启动页是否展示“开始阅读吧”按钮 """ driver = initdriver_first_start AppStartPage(driver).check_read_book_is_exist() def test_banner_left_slip(self, initdriver_first_start): """APP首次启动,启动页广告图能够向左滑""" driver = initdriver_first_start AppStartPage(driver).slide_start_banner("left") # App首次启动,banner广告图正常切换 def test_banner_right_slip(self, initdriver_first_start): """APP首次启动,启动页广告图能够能够向右滑""" driver = initdriver_first_start AppStartPage(driver).slide_start_banner("right") # App首次启动,banner广告图正常切换 def test_click_button(self, initdriver_first_start): """APP首次启动,点击开始按钮,查看是否进入登录界面""" driver = initdriver_first_start AppStartPage(driver).click_start_read() # 点击“开始阅读” 按钮 LoginPage(driver).check_into_login_idle() # 查看是否进入登录界面 ```     APP启动页测试 测试类(pytest/py.test方式)运行,此时用例执行完成后,在进行测试类的teardown时,却报错: selenium.common.exceptions.WebDriverException: Message: An unknown server-side error occurred while processing the command. Original error: Could not proxy. Proxy error: Could not proxy command to remote server. Original error: 404 - undefined ![图片说明](https://img-ask.csdn.net/upload/201912/26/1577335992_418416.png)  网上百度了一堆资料,但依旧没有相关: 404 - undefined 的报错类型的解决方法(忧伤)
SpringMVC解析MP4文件时报APR error: -730054或APR error: -730053异常,Chrome和IE能显示视频,Firefox显示不了
我重写了JstlView这个类,类名为DefaultJstlView,实现了里的checkResource方法,我用SpringMVC的DefaultJstlView来解析.jsp、.mp4视图,Chrome浏览器、IE浏览器、Firefox浏览器访问视频,结果用Chrome和IE测试时服务器报 APR error: -730054的异常,但能显示MP4视频文件,Firefox测试时却显示没有找到支持的视频格式和MINE类型,服务器也报 APR error: -730054的异常,怎么让Firefox浏览器在报 APR error: -730054的异常时能正常显示视频? 以下是错误信息: org.apache.catalina.connector.ClientAbortException: java.io.IOException: APR error: -730054 at org.apache.catalina.connector.OutputBuffer.realWriteBytes(OutputBuffer.java:396) at org.apache.tomcat.util.buf.ByteChunk.flushBuffer(ByteChunk.java:381) at org.apache.tomcat.util.buf.ByteChunk.append(ByteChunk.java:310) at org.apache.catalina.connector.OutputBuffer.writeBytes(OutputBuffer.java:421) at org.apache.catalina.connector.OutputBuffer.write(OutputBuffer.java:409) at org.apache.catalina.connector.CoyoteOutputStream.write(CoyoteOutputStream.java:97) at org.apache.catalina.servlets.DefaultServlet.copyRange(DefaultServlet.java:2219) at org.apache.catalina.servlets.DefaultServlet.copy(DefaultServlet.java:2053) at org.apache.catalina.servlets.DefaultServlet.serveResource(DefaultServlet.java:1015) at org.apache.catalina.servlets.DefaultServlet.doGet(DefaultServlet.java:410) at javax.servlet.http.HttpServlet.service(HttpServlet.java:622) at org.apache.catalina.servlets.DefaultServlet.service(DefaultServlet.java:390) at javax.servlet.http.HttpServlet.service(HttpServlet.java:729) at org.apache.catalina.core.ApplicationFilterChain.internalDoFilter(ApplicationFilterChain.java:292) at org.apache.catalina.core.ApplicationFilterChain.doFilter(ApplicationFilterChain.java:207) at org.apache.catalina.core.ApplicationDispatcher.invoke(ApplicationDispatcher.java:716) at org.apache.catalina.core.ApplicationDispatcher.processRequest(ApplicationDispatcher.java:466) at org.apache.catalina.core.ApplicationDispatcher.doForward(ApplicationDispatcher.java:358) at org.apache.catalina.core.ApplicationDispatcher.forward(ApplicationDispatcher.java:318) at org.springframework.web.servlet.resource.DefaultServletHttpRequestHandler.handleRequest(DefaultServletHttpRequestHandler.java:122) at org.springframework.web.servlet.mvc.HttpRequestHandlerAdapter.handle(HttpRequestHandlerAdapter.java:51) at org.springframework.web.servlet.DispatcherServlet.doDispatch(DispatcherServlet.java:943) at org.springframework.web.servlet.DispatcherServlet.doService(DispatcherServlet.java:877) at org.springframework.web.servlet.FrameworkServlet.processRequest(FrameworkServlet.java:966) at org.springframework.web.servlet.FrameworkServlet.doGet(FrameworkServlet.java:857) at javax.servlet.http.HttpServlet.service(HttpServlet.java:622) at org.springframework.web.servlet.FrameworkServlet.service(FrameworkServlet.java:842) at javax.servlet.http.HttpServlet.service(HttpServlet.java:729) at org.apache.catalina.core.ApplicationFilterChain.internalDoFilter(ApplicationFilterChain.java:292) at org.apache.catalina.core.ApplicationFilterChain.doFilter(ApplicationFilterChain.java:207) at org.apache.tomcat.websocket.server.WsFilter.doFilter(WsFilter.java:52) at org.apache.catalina.core.ApplicationFilterChain.internalDoFilter(ApplicationFilterChain.java:240) at org.apache.catalina.core.ApplicationFilterChain.doFilter(ApplicationFilterChain.java:207) at org.apache.catalina.core.ApplicationDispatcher.invoke(ApplicationDispatcher.java:716) at org.apache.catalina.core.ApplicationDispatcher.processRequest(ApplicationDispatcher.java:466) at org.apache.catalina.core.ApplicationDispatcher.doForward(ApplicationDispatcher.java:391) at org.apache.catalina.core.ApplicationDispatcher.forward(ApplicationDispatcher.java:318) at org.springframework.web.servlet.view.InternalResourceView.renderMergedOutputModel(InternalResourceView.java:168) at org.springframework.web.servlet.view.AbstractView.render(AbstractView.java:303) at org.springframework.web.servlet.DispatcherServlet.render(DispatcherServlet.java:1228) at org.springframework.web.servlet.DispatcherServlet.processDispatchResult(DispatcherServlet.java:1011) at org.springframework.web.servlet.DispatcherServlet.doDispatch(DispatcherServlet.java:955) at org.springframework.web.servlet.DispatcherServlet.doService(DispatcherServlet.java:877) at org.springframework.web.servlet.FrameworkServlet.processRequest(FrameworkServlet.java:966) at org.springframework.web.servlet.FrameworkServlet.doGet(FrameworkServlet.java:857) at javax.servlet.http.HttpServlet.service(HttpServlet.java:622) at org.springframework.web.servlet.FrameworkServlet.service(FrameworkServlet.java:842) at javax.servlet.http.HttpServlet.service(HttpServlet.java:729) at org.apache.catalina.core.ApplicationFilterChain.internalDoFilter(ApplicationFilterChain.java:292) at org.apache.catalina.core.ApplicationFilterChain.doFilter(ApplicationFilterChain.java:207) at org.apache.tomcat.websocket.server.WsFilter.doFilter(WsFilter.java:52) at org.apache.catalina.core.ApplicationFilterChain.internalDoFilter(ApplicationFilterChain.java:240) at org.apache.catalina.core.ApplicationFilterChain.doFilter(ApplicationFilterChain.java:207) at org.springframework.web.filter.CharacterEncodingFilter.doFilterInternal(CharacterEncodingFilter.java:88) at org.springframework.web.filter.OncePerRequestFilter.doFilter(OncePerRequestFilter.java:107) at org.apache.catalina.core.ApplicationFilterChain.internalDoFilter(ApplicationFilterChain.java:240) at org.apache.catalina.core.ApplicationFilterChain.doFilter(ApplicationFilterChain.java:207) at org.apache.catalina.core.StandardWrapperValve.invoke(StandardWrapperValve.java:212) at org.apache.catalina.core.StandardContextValve.invoke(StandardContextValve.java:94) at org.apache.catalina.authenticator.AuthenticatorBase.invoke(AuthenticatorBase.java:492) at org.apache.catalina.core.StandardHostValve.invoke(StandardHostValve.java:141) at org.apache.catalina.valves.ErrorReportValve.invoke(ErrorReportValve.java:80) at org.apache.catalina.valves.AbstractAccessLogValve.invoke(AbstractAccessLogValve.java:620) at org.apache.catalina.core.StandardEngineValve.invoke(StandardEngineValve.java:88) at org.apache.catalina.connector.CoyoteAdapter.service(CoyoteAdapter.java:502) at org.apache.coyote.http11.AbstractHttp11Processor.process(AbstractHttp11Processor.java:1152) at org.apache.coyote.AbstractProtocol$AbstractConnectionHandler.process(AbstractProtocol.java:684) at org.apache.tomcat.util.net.AprEndpoint$SocketProcessor.doRun(AprEndpoint.java:2527) at org.apache.tomcat.util.net.AprEndpoint$SocketProcessor.run(AprEndpoint.java:2516) at java.util.concurrent.ThreadPoolExecutor.runWorker(ThreadPoolExecutor.java:1149) at java.util.concurrent.ThreadPoolExecutor$Worker.run(ThreadPoolExecutor.java:624) at org.apache.tomcat.util.threads.TaskThread$WrappingRunnable.run(TaskThread.java:61) at java.lang.Thread.run(Thread.java:748)
Adb connection Error:远程主机强迫关闭了一个现有的连接。
andriod 启动虚拟机的时候报以下错误 [2015-01-25 16:10:29 - DeviceMonitor] Adb connection Error:远程主机强迫关闭了一个现有的连接。 [2015-01-25 16:10:30 - DeviceMonitor] Connection attempts: 1 [2015-01-25 16:10:32 - DeviceMonitor] Connection attempts: 2 [2015-01-25 16:10:35 - DeviceMonitor] Connection attempts: 3 [2015-01-25 16:10:37 - DeviceMonitor] Connection attempts: 4 [2015-01-25 16:10:39 - DeviceMonitor] Connection attempts: 5 [2015-01-25 16:10:41 - DeviceMonitor] Connection attempts: 6 。。。。。。。。 网上说的方法都试过,都不行求大神指导
VS2008参数转换错误error C2664: ?
``` void CLi5_7View::OnPropage() { // TODO: 在此添加命令处理程序代码 CProframeSheet m_mysheet(_T("属性页对话框")); //错误代码 CString str = _T(""); if(m_mysheet.DoModal() == IDOK) { str = str + m_mysheet.m_personal.m_name + _T("工作单位是") + m_mysheet.m_unit.m_work; MessageBox(str); } } ``` 错误提示:error C2664: “CProframeSheet::CProframeSheet(const CProframeSheet &)”: 不能将参数 1 从“const char [13]”转换为“const CProframeSheet &” 1> 原因如下: 无法从“const char [13]”转换为“const CProframeSheet” 1> 无构造函数可以接受源类型,或构造函数重载决策不明确
同样的代码code::blocks中运行正常,VSCODE中提示collect2.exe: error: ld returned 1 exit statuscollect2.exe: error: ld returned 1 exit status
一段C代码,在code::blocks中运行正常,但在VSCODE中提示C:\Users\ADMINI~1\AppData\Local\Temp\cc3JOmOu.o:test.cpp:(.text+0x93): undefined reference to `gen_Data(void*)' collect2.exe: error: ld returned 1 exit status 代码如下: 头文件: ``` //kpid.h .... typedef struct _Para { ..... } Para; void gen_Data(void *p); ``` .c文件 ``` //kpid.c #include "kpid.h" void gen_Data(void *p) { Para *pa = (Para *)p; ...... } ``` main ``` //main.c #include "kpid.h" int main() { Para p; p.menber1 = 10; //初始化 .... gen_Data(&p) } ``` 1、这段程序在Code::Blocks17.2 中能正常运行,可输出期望结果 2、将struct定义,gen_Data() 函数定义/实现都放到main.c文件中时(代码不变,仅放的位置移动),在vscode中也能正常运行。 3、但如上代码,定义、实现放在单独的.h,.c文件中,在main.c中包含头文件时,运行错误。提示如下。(函数名的拼写是正确的,没错) C:\Users\ADMINI~1\AppData\Local\Temp\cc3JOmOu.o:test.cpp:(.text+0x93): undefined reference to `gen_Data(void*)' collect2.exe: error: ld returned 1 exit status
Error: Can't wait without a fiber?啥意思啊?
遇到了如下问题: Error: Can't wait without a fiber? 啥意思啊?
idea改成eclipse编译报错Error:java: Internal error:
问题描述 **Error:java: Internal error:** java.lang.IllegalArgumentException at org.eclipse.jdt.internal.compiler.tool.EclipseFileManager.handleOption(EclipseFileManager.java:758) at java.compiler@11.0.3/javax.tools.ForwardingJavaFileManager.handleOption(ForwardingJavaFileManager.java:99) at org.jetbrains.jps.javac.JpsJavacFileManager.handleOption(JpsJavacFileManager.java:318) at org.jetbrains.jps.javac.JavacMain.compile(JavacMain.java:71) at org.jetbrains.jps.incremental.java.JavaBuilder.compileJava(JavaBuilder.java:460) at org.jetbrains.jps.incremental.java.JavaBuilder.compile(JavaBuilder.java:330) at org.jetbrains.jps.incremental.java.JavaBuilder.doBuild(JavaBuilder.java:255) at org.jetbrains.jps.incremental.java.JavaBuilder.build(JavaBuilder.java:213) at org.jetbrains.jps.incremental.IncProjectBuilder.runModuleLevelBuilders(IncProjectBuilder.java:1324) at org.jetbrains.jps.incremental.IncProjectBuilder.runBuildersForChunk(IncProjectBuilder.java:1004) at org.jetbrains.jps.incremental.IncProjectBuilder.buildTargetsChunk(IncProjectBuilder.java:1071) at org.jetbrains.jps.incremental.IncProjectBuilder.buildChunkIfAffected(IncProjectBuilder.java:965) at org.jetbrains.jps.incremental.IncProjectBuilder.buildChunks(IncProjectBuilder.java:794) at org.jetbrains.jps.incremental.IncProjectBuilder.runBuild(IncProjectBuilder.java:376) at org.jetbrains.jps.incremental.IncProjectBuilder.build(IncProjectBuilder.java:178) at org.jetbrains.jps.cmdline.BuildRunner.runBuild(BuildRunner.java:139) at org.jetbrains.jps.cmdline.BuildSession.runBuild(BuildSession.java:288) at org.jetbrains.jps.cmdline.BuildSession.run(BuildSession.java:121) at org.jetbrains.jps.cmdline.BuildMain$MyMessageHandler.lambda$channelRead0$0(BuildMain.java:228) at java.base/java.util.concurrent.ThreadPoolExecutor.runWorker(ThreadPoolExecutor.java:1128) at java.base/java.util.concurrent.ThreadPoolExecutor$Worker.run(ThreadPoolExecutor.java:628) at java.base/java.lang.Thread.run(Thread.java:834) 尝试的解决方法: 我所有Jdk版本都改过来了,如下 (https://blog.csdn.net/wo541075754/article/details/82119860 "") 还是不管用。 我用Javac能编译,不报这个错。但是这个项目必须用eclipse编译。 下面是我配置的版本 ![图片说明](https://img-ask.csdn.net/upload/201910/10/1570678333_670537.png)![图片说明](https://img-ask.csdn.net/upload/201910/10/1570678338_83497.png)![图片说明](https://img-ask.csdn.net/upload/201910/10/1570678344_612385.png)![图片说明](https://img-ask.csdn.net/upload/201910/10/1570678348_889029.png)
idea 写flutter app,重启电脑后项目便宜报错Error:Android Dex: [my_app] Unable to execute DX
当天晚上 项目编译运行正常,关机后,第二天打开项目编译失败, ``` Information:2019/4/17 22:49 - Compilation completed with 24 errors and 0 warnings in 4 s 598 ms Error:Android Dex: [my_app] Uncaught translation error: java.lang.IllegalArgumentException: already added: Lorg/gradle/cli/AbstractCommandLineConverter; Error:Android Dex: [my_app] Uncaught translation error: java.lang.IllegalArgumentException: already added: Lorg/gradle/cli/AbstractPropertiesCommandLineConverter; Error:Android Dex: [my_app] Uncaught translation error: java.lang.IllegalArgumentException: already added: Lorg/gradle/cli/CommandLineArgumentException; Error:Android Dex: [my_app] Uncaught translation error: java.lang.IllegalArgumentException: already added: Lorg/gradle/cli/CommandLineConverter; Error:Android Dex: [my_app] Uncaught translation error: java.lang.IllegalArgumentException: already added: Lorg/gradle/cli/CommandLineOption; Error:Android Dex: [my_app] Uncaught translation error: java.lang.IllegalArgumentException: already added: Lorg/gradle/cli/CommandLineParser; Error:Android Dex: [my_app] Uncaught translation error: java.lang.IllegalArgumentException: already added: Lorg/gradle/cli/CommandLineParser$1; Error:Android Dex: [my_app] Uncaught translation error: java.lang.IllegalArgumentException: already added: Lorg/gradle/cli/CommandLineParser$AfterFirstSubCommand; Error:Android Dex: [my_app] Uncaught translation error: java.lang.IllegalArgumentException: already added: Lorg/gradle/cli/CommandLineParser$AfterOptions; Error:Android Dex: [my_app] Unable to execute DX Error:Android Dex: [my_app] java.lang.RuntimeException: Translation has been interrupted Error:Android Dex: [my_app] at com.android.dx.command.dexer.Main.processAllFiles(Main.java:614) Error:Android Dex: [my_app] at com.android.dx.command.dexer.Main.runMonoDex(Main.java:310) Error:Android Dex: [my_app] at com.android.dx.command.dexer.Main.runDx(Main.java:288) Error:Android Dex: [my_app] at com.android.dx.command.dexer.Main.run(Main.java:264) Error:Android Dex: [my_app] at sun.reflect.NativeMethodAccessorImpl.invoke0(Native Method) Error:Android Dex: [my_app] at sun.reflect.NativeMethodAccessorImpl.invoke(NativeMethodAccessorImpl.java:62) Error:Android Dex: [my_app] at sun.reflect.DelegatingMethodAccessorImpl.invoke(DelegatingMethodAccessorImpl.java:43) Error:Android Dex: [my_app] at java.lang.reflect.Method.invoke(Method.java:498) Error:Android Dex: [my_app] at org.jetbrains.android.compiler.tools.AndroidDxRunner.runDex(AndroidDxRunner.java:201) Error:Android Dex: [my_app] at org.jetbrains.android.compiler.tools.AndroidDxRunner.main(AndroidDxRunner.java:349) Error:Android Dex: [my_app] Caused by: java.lang.InterruptedException: Too many errors Error:Android Dex: [my_app] at com.android.dx.command.dexer.Main.processAllFiles(Main.java:606) Error:Android Dex: [my_app] ... 9 more ``` ![图片说明](https://img-ask.csdn.net/upload/201904/17/1555514999_883791.png) 请教大神解决!!
Java学习的正确打开方式
在博主认为,对于入门级学习java的最佳学习方法莫过于视频+博客+书籍+总结,前三者博主将淋漓尽致地挥毫于这篇博客文章中,至于总结在于个人,实际上越到后面你会发现学习的最好方式就是阅读参考官方文档其次就是国内的书籍,博客次之,这又是一个层次了,这里暂时不提后面再谈。博主将为各位入门java保驾护航,各位只管冲鸭!!!上天是公平的,只要不辜负时间,时间自然不会辜负你。 何谓学习?博主所理解的学习,它是一个过程,是一个不断累积、不断沉淀、不断总结、善于传达自己的个人见解以及乐于分享的过程。
大学四年自学走来,这些私藏的实用工具/学习网站我贡献出来了
大学四年,看课本是不可能一直看课本的了,对于学习,特别是自学,善于搜索网上的一些资源来辅助,还是非常有必要的,下面我就把这几年私藏的各种资源,网站贡献出来给你们。主要有:电子书搜索、实用工具、在线视频学习网站、非视频学习网站、软件下载、面试/求职必备网站。 注意:文中提到的所有资源,文末我都给你整理好了,你们只管拿去,如果觉得不错,转发、分享就是最大的支持了。 一、电子书搜索 对于大部分程序员...
linux系列之常用运维命令整理笔录
本博客记录工作中需要的linux运维命令,大学时候开始接触linux,会一些基本操作,可是都没有整理起来,加上是做开发,不做运维,有些命令忘记了,所以现在整理成博客,当然vi,文件操作等就不介绍了,慢慢积累一些其它拓展的命令,博客不定时更新 free -m 其中:m表示兆,也可以用g,注意都要小写 Men:表示物理内存统计 total:表示物理内存总数(total=used+free) use...
Vue + Spring Boot 项目实战(十四):用户认证方案与完善的访问拦截
本篇文章主要讲解 token、session 等用户认证方案的区别并分析常见误区,以及如何通过前后端的配合实现完善的访问拦截,为下一步权限控制的实现打下基础。
比特币原理详解
一、什么是比特币 比特币是一种电子货币,是一种基于密码学的货币,在2008年11月1日由中本聪发表比特币白皮书,文中提出了一种去中心化的电子记账系统,我们平时的电子现金是银行来记账,因为银行的背后是国家信用。去中心化电子记账系统是参与者共同记账。比特币可以防止主权危机、信用风险。其好处不多做赘述,这一层面介绍的文章很多,本文主要从更深层的技术原理角度进行介绍。 二、问题引入 假设现有4个人...
程序员接私活怎样防止做完了不给钱?
首先跟大家说明一点,我们做 IT 类的外包开发,是非标品开发,所以很有可能在开发过程中会有这样那样的需求修改,而这种需求修改很容易造成扯皮,进而影响到费用支付,甚至出现做完了项目收不到钱的情况。 那么,怎么保证自己的薪酬安全呢? 我们在开工前,一定要做好一些证据方面的准备(也就是“讨薪”的理论依据),这其中最重要的就是需求文档和验收标准。一定要让需求方提供这两个文档资料作为开发的基础。之后开发...
网页实现一个简单的音乐播放器(大佬别看。(⊙﹏⊙))
今天闲着无事,就想写点东西。然后听了下歌,就打算写个播放器。 于是乎用h5 audio的加上js简单的播放器完工了。 演示地点演示 html代码如下` music 这个年纪 七月的风 音乐 ` 然后就是css`*{ margin: 0; padding: 0; text-decoration: none; list-...
Python十大装B语法
Python 是一种代表简单思想的语言,其语法相对简单,很容易上手。不过,如果就此小视 Python 语法的精妙和深邃,那就大错特错了。本文精心筛选了最能展现 Python 语法之精妙的十个知识点,并附上详细的实例代码。如能在实战中融会贯通、灵活使用,必将使代码更为精炼、高效,同时也会极大提升代码B格,使之看上去更老练,读起来更优雅。
数据库优化 - SQL优化
以实际SQL入手,带你一步一步走上SQL优化之路!
2019年11月中国大陆编程语言排行榜
2019年11月2日,我统计了某招聘网站,获得有效程序员招聘数据9万条。针对招聘信息,提取编程语言关键字,并统计如下: 编程语言比例 rank pl_ percentage 1 java 33.62% 2 cpp 16.42% 3 c_sharp 12.82% 4 javascript 12.31% 5 python 7.93% 6 go 7.25% 7 p...
通俗易懂地给女朋友讲:线程池的内部原理
餐盘在灯光的照耀下格外晶莹洁白,女朋友拿起红酒杯轻轻地抿了一小口,对我说:“经常听你说线程池,到底线程池到底是个什么原理?”
经典算法(5)杨辉三角
杨辉三角 是经典算法,这篇博客对它的算法思想进行了讲解,并有完整的代码实现。
腾讯算法面试题:64匹马8个跑道需要多少轮才能选出最快的四匹?
昨天,有网友私信我,说去阿里面试,彻底的被打击到了。问了为什么网上大量使用ThreadLocal的源码都会加上private static?他被难住了,因为他从来都没有考虑过这个问题。无独有偶,今天笔者又发现有网友吐槽了一道腾讯的面试题,我们一起来看看。 腾讯算法面试题:64匹马8个跑道需要多少轮才能选出最快的四匹? 在互联网职场论坛,一名程序员发帖求助到。二面腾讯,其中一个算法题:64匹...
面试官:你连RESTful都不知道我怎么敢要你?
干货,2019 RESTful最贱实践
SQL-小白最佳入门sql查询一
不要偷偷的查询我的个人资料,即使你再喜欢我,也不要这样,真的不好;
项目中的if else太多了,该怎么重构?
介绍 最近跟着公司的大佬开发了一款IM系统,类似QQ和微信哈,就是聊天软件。我们有一部分业务逻辑是这样的 if (msgType = "文本") { // dosomething } else if(msgType = "图片") { // doshomething } else if(msgType = "视频") { // doshomething } else { // doshom...
漫话:什么是平衡(AVL)树?这应该是把AVL树讲的最好的文章了
这篇文章通过对话的形式,由浅入深带你读懂 AVL 树,看完让你保证理解 AVL 树的各种操作,如果觉得不错,别吝啬你的赞哦。 1、若它的左子树不为空,则左子树上所有的节点值都小于它的根节点值。 2、若它的右子树不为空,则右子树上所有的节点值均大于它的根节点值。 3、它的左右子树也分别可以充当为二叉查找树。 例如: 例如,我现在想要查找数值为14的节点。由于二叉查找树的特性,我们可...
“狗屁不通文章生成器”登顶GitHub热榜,分分钟写出万字形式主义大作
一、垃圾文字生成器介绍 最近在浏览GitHub的时候,发现了这样一个骨骼清奇的雷人项目,而且热度还特别高。 项目中文名:狗屁不通文章生成器 项目英文名:BullshitGenerator 根据作者的介绍,他是偶尔需要一些中文文字用于GUI开发时测试文本渲染,因此开发了这个废话生成器。但由于生成的废话实在是太过富于哲理,所以最近已经被小伙伴们给玩坏了。 他的文风可能是这样的: 你发现,...
程序员:我终于知道post和get的区别
是一个老生常谈的话题,然而随着不断的学习,对于以前的认识有很多误区,所以还是需要不断地总结的,学而时习之,不亦说乎
《程序人生》系列-这个程序员只用了20行代码就拿了冠军
你知道的越多,你不知道的越多 点赞再看,养成习惯GitHub上已经开源https://github.com/JavaFamily,有一线大厂面试点脑图,欢迎Star和完善 前言 这一期不算《吊打面试官》系列的,所有没前言我直接开始。 絮叨 本来应该是没有这期的,看过我上期的小伙伴应该是知道的嘛,双十一比较忙嘛,要值班又要去帮忙拍摄年会的视频素材,还得搞个程序员一天的Vlog,还要写BU...
开源并不是你认为的那些事
点击上方蓝字 关注我们开源之道导读所以 ————想要理清开源是什么?先要厘清开源不是什么,名正言顺是句中国的古代成语,概念本身的理解非常之重要。大部分生物多样性的起源,...
加快推动区块链技术和产业创新发展,2019可信区块链峰会在京召开
11月8日,由中国信息通信研究院、中国通信标准化协会、中国互联网协会、可信区块链推进计划联合主办,科技行者协办的2019可信区块链峰会将在北京悠唐皇冠假日酒店开幕。   区块链技术被认为是继蒸汽机、电力、互联网之后,下一代颠覆性的核心技术。如果说蒸汽机释放了人类的生产力,电力解决了人类基本的生活需求,互联网彻底改变了信息传递的方式,区块链作为构造信任的技术有重要的价值。   1...
程序员把地府后台管理系统做出来了,还有3.0版本!12月7号最新消息:已在开发中有github地址
第一幕:缘起 听说阎王爷要做个生死簿后台管理系统,我们派去了一个程序员…… 996程序员做的梦: 第一场:团队招募 为了应对地府管理危机,阎王打算找“人”开发一套地府后台管理系统,于是就在地府总经办群中发了项目需求。 话说还是中国电信的信号好,地府都是满格,哈哈!!! 经常会有外行朋友问:看某网站做的不错,功能也简单,你帮忙做一下? 而这次,面对这样的需求,这个程序员...
网易云6亿用户音乐推荐算法
网易云音乐是音乐爱好者的集聚地,云音乐推荐系统致力于通过 AI 算法的落地,实现用户千人千面的个性化推荐,为用户带来不一样的听歌体验。 本次分享重点介绍 AI 算法在音乐推荐中的应用实践,以及在算法落地过程中遇到的挑战和解决方案。 将从如下两个部分展开: AI算法在音乐推荐中的应用 音乐场景下的 AI 思考 从 2013 年 4 月正式上线至今,网易云音乐平台持续提供着:乐屏社区、UGC...
【技巧总结】位运算装逼指南
位算法的效率有多快我就不说,不信你可以去用 10 亿个数据模拟一下,今天给大家讲一讲位运算的一些经典例子。不过,最重要的不是看懂了这些例子就好,而是要在以后多去运用位运算这些技巧,当然,采用位运算,也是可以装逼的,不信,你往下看。我会从最简单的讲起,一道比一道难度递增,不过居然是讲技巧,那么也不会太难,相信你分分钟看懂。 判断奇偶数 判断一个数是基于还是偶数,相信很多人都做过,一般的做法的代码如下...
《C++ Primer》学习笔记(六):C++模块设计——函数
专栏C++学习笔记 《C++ Primer》学习笔记/习题答案 总目录 https://blog.csdn.net/TeFuirnever/article/details/100700212 —————————————————————————————————————————————————————— 《C++ Primer》习题参考答案:第6章 - C++模块设计——函数 文章目录专栏C+...
8年经验面试官详解 Java 面试秘诀
作者 |胡书敏 责编 | 刘静 出品 | CSDN(ID:CSDNnews) 本人目前在一家知名外企担任架构师,而且最近八年来,在多家外企和互联网公司担任Java技术面试官,前后累计面试了有两三百位候选人。在本文里,就将结合本人的面试经验,针对Java初学者、Java初级开发和Java开发,给出若干准备简历和准备面试的建议。 Java程序员准备和投递简历的实...
面试官如何考察你的思维方式?
1.两种思维方式在求职面试中,经常会考察这种问题:北京有多少量特斯拉汽车?某胡同口的煎饼摊一年能卖出多少个煎饼?深圳有多少个产品经理?一辆公交车里能装下多少个乒乓球?一个正常成年人有多少根头发?这类估算问题,被称为费米问题,是以科学家费米命名的。为什么面试会问这种问题呢?这类问题能把两类人清楚地区分出来。一类是具有文科思维的人,擅长赞叹和模糊想象,它主要依靠的是人的第一反应和直觉,比如小孩...
so easy! 10行代码写个"狗屁不通"文章生成器
前几天,GitHub 有个开源项目特别火,只要输入标题就可以生成一篇长长的文章。 背后实现代码一定很复杂吧,里面一定有很多高深莫测的机器学习等复杂算法 不过,当我看了源代码之后 这程序不到50行 尽管我有多年的Python经验,但我竟然一时也没有看懂 当然啦,原作者也说了,这个代码也是在无聊中诞生的,平时撸码是不写中文变量名的, 中文...
知乎高赞:中国有什么拿得出手的开源软件产品?(整理自本人原创回答)
知乎高赞:中国有什么拿得出手的开源软件产品? 在知乎上,有个问题问“中国有什么拿得出手的开源软件产品(在 GitHub 等社区受欢迎度较好的)?” 事实上,还不少呢~ 本人于2019.7.6进行了较为全面的回答,对这些受欢迎的 Github 开源项目分类整理如下: 分布式计算、云平台相关工具类 1.SkyWalking,作者吴晟、刘浩杨 等等 仓库地址: apache/skywalking 更...
相关热词 c# clr dll c# 如何orm c# 固定大小的字符数组 c#框架设计 c# 删除数据库 c# 中文文字 图片转 c# 成员属性 接口 c#如何将程序封装 16进制负数转换 c# c#练手项目
立即提问

相似问题

1
在Autoware 中编译yolo3节点时,发生darknet: ./src/cuda.c:36: check_error: Assertio `0' failed.
2
IDEA运行报错:Error:Internal error: (java.net.MalformedURLException) unknown protocol:
2
VS2008参数转换错误error C2664: ?
2
Android Studio新建工程出现问题 1: Error: 前言中不允许有内容。
1
Error:Failed to resolve: support-media-compat
1
Mysql建表显示错误,Error : You have an error in your SQL syntax;(急!!!)
2
FileZilla连接服务器出错:network error: software caused connection abort
2
idea 写flutter app,重启电脑后项目便宜报错Error:Android Dex: [my_app] Unable to execute DX
0
谁能帮忙看一下OpenCV 3.4.1源码的类型转换编译错误?
1
pytorch将tensor放到GPU上出错,RuntimeError: CUDA error: unknown error怎么回事?
1
RTCPInstance::RTCPInstance error: totSessionBW parameter should not be zero!
3
树莓派编译opencv出现Genetating error: constant l_MAGIC_VAL(cname=cv::l::MAGIC_VAL)already exists
2
运行Java程序时报错Error:(3001, 19) java: ncCommonSvc.AsyncClient.microprobe_call不是抽象的
3
提示错误Error:(37, 35) java: 不兼容的类型求大佬解答
3
改了一个指针就出现了cpp(49) : error C2146: syntax error : missing ';' before identifier 'malloc'的报错,?
2
Error:(68, 39) java: 不兼容的类型: com.easy.demo.entity.User无法转换为int
1
Android Struidio报错 ERROR: Cause: unable to find valid certification path to requested target
1
sql server Error: 18056, Severity: 20, State: 51.
4
idea改成eclipse编译报错Error:java: Internal error:
0
[Helm] Error: release **** failed: the server could not find the requested resource