gradle 打包spring-boot项目(apply plugin: 'spring-boot')怎么打包依赖包不需要main函数 5C

gradle 打包spring-boot项目(apply plugin: 'spring-boot')怎么打包依赖包不需要main函数

 apply plugin: 'java'
  apply plugin: 'eclipse'
  apply plugin: 'spring-boot'

打包报错

 Unable to find main class

打的包是工具包之类的东西。然后另一个包依赖它

1个回答

qq_15396517
Victor枫 不是打war包,是jar包,工具包之类的依赖包。提供给另一个工程用
4 个月之前 回复
Csdn user default icon
上传中...
上传图片
插入图片
抄袭、复制答案,以达到刷声望分或其他目的的行为,在CSDN问答是严格禁止的,一经发现立刻封号。是时候展现真正的技术了!
其他相关推荐
在IDEA导入Gradle项目之后一直报错
代码用的Spring Boot+ MyBatis 导入后一直报如下错误 ``` Could not find org.springframework.boot:spring-boot-gradle-plugin:1.5.7.RELEASE. Searched in the following locations: http://maven.aliyun.com/nexus/content/groups/public/org/springframework/boot/spring-boot-gradle-plugin/1.5.7.RELEASE/spring-boot-gradle-plugin-1.5.7.RELEASE.pom http://maven.aliyun.com/nexus/content/groups/public/org/springframework/boot/spring-boot-gradle-plugin/1.5.7.RELEASE/spring-boot-gradle-plugin-1.5.7.RELEASE.jar Required by: project : ``` Gradle相关配置如下 ``` apply plugin: 'java' apply plugin: 'eclipse-wtp' apply plugin: 'org.springframework.boot' if (!DEVELOP_MODE.toBoolean()) { apply plugin: 'war' } group = 'com.server' version = '0.0.1-SNAPSHOT' sourceCompatibility = 1.8 repositories { maven { url 'http://maven.aliyun.com/nexus/content/groups/public/' } } configurations { providedRuntime } dependencies { compile('org.springframework.boot:spring-boot-starter-aop') compile('org.springframework.boot:spring-boot-starter-data-jpa') compile('org.springframework.boot:spring-boot-starter-jdbc') compile('org.springframework.boot:spring-boot-starter-web') compile('org.mybatis.spring.boot:mybatis-spring-boot-starter:1.3.1') compile "org.springframework.boot:spring-boot-starter-thymeleaf" runtime('mysql:mysql-connector-java') if (!DEVELOP_MODE.toBoolean()) { providedRuntime('org.springframework.boot:spring-boot-starter-tomcat') } testCompile('org.springframework.boot:spring-boot-starter-test') } ```
关于 spring boot 用gradle打包 war后运行的问题
打包以后 出现错误 ``` 2-Jul-2019 16:00:10.516 严重 [localhost-startStop-1] org.apache.catalina.core.StandardContext.startInternal Error during ServletContainerInitializer processing javax.servlet.ServletException: Failed to instantiate WebApplicationInitializer class at org.springframework.web.SpringServletContainerInitializer.onStartup(SpringServletContainerInitializer.java:155) at org.apache.catalina.core.StandardContext.startInternal(StandardContext.java:5267) at org.apache.catalina.util.LifecycleBase.start(LifecycleBase.java:150) at org.apache.catalina.core.ContainerBase.addChildInternal(ContainerBase.java:754) at org.apache.catalina.core.ContainerBase.addChild(ContainerBase.java:730) at org.apache.catalina.core.StandardHost.addChild(StandardHost.java:734) at org.apache.catalina.startup.HostConfig.deployDirectory(HostConfig.java:1140) at org.apache.catalina.startup.HostConfig$DeployDirectory.run(HostConfig.java:1875) at java.util.concurrent.Executors$RunnableAdapter.call(Unknown Source) at java.util.concurrent.FutureTask.run(Unknown Source) at java.util.concurrent.ThreadPoolExecutor.runWorker(Unknown Source) at java.util.concurrent.ThreadPoolExecutor$Worker.run(Unknown Source) at java.lang.Thread.run(Unknown Source) Caused by: java.lang.InstantiationException: io.j99.app.measure.Application at java.lang.Class.newInstance(Unknown Source) at org.springframework.web.SpringServletContainerInitializer.onStartup(SpringServletContainerInitializer.java:152) ... 12 more Caused by: java.lang.NoSuchMethodException: io.j99.app.measure.Application.<init>() at java.lang.Class.getConstructor0(Unknown Source) ... 14 more 02-Jul-2019 16:00:10.516 严重 [localhost-startStop-1] org.apache.catalina.core.StandardContext.startInternal Context [/measure-0.0.1] startup failed due to previous errors 02-Jul-2019 16:00:10.562 警告 [localhost-startStop-1] org.apache.catalina.loader.WebappClassLoaderBase.clearReferencesThreads The web application [measure-0.0.1] appears to have started a thread named [Abandoned connection cleanup thread] but has failed to stop it. This is very likely to create a memory leak. Stack trace of thread: 02-Jul-2019 16:00:10.562 信息 [localhost-startStop-1] org.apache.catalina.startup.HostConfig.deployDirectory Deployment of web application directory [D:\Program Files\Apache Software Foundation\Tomcat 8.5\webapps\measure-0.0.1] has finished in [5,484] ms 02-Jul-2019 16:00:10.562 信息 [localhost-startStop-1] org.apache.catalina.startup.HostConfig.deployDirectory Deploying web application directory [D:\Program Files\Apache Software Foundation\Tomcat 8.5\webapps\ROOT] 02-Jul-2019 16:00:10.734 信息 [36] org.apache.catalina.loader.WebappClassLoaderBase.checkStateForResourceLoading Illegal access: this web application instance has been stopped already. Could not load []. The following stack trace is thrown for debugging purposes as well as to attempt to terminate the thread which caused the illegal access. java.lang.IllegalStateException: Illegal access: this web application instance has been stopped already. Could not load []. The following stack trace is thrown for debugging purposes as well as to attempt to terminate the thread which caused the illegal access. at org.apache.catalina.loader.WebappClassLoaderBase.checkStateForResourceLoading(WebappClassLoaderBase.java:1364) at org.apache.catalina.loader.WebappClassLoaderBase.getResource(WebappClassLoaderBase.java:1021) at com.mysql.cj.jdbc.AbandonedConnectionCleanupThread.checkContextClassLoaders(AbandonedConnectionCleanupThread.java:96) at com.mysql.cj.jdbc.AbandonedConnectionCleanupThread.run(AbandonedConnectionCleanupThread.java:69) at java.util.concurrent.ThreadPoolExecutor.runWorker(Unknown Source) at java.util.concurrent.ThreadPoolExecutor$Worker.run(Unknown Source) at java.lang.Thread.run(Unknown Source) ``` ``` apply plugin: 'java' apply plugin: 'org.springframework.boot' //apply plugin: 'spring-boot' //apply plugin: 'watch' apply plugin: 'war' war { baseName = 'measure' version = '0.0.1' } /*apply plugin: 'idea' idea { module { inheritOutputDirs = false outputDir = file("$buildDir/classes/main/") } }*/ repositories { maven { url "http://maven.aliyun.com/nexus/content/repositories/public/" } maven { url "http://repo.spring.io/libs-snapshot" } } tasks.withType(JavaCompile) { options.encoding = 'UTF-8' } sourceCompatibility = 1.8 targetCompatibility = 1.8 springBoot { executable = true } configurations { // providedRuntime dev } /*jar { mainClass = "io.j99.app.measure.Application" }*/ dependencies { compile("commons-logging:commons-logging:1.2") compile("javax.servlet:javax.servlet-api:4.0.1") // compile group: 'org.apache.tomcat.embed', name: 'tomcat-embed-jasper', version: '9.0.8' compile("org.springframework.boot:spring-boot-devtools") // compile group: 'org.springframework.boot', name: 'spring-boot-dependencies', version: '2.2.0.M4' compile group: 'org.springframework.boot', name: 'spring-boot-maven-plugin', version: '2.2.0.M4' /// compile ("org.springframework.boot:spring-boot-dependencies") compile ("org.springframework.boot:spring-boot-maven-plugin") /// //// compile group: 'cn.org.faster', name: 'spring-boot-starter-parent', version: '1.1.1.RELEASE' compile ("org.springframework.boot:spring-boot-starter-tomcat") compile ("org.springframework.boot:spring-boot-starter-web") compile ("org.springframework.boot:spring-boot-devtools") // compile "org.springframework.boot:spring-boot-configuration-processor" compile("mysql:mysql-connector-java:8.0.12") /// compile fileTree(dir: 'libs', include: ['*.jar']) // dev("org.springframework.boot:spring-boot-devtools") testCompile("org.springframework.boot:spring-boot-starter-test") compile "io.springfox:springfox-swagger2:2.5.0" compile("org.springframework.session:spring-session") compile("org.simpleframework:simple-xml:2.7") compile("org.springframework.boot:spring-boot-starter-thymeleaf") compile("org.springframework.boot:spring-boot-starter-data-redis") compile("org.springframework.boot:spring-boot-starter-data-rest") compile 'io.jsonwebtoken:jjwt:0.6.0' // compile("org.springframework.boot:spring-boot-starter-data-mongodb") compile("org.springframework.boot:spring-boot-starter-jdbc") compile("org.springframework.boot:spring-boot-starter-data-jpa") compile("org.springframework.boot:spring-boot-starter-actuator") // compile("mysql:mysql-connector-java") compile("com.fasterxml.jackson.datatype:jackson-datatype-jsr310:2.6.0") compile 'com.squareup.retrofit2:retrofit:2.1.0' compile 'com.squareup.retrofit2:converter-jackson:2.1.0' compile 'com.squareup.retrofit2:adapter-rxjava:2.1.0' compile 'com.squareup.okhttp3:logging-interceptor:3.1.2' compile 'com.squareup.okhttp3:okhttp:3.1.2' compile("org.springframework.boot:spring-boot-starter-web") compile('commons-net:commons-net:3.5') compile('com.googlecode.log4jdbc:log4jdbc:1.2') // https://mvnrepository.com/artifact/org.apache.poi/poi compile group: 'org.apache.poi', name: 'poi', version: '3.15' compile group: 'org.apache.poi', name: 'poi-ooxml', version: '3.15' // https://mvnrepository.com/artifact/commons-lang/commons-lang compile group: 'commons-lang', name: 'commons-lang', version: '2.6' compile 'com.qiniu:qiniu-java-sdk:7.2.2' // https://mvnrepository.com/artifact/org.apache.ant/ant compile group: 'org.apache.ant', name: 'ant', version: '1.10.1' } bootRun { // addResources = true classpath = sourceSets.main.runtimeClasspath + configurations.dev } ``` 用gradle打包 war后 放入tomcat运行 报错 不知道是那个jar问题导致的 想问问各位大佬
IDEA导入gradle项目,所以用compile方式引入包都变成了provided
build.gradle文件配置如下: ``` buildscript { ext { springBootVersion = '1.5.2.RELEASE' } repositories { mavenLocal() jcenter() } dependencies { classpath("org.springframework.boot:spring-boot-gradle-plugin:${springBootVersion}") } } version '1.0-SNAPSHOT' apply plugin: 'java' apply plugin: 'idea' apply plugin: 'org.springframework.boot' sourceCompatibility = 1.8 targetCompatibility = 1.8 [javadoc, compileTestJava]*.options*.encoding = 'UTF-8' compileJava { options.encoding = 'UTF-8' options.compilerArgs << "-Xlint:unchecked" << "-Xlint:deprecation" } repositories { mavenLocal() //mavenCentral() jcenter() } configurations { compile.exclude group: 'org.springframework.boot', module: 'spring-boot-starter-tomcat' compile.exclude group: 'org.apache.tomcat' compile.exclude group: 'org.apache.tomcat.embed' all*.exclude module: 'spring-boot-starter-logging' } dependencies { compile('org.springframework.boot:spring-boot-starter-jersey') //compile('org.springframework.boot:spring-boot-starter-actuator') compile('org.springframework.boot:spring-boot-starter-undertow') compile('org.springframework.boot:spring-boot-starter-log4j2') compile('org.mybatis.spring.boot:mybatis-spring-boot-starter:1.1.1') // mybatis support // use swagger2 for api documentation compile('io.swagger:swagger-jersey2-jaxrs:1.5.10') compile('org.apache.commons:commons-lang3:3.4') compile('commons-codec:commons-codec:1.10') runtime('com.alibaba:druid:1.0.27') // alibaba datasource runtime('mysql:mysql-connector-java') // mysql jdbc driver runtime('org.apache.logging.log4j:log4j-jul:2.7') // log4j jul bridge(for java.util.logging.Logger) testCompile('org.springframework.boot:spring-boot-starter-test') testCompile('org.glassfish.jersey.connectors:jersey-apache-connector:2.25.1') // support jersey client using apache http client } idea { module { downloadJavadoc = false downloadSources = true } } ``` IDEA导入项目后的包变成了provided ![图片说明](https://img-ask.csdn.net/upload/201706/23/1498193445_262832.png)
gradle 使用 apply plugin: "net.ltgt.apt-idea" 插件, 导致 lombok 失效, 这是什么原因?
// apply plugin: "net.ltgt.apt-idea" 把这个注释掉, 就可以正常运行, 是因为该apt导致lombok 的注解处理器无法使用吗? 有什么解决的办法, 谢谢
kotlin配置dagger2报错':app:kaptAnzhiDebugKotlin
现在我是这样配置的: build.gradle: apply plugin: 'kotlin-android' apply plugin: 'kotlin-kapt' apply plugin: 'kotlin-android-extensions' android{ ····· } dependencies { compile 'com.google.dagger:dagger:2.5' kapt 'com.google.dagger:dagger-compiler:2.5' provided 'org.glassfish:javax.annotation:10.0-b28' } 之前项目是用java开发的,目前想融入kotlin,结果就出现了这种问题?不知道有没有哪位道友遇到过这种问题?该怎么解决呢?
执行gradle build一直报错
一直报错 multi-project-build:core:unspecified 跟项目配置文件: build.gradle subprojects { apply plugin: 'java' apply plugin: 'eclipse' repositories { mavenCentral() } } settings.gradle include 'app' include 'core' 子项目app的: apply plugin: 'application' dependencies { compile 'log4j:log4j:1.2.17' compile project(':core') } mainClassName = 'net.petrikainulainen.gradle.client.HelloWorld' task copyLicense { outputs.file new File("$buildDir/LICENSE") doLast { copy { from "LICENSE" into "$buildDir" } } } applicationDistribution.from(copyLicense) { into "" } 子项目core的: repositories { mavenCentral() } dependencies { compile("org.springframework.boot:spring-boot-starter-jdbc") testCompile 'junit:junit:4.11' }
idea构建Spring源码环境import项目时报错
Gradle project 选择第三个Use local gradle distribution时报错 Plugin [id: 'io.spring.dependency-management', version: '1.0.5.RELEASE', apply: false] was not found in any of the following sources: - Gradle Core Plugins (plugin is not in 'org.gradle' namespace) - Plugin Repositories (could not resolve plugin artifact 'io.spring.dependency-management:io.spring.dependency-management.gradle.plugin:1.0.5.RELEASE') Searched in the following repositories: Gradle Central Plugin Repository Consult IDE log for more details (Help | Show Log) 求大神解答
xutil3修改maven-gradle-plugin:1.3找不到怎么解决?
![图片说明](https://img-ask.csdn.net/upload/201604/06/1459947573_199619.png) 当使用的Gradle版本是2.4及以上,Android插件版本是1.3.0及以上的时候就会出现这个问题,这时候你只需将android-maven-gradle-plugin插件版本改为classpath ‘com.github.dcendents:android-maven-gradle-plugin:1.3’即可。 注意:有的童鞋偷懒只修改了版本号1.3,改成1.3会报错的,提示找不到1.3的版本。。,这样是不可以滴,因为地址也变了....当然找不到了。所以童鞋们继续重新修改吧....、 我就是只是把版本修改为1.3出现了找不到的问题搜了很多都不知道怎么解决,哪位师兄遇到过这种问题帮忙解答一下,非常感谢。
Spring Boot启动报错ERROR 3644 --- [ main] o.s.b.d.LoggingFailureAnalysisReporter :
##报错类型: ###Field xxxDao in xxxServiceImpl required a bean of type xxx that could not be found. 详细情况如下: ```java . ____ _ __ _ _ /\\ / ___'_ __ _ _(_)_ __ __ _ \ \ \ \ ( ( )\___ | '_ | '_| | '_ \/ _` | \ \ \ \ \\/ ___)| |_)| | | | | || (_| | ) ) ) ) ' |____| .__|_| |_|_| |_\__, | / / / / =========|_|==============|___/=/_/_/_/ :: Spring Boot :: (v2.0.2.RELEASE) 2019-07-19 10:45:06.433 INFO 3644 --- [ main] com.meituan.hotel.Application : Starting Application on LAPTOP-2N82SD03 with PID 3644 (E:\CodeCache\IDEA\Webmagic\meituan-crawler-hotel\target\classes started by 三寸旧城七寸执念 in E:\CodeCache\IDEA\Webmagic\meituan-crawler-hotel) 2019-07-19 10:45:06.435 INFO 3644 --- [ main] com.meituan.hotel.Application : No active profile set, falling back to default profiles: default 2019-07-19 10:45:06.472 INFO 3644 --- [ main] ConfigServletWebServerApplicationContext : Refreshing org.springframework.boot.web.servlet.context.AnnotationConfigServletWebServerApplicationContext@197d671: startup date [Fri Jul 19 10:45:06 CST 2019]; root of context hierarchy 2019-07-19 10:45:07.211 INFO 3644 --- [ main] o.s.b.w.embedded.tomcat.TomcatWebServer : Tomcat initialized with port(s): 8080 (http) 2019-07-19 10:45:07.229 INFO 3644 --- [ main] o.apache.catalina.core.StandardService : Starting service [Tomcat] 2019-07-19 10:45:07.229 INFO 3644 --- [ main] org.apache.catalina.core.StandardEngine : Starting Servlet Engine: Apache Tomcat/8.5.31 2019-07-19 10:45:07.232 INFO 3644 --- [ost-startStop-1] o.a.catalina.core.AprLifecycleListener : Loaded APR based Apache Tomcat Native library [1.2.21] using APR version [1.6.5]. 2019-07-19 10:45:07.232 INFO 3644 --- [ost-startStop-1] o.a.catalina.core.AprLifecycleListener : APR capabilities: IPv6 [true], sendfile [true], accept filters [false], random [true]. 2019-07-19 10:45:07.232 INFO 3644 --- [ost-startStop-1] o.a.catalina.core.AprLifecycleListener : APR/OpenSSL configuration: useAprConnector [false], useOpenSSL [true] 2019-07-19 10:45:07.235 INFO 3644 --- [ost-startStop-1] o.a.catalina.core.AprLifecycleListener : OpenSSL successfully initialized [OpenSSL 1.1.1a 20 Nov 2018] 2019-07-19 10:45:07.351 INFO 3644 --- [ost-startStop-1] o.a.c.c.C.[Tomcat].[localhost].[/] : Initializing Spring embedded WebApplicationContext 2019-07-19 10:45:07.351 INFO 3644 --- [ost-startStop-1] o.s.web.context.ContextLoader : Root WebApplicationContext: initialization completed in 882 ms 2019-07-19 10:45:07.459 INFO 3644 --- [ost-startStop-1] o.s.b.w.servlet.ServletRegistrationBean : Servlet dispatcherServlet mapped to [/] 2019-07-19 10:45:07.462 INFO 3644 --- [ost-startStop-1] o.s.b.w.servlet.FilterRegistrationBean : Mapping filter: 'characterEncodingFilter' to: [/*] 2019-07-19 10:45:07.462 INFO 3644 --- [ost-startStop-1] o.s.b.w.servlet.FilterRegistrationBean : Mapping filter: 'hiddenHttpMethodFilter' to: [/*] 2019-07-19 10:45:07.462 INFO 3644 --- [ost-startStop-1] o.s.b.w.servlet.FilterRegistrationBean : Mapping filter: 'httpPutFormContentFilter' to: [/*] 2019-07-19 10:45:07.462 INFO 3644 --- [ost-startStop-1] o.s.b.w.servlet.FilterRegistrationBean : Mapping filter: 'requestContextFilter' to: [/*] 2019-07-19 10:45:07.490 WARN 3644 --- [ main] ConfigServletWebServerApplicationContext : Exception encountered during context initialization - cancelling refresh attempt: org.springframework.beans.factory.UnsatisfiedDependencyException: Error creating bean with name 'hotelInfoServiceImpl': Unsatisfied dependency expressed through field 'hotelInfoDao'; nested exception is org.springframework.beans.factory.NoSuchBeanDefinitionException: No qualifying bean of type 'com.meituan.hotel.Dao.HotelInfoDao' available: expected at least 1 bean which qualifies as autowire candidate. Dependency annotations: {@org.springframework.beans.factory.annotation.Autowired(required=true)} 2019-07-19 10:45:07.492 INFO 3644 --- [ main] o.apache.catalina.core.StandardService : Stopping service [Tomcat] 2019-07-19 10:45:07.504 INFO 3644 --- [ main] ConditionEvaluationReportLoggingListener : Error starting ApplicationContext. To display the conditions report re-run your application with 'debug' enabled. 2019-07-19 10:45:07.573 ERROR 3644 --- [ main] o.s.b.d.LoggingFailureAnalysisReporter : *************************** APPLICATION FAILED TO START *************************** Description: Field hotelInfoDao in com.meituan.hotel.Service.impl.HotelInfoServiceImpl required a bean of type 'com.meituan.hotel.Dao.HotelInfoDao' that could not be found. Action: Consider defining a bean of type 'com.meituan.hotel.Dao.HotelInfoDao' in your configuration. Process finished with exit code 1 ``` ### 最近网项目里面加了个模块,模块是基于gradle的工程,我本身的工程是基于maven的,没有导成功,我就把那个模块删除掉了,但是运行就出问题了,网上搜了很多,但是我的注解都加了,而且目录结构也没有问题,Application.class也的确在包的最外层。 ## 希望有大佬帮忙解答一下
Gradle构建web项目问题
1.使用的Eclipse,新建一个web程序,然后转换成Gradle项目 build.gradle配置如下 ``` apply plugin:'war' apply plugin:'eclipse-wtp' repositories{ maven{ url 'http://maven.aliyun.com/nexus/content/groups/public/' } } dependencies{ compile group: 'org.apache.struts', name: 'struts2-core', version: '2.3.24' compile group: 'org.apache.logging.log4j', name: 'log4j-core', version: '2.2' } ``` 2.我在WebContext下添加了一个jsp页面 3.tomcat发布的时候,在tomcat下只有WEB-INF这么一个文件夹,jsp没有发布过去 4.百度上看了也没解决办法
spring boot中找不到jsp
查了一天了也没查到问题,我配置了mvc的前缀和后缀,可就是返回不了jsp,是打的war包有问题吗, 还是缺少什么web的包,它只会报Circular view path [/main]: would dispatch back to the current handler URL [/main] again. Check your ViewResolver setup! (Hint: This may be the result of an unspecified view, due to default view name generation.),实在是查不到怎么解决了,照着springboot的官方web例子改也不行,直接返回了字符串而不是jsp页面,真心求各位帮帮忙。 yml配置文件里的源码 ``` mvc: view: prefix: /WEB-INF/jsp/ suffix: .jsp ``` gradle的依赖包引入 ``` compile 'org.springframework.boot:spring-boot-starter-data-jpa' compile 'org.springframework.boot:spring-boot-starter-freemarker' compile 'org.springframework.boot:spring-boot-starter-groovy-templates' compile 'org.springframework.boot:spring-boot-starter-jdbc' compile 'com.h2database:h2:1.4.190' compile 'com.alibaba:fastjson:1.2.7' compile 'com.google.guava:guava:18.0' compile 'org.springframework.boot:spring-boot-starter-redis' compile 'org.springframework.boot:spring-boot-starter-web' // compile 'org.springframework.boot:spring-boot-starter-jetty' compile 'org.springframework.boot:spring-boot-starter-tomcat' compile 'org.apache.tomcat.embed:tomcat-embed-jasper' compile 'javax.servlet:jstl' compile 'org.apache.directory.studio:org.apache.commons.lang:2.6' compile 'commons-io:commons-io:2.4' compile 'mysql:mysql-connector-java' testCompile 'org.springframework.boot:spring-boot-starter-test' compile 'org.springframework.boot:spring-boot-starter-data-rest' compile 'org.springframework.boot:spring-boot-configuration-processor' compile 'com.googlecode.xmemcached:xmemcached:2.0.0' ``` controller ``` @RequestMapping("/main") public ModelAndView welcome1() { logger.error("111111111111111") return new ModelAndView("/main") } ``` 日志能打出来,但是这个main.jsp找不到 war包的目录结构 ![图片说明](https://img-ask.csdn.net/upload/201604/27/1461742939_597620.png) 又去查了一下,视频和例子都在说引入 compile 'org.springframework.boot:spring-boot-starter-tomcat' compile 'org.apache.tomcat.embed:tomcat-embed-jasper' 两个依赖后,注释为@Controller,直接return字符串类型的jsp名就可以 可就是还是不行,ViewResolver好像没有设置
Android Stadio2.0 gradle
Android Stadio 项目运行时 gradle 出错了,错误如下: :app:prepareComAndroidSupportAppcompatV72340Library UP-TO-DATE Information:Gradle tasks [:app:generateDebugSources, :app:mockableAndr oidJar, :app:prepareDebugUnitTestDependencies, :app:generateDebugAnd roidTestSources] :app:checkDebugManifest :app:generateDebugAssets UP-TO-DATE :app:mergeDebugResources :app:preDebugBuild UP-TO-DATE :app:mergeDebugAssets UP-TO-DATE :app:generateDebugResources UP-TO-DATE :app:compileDebugAidl UP-TO-DATE :app:prepareComAndroidSupportSupportVectorDrawable2340Library UP-TO-DATE :app:preReleaseBuild UP-TO-DATE :app:generateDebugBuildConfig UP-TO-DATE :app:prepareComAndroidSupportAnimatedVectorDrawable2340Library UP-TO-DATE :app:prepareDebugDependencies :app:compileDebugRenderscript UP-TO-DATE :app:preBuild UP-TO-DATE :app:generateDebugResValues UP-TO-DATE :app:prepareComAndroidSupportRecyclerviewV72340Library UP-TO-DATE :app:prepareComAndroidSupportSupportV42340Library UP-TO-DATE :app:prepareComAndroidSupportDesign2340Library UP-TO-DATE :app:mergeDebugResources FAILED Information:BUILD FAILED Information:Total time: 3.758 secs Information:2 errors Information:0 warnings Information:See complete output in console 求大神指教,谢谢!
hadoop简单问题,如何在spring boot中,同时使用这4个jar,能够正常运行
dependencies { compile('org.springframework.boot:spring-boot-starter') compile("org.apache.hadoop:hadoop-common:2.7.3") compile("org.apache.hadoop:hadoop-mapreduce-client-core:2.7.3") compile("org.apache.hadoop:hadoop-hdfs:2.7.3") } 或者这样也行 dependencies { compile('org.springframework.boot:spring-boot-starter') compile 'org.springframework.data:spring-data-hadoop:2.5.0.RELEASE' } 我就是想在spring boot中连接hadoop的hdfs而已,为啥要这样折磨我,请各位大神可以的话新建一个基本的spring boot项目,然后添加一下以上的关于hadoop的包,然后试着运行一下,我已经哭了
JAVA 给JVM 注册CA证书之后 仍然出现证书不信任问题。
1.项目基于mavn 的 或者是gradle的 然后下载仓库配成https 发现证书不信任。 2.网上搜索 下载了CA 证书 并配置到了JVM里面 但是 仍然出这个问题 3.现在 怀疑是 JVM 运行的时候 没有趣找那些 配置进去的证书 走的是空 或者是默认。 有没有大佬解下惑。 org.gradle.api.ProjectConfigurationException: A problem occurred configuring root project 'ocr'. at org.gradle.configuration.project.LifecycleProjectEvaluator.wrapException(LifecycleProjectEvaluator.java:80) ... Caused by: org.gradle.api.internal.artifacts.ivyservice.DefaultLenientConfiguration$ArtifactResolveException: Could not resolve all artifacts for configuration ':classpath'. at org.gradle.api.internal.artifacts.configurations.DefaultConfiguration.rethrowFailure(DefaultConfiguration.java:1258) at org.gradle.configuration.project.ConfigureActionsProjectEvaluator.evaluate(ConfigureActionsProjectEvaluator.java:35) at org.gradle.configuration.project.LifecycleProjectEvaluator$EvaluateProject$1.run(LifecycleProjectEvaluator.java:107) ... 110 more Caused by: org.gradle.internal.resolve.ModuleVersionResolveException: Could not resolve org.springframework.boot:spring-boot-gradle-plugin:2.2.0.RELEASE. Required by: project : > org.springframework.boot:org.springframework.boot.gradle.plugin:2.2.0.RELEASE Caused by: org.gradle.internal.resolve.ModuleVersionResolveException: Could not resolve org.springframework.boot:spring-boot-gradle-plugin:2.2.0.RELEASE. Caused by: org.gradle.api.resources.ResourceException: Could not get resource 'https://plugins.gradle.org/m2/org/springframework/boot/spring-boot-gradle-plugin/2.2.0.RELEASE/spring-boot-gradle-plugin-2.2.0.RELEASE.pom'. at org.gradle.internal.resource.ResourceExceptions.failure(ResourceExceptions.java:74) Caused by: sun.security.validator.ValidatorException: PKIX path building failed: sun.security.provider.certpath.SunCertPathBuilderException: unable to find valid certification path to requested target at java.base/sun.security.validator.PKIXValidator.doBuild(PKIXValidator.java:385) at java.base/sun.security.validator.PKIXValidator.engineValidate(PKIXValidator.java:290) at java.base/sun.security.validator.Validator.validate(Validator.java:264) at java.base/sun.security.ssl.X509TrustManagerImpl.validate(X509TrustManagerImpl.java:313) at java.base/sun.security.ssl.X509TrustManagerImpl.checkTrusted(X509TrustManagerImpl.java:222) at java.base/sun.security.ssl.X509TrustManagerImpl.checkServerTrusted(X509TrustManagerImpl.java:129) at java.base/sun.security.ssl.CertificateMessage$T12CertificateConsumer.checkServerCerts(CertificateMessage.java:626) ... 241 more Caused by: sun.security.provider.certpath.SunCertPathBuilderException: unable to find valid certification path to requested target at java.base/sun.security.provider.certpath.SunCertPathBuilder.build(SunCertPathBuilder.java:141) at java.base/sun.security.provider.certpath.SunCertPathBuilder.engineBuild(SunCertPathBuilder.java:126) at java.base/java.security.cert.CertPathBuilder.build(CertPathBuilder.java:297) at java.base/sun.security.validator.PKIXValidator.doBuild(PKIXValidator.java:380) ... 247 more
Intellij IDEA + Gradle 搭建Spring源代码,报错,求解决
版本: gradle 4.8.1 JDK 1.8.0\_171 Spring spring-framework-5.0.2.RELEASE 代码已经导入idea了,然后报错如下 ``` Unable to start the daemon process. This problem might be caused by incorrect configuration of the daemon. For example, an unrecognized jvm option is used. Please refer to the user guide chapter on the daemon at https://docs.gradle.org/4.8.1/userguide/gradle_daemon.html Please read the following process output to find out more: ----------------------- 错误: 找不到或无法加载主类 C:\develop\java\jdk1.8.0_171 ```
Android Studio 2.1 gradle 2.10报错
Configuration on demand is an incubating feature. Incremental java compilation is an incubating feature. :app:preBuild UP-TO-DATE :app:preDebugBuild UP-TO-DATE :app:checkDebugManifest :app:preReleaseBuild UP-TO-DATE :app:prepareComAndroidSupportAnimatedVectorDrawable2330Library UP-TO-DATE :app:prepareComAndroidSupportAppcompatV72330Library UP-TO-DATE :app:prepareComAndroidSupportSupportV42330Library UP-TO-DATE :app:prepareComAndroidSupportSupportVectorDrawable2330Library UP-TO-DATE :app:prepareDebugDependencies :app:compileDebugAidl UP-TO-DATE :app:compileDebugRenderscript UP-TO-DATE :app:generateDebugBuildConfig UP-TO-DATE :app:mergeDebugShaders UP-TO-DATE :app:compileDebugShaders UP-TO-DATE :app:generateDebugAssets UP-TO-DATE :app:mergeDebugAssets UP-TO-DATE :app:generateDebugResValues UP-TO-DATE :app:generateDebugResources UP-TO-DATE :app:mergeDebugResources UP-TO-DATE :app:processDebugManifest :app:processDebugResources :app:generateDebugSources :app:preDebugAndroidTestBuild UP-TO-DATE :app:prepareDebugAndroidTestDependencies :app:compileDebugAndroidTestAidl UP-TO-DATE :app:processDebugAndroidTestManifest UP-TO-DATE :app:compileDebugAndroidTestRenderscript UP-TO-DATE :app:generateDebugAndroidTestBuildConfig UP-TO-DATE :app:mergeDebugAndroidTestShaders UP-TO-DATE :app:compileDebugAndroidTestShaders UP-TO-DATE :app:generateDebugAndroidTestAssets UP-TO-DATE :app:mergeDebugAndroidTestAssets UP-TO-DATE :app:generateDebugAndroidTestResValues UP-TO-DATE :app:generateDebugAndroidTestResources UP-TO-DATE :app:mergeDebugAndroidTestResources UP-TO-DATE :app:processDebugAndroidTestResources UP-TO-DATE :app:generateDebugAndroidTestSources UP-TO-DATE :app:mockableAndroidJar UP-TO-DATE :app:preDebugUnitTestBuild UP-TO-DATE 求大神帮帮忙。。。。
app:processDebugResources'.
不知道为什么,在没有编辑“public class SlidingMenu extends HorizontalScrollView”此的代码以前,gradle好没有报错,遍完试运的时候就出现了一下问题 ``` Information:Gradle tasks [:app:assembleDebug] :app:preBuild UP-TO-DATE :app:preDebugBuild UP-TO-DATE :app:checkDebugManifest :app:preReleaseBuild UP-TO-DATE :app:prepareComAndroidSupportAnimatedVectorDrawable2321Library UP-TO-DATE :app:prepareComAndroidSupportAppcompatV72321Library UP-TO-DATE :app:prepareComAndroidSupportSupportV42321Library UP-TO-DATE :app:prepareComAndroidSupportSupportVectorDrawable2321Library UP-TO-DATE :app:prepareDebugDependencies :app:compileDebugAidl :app:compileDebugRenderscript :app:generateDebugBuildConfig UP-TO-DATE :app:generateDebugAssets UP-TO-DATE :app:mergeDebugAssets UP-TO-DATE :app:generateDebugResValues UP-TO-DATE :app:mergeDebugResources :app:generateDebugResources :app:processDebugManifest :app:processDebugResources FAILED Error:Execution failed for task ':app:processDebugResources'. > com.android.ide.common.process.ProcessException: org.gradle.process.internal.ExecException: Process 'command 'D:\java\sd\build-tools\23.0.3\aapt.exe'' finished with non-zero exit value 1 Information:Total time: 17.299 secs Information:BUILD FAILED Information:1 error Information:0 warnings Information:See complete output in console ``` 这是build.gradle文件 ``` apply plugin: 'com.android.application' android { compileSdkVersion 23 buildToolsVersion '23.0.3' defaultConfig { applicationId "com.fj_hooone.studys" minSdkVersion 15 targetSdkVersion 23 versionCode 1 versionName "1.0" } buildTypes { release { minifyEnabled false proguardFiles getDefaultProguardFile('proguard-android.txt'), 'proguard-rules.pro' } } } dependencies { compile fileTree(dir: 'libs', include: ['*.jar']) testCompile 'junit:junit:4.12' compile 'com.android.support:appcompat-v7:23.2.1' } ``` 求解救
新电脑第一次安装Android studio 报错 gradle project
下面是IDEA里的最后一段 ``` 2017-11-22 00:35:54,284 [ thread 14] WARN - ect.sync.idea.ProjectSetUpTask - Failed to find target with hash string 'android-26' in: C:\Users\Lan\AppData\Local\Android\Sdk Consult IDE log for more details (Help | Show Log) 2017-11-22 00:35:54,285 [ thread 14] INFO - e.project.sync.GradleSyncState - Gradle sync failed: Failed to find target with hash string 'android-26' in: C:\Users\Lan\AppData\Local\Android\Sdk Consult IDE log for more details (Help | Show Log) (924ms) 2017-11-22 00:35:54,501 [ thread 18] INFO - #com.jetbrains.cidr.lang - Clearing symbols finished in 0 s. 2017-11-22 00:35:54,524 [ thread 18] INFO - #com.jetbrains.cidr.lang - Loading symbols finished in 0 s. 2017-11-22 00:35:54,529 [ thread 18] INFO - #com.jetbrains.cidr.lang - Building symbols finished in 0 s. 2017-11-22 00:35:54,541 [ thread 18] INFO - #com.jetbrains.cidr.lang - Saving symbols finished in 0 s. 2017-11-22 00:36:14,763 [se-915-b01] INFO - ide.actions.ShowFilePathAction - Exit code 1 ```
reactnative启动报错 app:compileDebugJavaWithJavac
scanning folders for symlinks in E:\SimpleApp\SimpleApp\node_modules (30ms) Starting JS server... Building and installing the app on the device (cd android && gradlew.bat installDebug)... Starting a new Gradle Daemon for this build (subsequent builds will be faster). Incremental java compilation is an incubating feature. :app:preBuild UP-TO-DATE :app:preDebugBuild UP-TO-DATE :app:checkDebugManifest :app:preReleaseBuild UP-TO-DATE :app:prepareComAndroidSupportAppcompatV72301Library UP-TO-DATE :app:prepareComAndroidSupportSupportV42301Library UP-TO-DATE :app:prepareComFacebookFbuiTextlayoutbuilderTextlayoutbuilder100Library UP-TO-DATE :app:prepareComFacebookFrescoDrawee130Library UP-TO-DATE :app:prepareComFacebookFrescoFbcore130Library UP-TO-DATE :app:prepareComFacebookFrescoFresco130Library UP-TO-DATE :app:prepareComFacebookFrescoImagepipeline130Library UP-TO-DATE :app:prepareComFacebookFrescoImagepipelineBase130Library UP-TO-DATE :app:prepareComFacebookFrescoImagepipelineOkhttp3130Library UP-TO-DATE :app:prepareComFacebookReactReactNative0493Library UP-TO-DATE :app:prepareComFacebookSoloaderSoloader010Library UP-TO-DATE :app:prepareOrgWebkitAndroidJscR174650Library UP-TO-DATE :app:prepareDebugDependencies :app:compileDebugAidl UP-TO-DATE :app:compileDebugRenderscript UP-TO-DATE :app:generateDebugBuildConfig UP-TO-DATE :app:mergeDebugShaders UP-TO-DATE :app:compileDebugShaders UP-TO-DATE :app:generateDebugAssets UP-TO-DATE :app:mergeDebugAssets UP-TO-DATE :app:generateDebugResValues UP-TO-DATE :app:generateDebugResources UP-TO-DATE :app:mergeDebugResources UP-TO-DATE :app:bundleDebugJsAndAssets SKIPPED :app:processDebugManifest UP-TO-DATE :app:processDebugResources UP-TO-DATE :app:generateDebugSources UP-TO-DATE :app:incrementalDebugJavaCompilationSafeguard UP-TO-DATE :app:compileDebugJavaWithJavac :app:compileDebugJavaWithJavac - is not incremental (e.g. outputs have changed, no previous execution, etc.). :app:compileDebugJavaWithJavac FAILED FAILURE: Build failed with an exception. * What went wrong: Execution failed for task ':app:compileDebugJavaWithJavac'. > Unexpected lock protocol found in lock file. Expected 3, found 0.
130 个相见恨晚的超实用网站,一次性分享出来
相见恨晚的超实用网站 持续更新中。。。
字节跳动视频编解码面经
三四月份投了字节跳动的实习(图形图像岗位),然后hr打电话过来问了一下会不会opengl,c++,shador,当时只会一点c++,其他两个都不会,也就直接被拒了。 七月初内推了字节跳动的提前批,因为内推没有具体的岗位,hr又打电话问要不要考虑一下图形图像岗,我说实习投过这个岗位不合适,不会opengl和shador,然后hr就说秋招更看重基础。我当时想着能进去就不错了,管他哪个岗呢,就同意了面试...
大学四年自学走来,这些私藏的实用工具/学习网站我贡献出来了
大学四年,看课本是不可能一直看课本的了,对于学习,特别是自学,善于搜索网上的一些资源来辅助,还是非常有必要的,下面我就把这几年私藏的各种资源,网站贡献出来给你们。主要有:电子书搜索、实用工具、在线视频学习网站、非视频学习网站、软件下载、面试/求职必备网站。 注意:文中提到的所有资源,文末我都给你整理好了,你们只管拿去,如果觉得不错,转发、分享就是最大的支持了。 一、PDF搜索网站推荐 对于大部
《奇巧淫技》系列-python!!每天早上八点自动发送天气预报邮件到QQ邮箱
此博客仅为我业余记录文章所用,发布到此,仅供网友阅读参考,如有侵权,请通知我,我会删掉。 补充 有不少读者留言说本文章没有用,因为天气预报直接打开手机就可以收到了,为何要多此一举发送到邮箱呢!!!那我在这里只能说:因为你没用,所以你没用!!! 这里主要介绍的是思路,不是天气预报!不是天气预报!!不是天气预报!!!天气预报只是用于举例。请各位不要再刚了!!! 下面是我会用到的两个场景: 每日下
致 Python 初学者
欢迎来到“Python进阶”专栏!来到这里的每一位同学,应该大致上学习了很多 Python 的基础知识,正在努力成长的过程中。在此期间,一定遇到了很多的困惑,对未来的学习方向感到迷茫。我非常理解你们所面临的处境。我从2007年开始接触 python 这门编程语言,从2009年开始单一使用 python 应对所有的开发工作,直至今天。回顾自己的学习过程,也曾经遇到过无数的困难,也曾经迷茫过、困惑过。开办这个专栏,正是为了帮助像我当年一样困惑的 Python 初学者走出困境、快速成长。希望我的经验能真正帮到你
加快推动区块链技术和产业创新发展,2019可信区块链峰会在京召开
      11月8日,由中国信息通信研究院、中国通信标准化协会、中国互联网协会、可信区块链推进计划联合主办,科技行者协办的2019可信区块链峰会将在北京悠唐皇冠假日酒店开幕。   区块链技术被认为是继蒸汽机、电力、互联网之后,下一代颠覆性的核心技术。如果说蒸汽机释放了人类的生产力,电力解决了人类基本的生活需求,互联网彻底改变了信息传递的方式,区块链作为构造信任的技术有重要的价值。   1
8年经验面试官详解 Java 面试秘诀
    作者 | 胡书敏 责编 | 刘静 出品 | CSDN(ID:CSDNnews) 本人目前在一家知名外企担任架构师,而且最近八年来,在多家外企和互联网公司担任Java技术面试官,前后累计面试了有两三百位候选人。在本文里,就将结合本人的面试经验,针对Java初学者、Java初级开发和Java开发,给出若干准备简历和准备面试的建议。   Java程序员准备和投递简历的实
知乎高赞:中国有什么拿得出手的开源软件产品?(整理自本人原创回答)
知乎高赞:中国有什么拿得出手的开源软件产品? 在知乎上,有个问题问“中国有什么拿得出手的开源软件产品(在 GitHub 等社区受欢迎度较好的)?” 事实上,还不少呢~ 本人于2019.7.6进行了较为全面的 回答 - Bravo Yeung,获得该问题下回答中得最高赞(236赞和1枚专业勋章),对这些受欢迎的 Github 开源项目分类整理如下: 分布式计算、云平台相关工具类 1.SkyWalk
iOS Bug 太多,苹果终于坐不住了!
开源的 Android 和闭源的 iOS,作为用户的你,更偏向哪一个呢? 整理 | 屠敏 出品 | CSDN(ID:CSDNnews) 毋庸置疑,当前移动设备操作系统市场中,Android 和 iOS 作为两大阵营,在相互竞争的同时不断演进。不过一直以来,开源的 Android 吸引了无数的手机厂商涌入其中,为其生态带来了百花齐放的盛景,但和神秘且闭源的 iOS 系统相比,不少网友
究竟你适不适合买Mac?
我清晰的记得,刚买的macbook pro回到家,开机后第一件事情,就是上了淘宝网,花了500元钱,找了一个上门维修电脑的师傅,上门给我装了一个windows系统。。。。。。 表砍我。。。 当时买mac的初衷,只是想要个固态硬盘的笔记本,用来运行一些复杂的扑克软件。而看了当时所有的SSD笔记本后,最终决定,还是买个好(xiong)看(da)的。 已经有好几个朋友问我mba怎么样了,所以今天尽量客观...
为什么你学不过动态规划?告别动态规划,谈谈我的经验
动态规划难吗?说实话,我觉得很难,特别是对于初学者来说,我当时入门动态规划的时候,是看 0-1 背包问题,当时真的是一脸懵逼。后来,我遇到动态规划的题,看的懂答案,但就是自己不会做,不知道怎么下手。就像做递归的题,看的懂答案,但下不了手,关于递归的,我之前也写过一篇套路的文章,如果对递归不大懂的,强烈建议看一看:为什么你学不会递归,告别递归,谈谈我的经验 对于动态规划,春招秋招时好多题都会用到动态...
(经验分享)作为一名普通本科计算机专业学生,我大学四年到底走了多少弯路
今年正式步入了大四,离毕业也只剩半年多的时间,回想一下大学四年,感觉自己走了不少弯路,今天就来分享一下自己大学的学习经历,也希望其他人能不要走我走错的路。 (一)初进校园 刚进入大学的时候自己完全就相信了高中老师的话:“进入大学你们就轻松了”。因此在大一的时候自己学习的激情早就被抛地一干二净,每天不是在寝室里玩游戏就是出门游玩,不过好在自己大学时买的第一台笔记本性能并不是很好,也没让我彻底沉...
使用 Angular 打造微前端架构的 ToB 企业级应用
这篇文章其实已经准备了11个月了,因为虽然我们年初就开始使用 Angular 的微前端架构,但是产品一直没有正式发布,无法通过生产环境实践验证可行性,11月16日我们的产品正式灰度发布,所以是时候分享一下我们在使用 Angular 微前端这条路上的心得(踩过的坑)了额,希望和 Angular 社区一起成长一起进步,如果你对微前端有一定的了解并且已经在项目中尝试了可以忽略前面的章节。 什么是微前...
大学四年因为知道了这32个网站,我成了别人眼中的大神!
依稀记得,毕业那天,我们导员发给我毕业证的时候对我说“你可是咱们系的风云人物啊”,哎呀,别提当时多开心啦????,嗯,我们导员是所有导员中最帅的一个,真的???? 不过,导员说的是实话,很多人都叫我大神的,为啥,因为我知道这32个网站啊,你说强不强????,这次是绝对的干货,看好啦,走起来! PS:每个网站都是学计算机混互联网必须知道的,真的牛杯,我就不过多介绍了,大家自行探索,觉得没用的,尽管留言吐槽吧???? 社...
拿下微软、Google、Adobe,印度为何盛产科技圈 CEO?
作者 | 胡巍巍 出品 | CSDN(ID:CSDNnews) 世界500强中,30%的掌舵人,都是印度人。 是的,你没看错。这是近日《哈佛商业评论》的研究结果。 其中又以微软CEO萨提亚·纳德拉(Satya Nadella)、和谷歌CEO桑达尔·皮查伊(Sundar Pichai,以下简称劈柴)最为出名。 微软CEO萨提亚·纳德拉(Satya Nadella) 其他著名印度...
程序员写了一个新手都写不出的低级bug,被骂惨了。
这种新手都不会范的错,居然被一个工作好几年的小伙子写出来,差点被当场开除了。
Java工作4年来应聘要16K最后没要,细节如下。。。
前奏: 今天2B哥和大家分享一位前几天面试的一位应聘者,工作4年26岁,统招本科。 以下就是他的简历和面试情况。 基本情况: 专业技能: 1、&nbsp;熟悉Sping了解SpringMVC、SpringBoot、Mybatis等框架、了解SpringCloud微服务 2、&nbsp;熟悉常用项目管理工具:SVN、GIT、MAVEN、Jenkins 3、&nbsp;熟悉Nginx、tomca...
一文带你入门Linux
文章目录1.1 Linux的概述:1.1.1 什么是Linux:1.1.1.1 学习Linux之前先了解Unix1.1.1.2 Linux的概述:1.1.1.3 Linux的历史:1.1.1.4 Linux系统的应用:1.1.1.5 Linux的版本1.1.1.6 Linux的主流版本1.2 Linux的安装:1.2.1 虚拟机安装:1.2.1.1 什么是虚拟机1.2.1.2 安装VmWare1....
普通三本毕业,我怎么一路艰辛进入阿里的
英雄不问出处? 自古以来就有这样一句话,真的英雄不问出处吗?这句话太挫了。普通三本院校的我,大四的时候居然都不知道什么是校招,所以出处太重要了。这也是没有机会参加阿里校招的原因,毕竟校招门槛比社招还是要低的,最重要的是校招进入阿里能让你的起点比别人更高。 有幸可以社招进入阿里,了解了校招的思路,赶紧介绍给学弟们,现在我们三本院校的小学弟今年居然有 3 个人通过了阿里的校招。下面我也把这份宝贵的经...
作为一个程序员,CPU的这些硬核知识你必须会!
CPU对每个程序员来说,是个既熟悉又陌生的东西? 如果你只知道CPU是中央处理器的话,那可能对你并没有什么用,那么作为程序员的我们,必须要搞懂的就是CPU这家伙是如何运行的,尤其要搞懂它里面的寄存器是怎么一回事,因为这将让你从底层明白程序的运行机制。 随我一起,来好好认识下CPU这货吧 把CPU掰开来看 对于CPU来说,我们首先就要搞明白它是怎么回事,也就是它的内部构造,当然,CPU那么牛的一个东...
破14亿,Python分析我国存在哪些人口危机!
一、背景 二、爬取数据 三、数据分析 1、总人口 2、男女人口比例 3、人口城镇化 4、人口增长率 5、人口老化(抚养比) 6、各省人口 7、世界人口 四、遇到的问题 遇到的问题 1、数据分页,需要获取从1949-2018年数据,观察到有近20年参数:LAST20,由此推测获取近70年的参数可设置为:LAST70 2、2019年数据没有放上去,可以手动添加上去 3、将数据进行 行列转换 4、列名...
强烈推荐10本程序员在家读的书
很遗憾,这个春节注定是刻骨铭心的,新型冠状病毒让每个人的神经都是紧绷的。那些处在武汉的白衣天使们,尤其值得我们的尊敬。而我们这些窝在家里的程序员,能不外出就不外出,就是对社会做出的最大的贡献。 有些读者私下问我,窝了几天,有点颓丧,能否推荐几本书在家里看看。我花了一天的时间,挑选了 10 本我最喜欢的书,你可以挑选感兴趣的来读一读。读书不仅可以平复恐惧的压力,还可以对未来充满希望,毕竟苦难终将会...
Python实战:抓肺炎疫情实时数据,画2019-nCoV疫情地图
今天,群里白垩老师问如何用python画武汉肺炎疫情地图。白垩老师是研究海洋生态与地球生物的学者,国家重点实验室成员,于不惑之年学习python,实为我等学习楷模。先前我并没有关注武汉肺炎的具体数据,也没有画过类似的数据分布图。于是就拿了两个小时,专门研究了一下,遂成此文。
关于2020年个人项目【臻美_疫情实时大数据报告】(项目开源)
本项目开源,供大家学习交流,数据来自官方通报。 项目网址: 点这可以查看项目 项目图例: 1、国内疫情(省) 2、国内疫情(市) 3、国外疫情 4、热点消息、辟谣消息 5、防疫知识 源码奉上: 本项目后台使用node.js app.js var originRequest = require('request'); var iconv = require('iconv-lite'...
[数据结构与算法] 排序算法
终于学习到了算法部分, 在学习算法时, 我们还是应该回顾一下数据结构与算法之间的关系 数据结构是研究数据的组织方式, 是算法的基础 算法是解决编程问题的方法论, 是程序的灵魂 程序= 数据结构+算法 排序算法 排序也称排序算法(Sort algorithm). 是指 将一组数据按照指定顺序进行排列的过程 主要分为内部排序和外部排序 内部排序: 指将需要处理的数据加载到内存中进行排序 外部排序...
听说想当黑客的都玩过这个Monyer游戏(1~14攻略)
第零关 进入传送门开始第0关(游戏链接) 请点击链接进入第1关: 连接在左边→ ←连接在右边 看不到啊。。。。(只能看到一堆大佬做完的留名,也能看到菜鸡的我,在后面~~) 直接fn+f12吧 &lt;span&gt;连接在左边→&lt;/span&gt; &lt;a href="first.php"&gt;&lt;/a&gt; &lt;span&gt;←连接在右边&lt;/span&gt; o...
智力题(程序员面试经典)
NO.1  有20瓶药丸,其中19瓶装有1克/粒的药丸,余下一瓶装有1.1克/粒的药丸。给你一台称重精准的天平,怎么找出比较重的那瓶药丸?天平只能用一次。 解法 有时候,严格的限制条件有可能反倒是解题的线索。在这个问题中,限制条件是天平只能用一次。 因为天平只能用一次,我们也得以知道一个有趣的事实:一次必须同时称很多药丸,其实更准确地说,是必须从19瓶拿出药丸进行称重。否则,如果跳过两瓶或更多瓶药...
自学python网络爬虫,从小白快速成长,分别实现静态网页爬取,下载meiztu中图片;动态网页爬取,下载burberry官网所有当季新品图片。
文章目录 1.前言 2.知识储备 3.爬取静态网站 4.爬取动态网站 1.前言 近日疫情严重,手机已经玩吐了,闲着无聊逛衣服品牌官网发现,结果一时兴起,想学一学python,写一个爬虫下载官网所有最新上架的衣服图片和价格;说干就干,但身为一个只学过一些c和c++的python 0基础大二小白,csdn上的各种教程里涉及的各种发法、工具和库让我眼花缭乱;因此走了很多弯路,终于花三天时间完成了爬虫的设...
面试官问你MyBatis SQL是如何执行的?把这篇文章甩给他
初识 MyBatis MyBatis 是第一个支持自定义 SQL、存储过程和高级映射的类持久框架。MyBatis 消除了大部分 JDBC 的样板代码、手动设置参数以及检索结果。MyBatis 能够支持简单的 XML 和注解配置规则。使 Map 接口和 POJO 类映射到数据库字段和记录。 MyBatis 的特点 那么 MyBatis 具有什么特点呢?或许我们可以从如下几个方面来描述 MyBati...
对Tomcat的简单概要小结
首先我们必须得知道Tomcat就是一个服务,一个本地服务,我们可以控制启动和停止,我们程序员通过这个服务主要是用来存放我们的java程序,当我们把Java程序放进Tomcat服务中,一旦Tomcat服务启动起来,其他电脑就可以进行网络连通,也就是说其他电脑也可以共同访问这个Java程序。 Tomcat的主要目录的概念 有上面的概念之后,我们再来知道一下tomcat根目录下都有哪些文件,以及这些文...
相关热词 c# 压缩图片好麻烦 c#计算数组中的平均值 c#获取路由参数 c#日期精确到分钟 c#自定义异常必须继承 c#查表并返回值 c# 动态 表达式树 c# 监控方法耗时 c# listbox c#chart显示滚动条
立即提问