安卓stdio导入别人项目编译报错6 exceptions were raised by workers?

是布谷短视频源码,想在自己电脑上运行。报错截图如下,百度搜不到该问题的解决方法,来此地求教,谢谢大佬们。是什么原因,应该怎么改呀?图片说明

Csdn user default icon
上传中...
上传图片
插入图片
抄袭、复制答案,以达到刷声望分或其他目的的行为,在CSDN问答是严格禁止的,一经发现立刻封号。是时候展现真正的技术了!
其他相关推荐
android stdio项目运行时报错app:compileDebugJavaWithJavac
本人刚装android stdio。运行时报错:Error:Execution failed for task ':app:compileDebugJavaWithJavac'. > Unexpected lock protocol found in lock file. Expected 3, found 0. ![图片说明](https://img-ask.csdn.net/upload/201709/18/1505723042_33294.png) 我尝试过将工程目录里的.gradle文件删除重新启动AndroidStudio导入,结果还是如上报错。 后来我查看报错信息 ![图片说明](https://img-ask.csdn.net/upload/201709/18/1505741919_262421.png) 网上没搜到相同的错误。老铁们,能不能指导一下。谢谢大家了。 ** 最新进展,这个问题已经被解决了,具体方法参见** [Error:Unexpected lock protocol found in lock file. ](http://www.cnblogs.com/cjyboy/p/6230159.html "")
android stdio 不会导入到eclipse
android stdio 编写的app怎样导入到eclipse 中去
安卓stdio 运行时报错。
我在android stdio中离线了gradle。导入工程的时候gradle building run都能通过,为什么总是会在运行的时候卡死机器,是因为我的电脑配置太低了吗? 速求 啊,求大神帮忙想想怎么解决。
【Android stdio】运行hello world报错,希望大神答疑解惑
1.我在做hello world的实验,在运行时,调不通,出现了下图的问题 ![图片说明](https://img-ask.csdn.net/upload/201901/01/1546357974_556.png) 尝试了下面链接的方法,并没有成功。 https://blog.csdn.net/fcw_one/article/details/80338553 希望大神们帮帮忙!!!
关于extern char *arr[];编译报错的问题
#include <errno.h> #include <stdio.h> extern char *arr[];//在这行报错 int main(){ int i=0; while(arr[i++]) printf("%s\n",arr[i]); system ("pause"); return 0; } 用VS2010编译这段代码时报错: IntelliSense: 不允许使用返回数组的函数
android stdio 能编写服务器端程序么?
没找到新建服务器端项目,只有android stdio项目。
安卓源码编译中 #include <stdio.h> 会报异常
在kernel/driver中的c文件里面调用FILE*类指针。添加#include <stdio.h>头文件就会报异常。请教如何解决。 CC scripts/mod/devicetable-offsets.s GEN scripts/mod/devicetable-offsets.h HOSTCC scripts/mod/file2alias.o HOSTLD scripts/mod/modpost CHK include/generated/uapi/linux/version.h CHK include/generated/utsrelease.h make[1]: “include/generated/mach-types.h”是最新的。 CALL scripts/checksyscalls.sh CHK include/generated/compile.h CC drivers/mfd/rk808.o drivers/mfd/rk808.c:39:23: fatal error: sys/stdio.h: No such file or directory compilation terminated. make[2]: *** [drivers/mfd/rk808.o] 错误 1 make[1]: *** [drivers/mfd] 错误 2 make: *** [drivers] 错误 2
linux下C语言使用stdio.h库中popen和pclose函数编译报错
error: implicit declaration of function ‘popen’; did you mean ‘fopen’? [-Werror=implicit-function-declaration] error: implicit declaration of function ‘pclose’; did you mean ‘fclose’? [-Werror=implicit-function-declaration] 请问下为什么这样会报隐式声明错误呀? 源代码如下: ``` GList *fList = s_wEntries; s_wEntries=NULL; FILE *fstream=NULL; char buff[1024]; memset(buff,0,sizeof(buff)); // execute command get all video char *launchword="find / -name *"; strcat(launchword,cText); strcat(launchword,"*"); if(NULL==(fstream=popen(launchword,"r"))) { } else { memset(buff, 0x00, sizeof(buff)); FileEntryInfo *Finfo; GtkMenuItem* searchmenuitem; while(NULL!=fgets(buff, sizeof(buff), fstream)){ if(buff[0]=='/') { searchmenuitem=gtk_menu_item_new_with_label(buff); Finfo->uri=buff; Finfo->pMenuItem=searchmenuitem; g_list_prepend(s_wEntries,Finfo); } memset(buff, 0x00, sizeof(buff)); } pclose(fstream); } ```
安卓stdio 自定义控件报找不到问题。如图
![图片说明](https://img-ask.csdn.net/upload/201605/25/1464174162_812644.png) 上面是报错的代码和引用的代码 ![图片说明](https://img-ask.csdn.net/upload/201605/25/1464174210_435353.png) 上面是最外层布局的相关配置 ![图片说明](https://img-ask.csdn.net/upload/201605/25/1464174392_936280.png) 这里是自定义的布局的构造器 我再eclipse上跑是没有问题的,但是拿到了Android stdio中确实报出找不到这个自定义的控件。为什么,搞了一天了。 大神来帮帮我吧。
安卓Android stdio,遇到了这个问题,图片
![图片说明](https://img-ask.csdn.net/upload/201901/20/1547989915_207638.jpg) 安卓Android stdio,遇到了这个问题,图片,求指点。
声明一个数组,由用户输入数组长度。不赋初值不报错,赋初值就报错?为什么
基本上,代码如下: ``` #include<stdio.h> int main(){ int num = 0; printf("输入数组长度:"); scanf("%d",&num); int arr[num]; //编译不报错 //int arr[num] = {0};//编译报错 return 0; } ```
stdio.h,stdlib.h,wchar.h报错
VS2010 创建空项目后编译报错如下,望各位大虾给予帮助,谢谢 错误 109 error C1003: 错误计数超过 100;正在停止编译 c:\program files\microsoft visual studio 10.0\vc\include\wchar.h 112 1 fineError 错误 9 error C2059: 语法错误:“)” c:\program files\microsoft visual studio 10.0\vc\include\stdio.h 245 1 fineError 错误 19 error C2059: 语法错误:“)” c:\program files\microsoft visual studio 10.0\vc\include\stdio.h 247 1 fineError 错误 21 error C2059: 语法错误:“)” c:\program files\microsoft visual studio 10.0\vc\include\stdio.h 317 1 fineError 错误 30 error C2059: 语法错误:“)” c:\program files\microsoft visual studio 10.0\vc\include\stdio.h 318 1 fineError 错误 37 error C2059: 语法错误:“)” c:\program files\microsoft visual studio 10.0\vc\include\stdio.h 321 1 fineError 错误 43 error C2059: 语法错误:“)” c:\program files\microsoft visual studio 10.0\vc\include\stdio.h 333 1 fineError 错误 49 error C2059: 语法错误:“)” c:\program files\microsoft visual studio 10.0\vc\include\stdio.h 334 1 fineError 错误 55 error C2059: 语法错误:“)” c:\program files\microsoft visual studio 10.0\vc\include\stdio.h 335 1 fineError 错误 61 error C2059: 语法错误:“)” c:\program files\microsoft visual studio 10.0\vc\include\stdio.h 336 1 fineError 错误 68 error C2059: 语法错误:“)” c:\program files\microsoft visual studio 10.0\vc\include\stdio.h 404 1 fineError 错误 87 error C2059: 语法错误:“)” c:\program files\microsoft visual studio 10.0\vc\include\stdio.h 680 1 fineError 错误 97 error C2059: 语法错误:“)” c:\program files\microsoft visual studio 10.0\vc\include\stdio.h 681 1 fineError 错误 104 error C2059: 语法错误:“)” c:\program files\microsoft visual studio 10.0\vc\include\stdio.h 686 1 fineError 错误 20 error C2061: 语法错误: 标识符“_Inout_opt_z_charcap_” c:\program files\microsoft visual studio 10.0\vc\include\stdio.h 317 1 fineError 错误 29 error C2062: 意外的类型“char” c:\program files\microsoft visual studio 10.0\vc\include\stdio.h 318 1 fineError 错误 36 error C2062: 意外的类型“char” c:\program files\microsoft visual studio 10.0\vc\include\stdio.h 321 1 fineError 错误 67 error C2062: 意外的类型“char” c:\program files\microsoft visual studio 10.0\vc\include\stdio.h 404 1 fineError 错误 2 error C2065: “_Count”: 未声明的标识符 c:\program files\microsoft visual studio 10.0\vc\include\stdio.h 245 1 fineError 错误 11 error C2065: “_Count”: 未声明的标识符 c:\program files\microsoft visual studio 10.0\vc\include\stdio.h 247 1 fineError 错误 80 error C2065: “_Count”: 未声明的标识符 c:\program files\microsoft visual studio 10.0\vc\include\stdio.h 680 1 fineError 错误 89 error C2065: “_Count”: 未声明的标识符 c:\program files\microsoft visual studio 10.0\vc\include\stdio.h 681 1 fineError 错误 99 error C2065: “_Count”: 未声明的标识符 c:\program files\microsoft visual studio 10.0\vc\include\stdio.h 686 1 fineError 错误 62 error C2065: “_DstSize”: 未声明的标识符 c:\program files\microsoft visual studio 10.0\vc\include\stdio.h 404 1 fineError 错误 1 error C2065: “_ElementSize”: 未声明的标识符 c:\program files\microsoft visual studio 10.0\vc\include\stdio.h 245 1 fineError 错误 10 error C2065: “_ElementSize”: 未声明的标识符 c:\program files\microsoft visual studio 10.0\vc\include\stdio.h 247 1 fineError 错误 79 error C2065: “_ElementSize”: 未声明的标识符 c:\program files\microsoft visual studio 10.0\vc\include\stdio.h 680 1 fineError 错误 88 error C2065: “_ElementSize”: 未声明的标识符 c:\program files\microsoft visual studio 10.0\vc\include\stdio.h 681 1 fineError 错误 38 error C2065: “_MaxCount”: 未声明的标识符 c:\program files\microsoft visual studio 10.0\vc\include\stdio.h 333 1 fineError 错误 44 error C2065: “_MaxCount”: 未声明的标识符 c:\program files\microsoft visual studio 10.0\vc\include\stdio.h 334 1 fineError 错误 50 error C2065: “_MaxCount”: 未声明的标识符 c:\program files\microsoft visual studio 10.0\vc\include\stdio.h 335 1 fineError 错误 56 error C2065: “_MaxCount”: 未声明的标识符 c:\program files\microsoft visual studio 10.0\vc\include\stdio.h 336 1 fineError 错误 98 error C2065: “_Size”: 未声明的标识符 c:\program files\microsoft visual studio 10.0\vc\include\stdio.h 686 1 fineError 错误 23 error C2065: “_SizeInchars”: 未声明的标识符 c:\program files\microsoft visual studio 10.0\vc\include\stdio.h 318 1 fineError 错误 31 error C2065: “_SizeInchars”: 未声明的标识符 c:\program files\microsoft visual studio 10.0\vc\include\stdio.h 321 1 fineError 错误 22 error C2143: 语法错误 : 缺少“)”(在“;”的前面) c:\program files\microsoft visual studio 10.0\vc\include\stdio.h 317 1 fineError 错误 40 error C2143: 语法错误 : 缺少“)”(在“const”的前面) c:\program files\microsoft visual studio 10.0\vc\include\stdio.h 333 1 fineError 错误 46 error C2143: 语法错误 : 缺少“)”(在“const”的前面) c:\program files\microsoft visual studio 10.0\vc\include\stdio.h 334 1 fineError 错误 52 error C2143: 语法错误 : 缺少“)”(在“const”的前面) c:\program files\microsoft visual studio 10.0\vc\include\stdio.h 335 1 fineError 错误 58 error C2143: 语法错误 : 缺少“)”(在“const”的前面) c:\program files\microsoft visual studio 10.0\vc\include\stdio.h 336 1 fineError 错误 101 error C2143: 语法错误 : 缺少“)”(在“const”的前面) c:\program files\microsoft visual studio 10.0\vc\include\stdio.h 686 1 fineError 错误 8 error C2143: 语法错误 : 缺少“;”(在“*”的前面) c:\program files\microsoft visual studio 10.0\vc\include\stdio.h 245 1 fineError 错误 18 error C2143: 语法错误 : 缺少“;”(在“*”的前面) c:\program files\microsoft visual studio 10.0\vc\include\stdio.h 247 1 fineError 错误 86 error C2143: 语法错误 : 缺少“;”(在“*”的前面) c:\program files\microsoft visual studio 10.0\vc\include\stdio.h 680 1 fineError 错误 96 error C2143: 语法错误 : 缺少“;”(在“*”的前面) c:\program files\microsoft visual studio 10.0\vc\include\stdio.h 681 1 fineError 错误 25 error C2144: 语法错误:“char”的前面应有“)” c:\program files\microsoft visual studio 10.0\vc\include\stdio.h 318 1 fineError 错误 33 error C2144: 语法错误:“char”的前面应有“)” c:\program files\microsoft visual studio 10.0\vc\include\stdio.h 321 1 fineError 错误 64 error C2144: 语法错误:“char”的前面应有“)” c:\program files\microsoft visual studio 10.0\vc\include\stdio.h 404 1 fineError 错误 4 error C2144: 语法错误:“void”的前面应有“)” c:\program files\microsoft visual studio 10.0\vc\include\stdio.h 245 1 fineError 错误 13 error C2144: 语法错误:“void”的前面应有“)” c:\program files\microsoft visual studio 10.0\vc\include\stdio.h 247 1 fineError 错误 82 error C2144: 语法错误:“void”的前面应有“)” c:\program files\microsoft visual studio 10.0\vc\include\stdio.h 680 1 fineError 错误 91 error C2144: 语法错误:“void”的前面应有“)” c:\program files\microsoft visual studio 10.0\vc\include\stdio.h 681 1 fineError 错误 7 error C2146: 语法错误: 缺少“;”(在标识符“_Count”的前面) c:\program files\microsoft visual studio 10.0\vc\include\stdio.h 245 1 fineError 错误 17 error C2146: 语法错误: 缺少“;”(在标识符“_Count”的前面) c:\program files\microsoft visual studio 10.0\vc\include\stdio.h 247 1 fineError 错误 85 error C2146: 语法错误: 缺少“;”(在标识符“_Count”的前面) c:\program files\microsoft visual studio 10.0\vc\include\stdio.h 680 1 fineError 错误 95 error C2146: 语法错误: 缺少“;”(在标识符“_Count”的前面) c:\program files\microsoft visual studio 10.0\vc\include\stdio.h 681 1 fineError 错误 15 error C2146: 语法错误: 缺少“;”(在标识符“_DstSize”的前面) c:\program files\microsoft visual studio 10.0\vc\include\stdio.h 247 1 fineError 错误 66 error C2146: 语法错误: 缺少“;”(在标识符“_DstSize”的前面) c:\program files\microsoft visual studio 10.0\vc\include\stdio.h 404 1 fineError 错误 93 error C2146: 语法错误: 缺少“;”(在标识符“_DstSize”的前面) c:\program files\microsoft visual studio 10.0\vc\include\stdio.h 681 1 fineError 错误 6 error C2146: 语法错误: 缺少“;”(在标识符“_ElementSize”的前面) c:\program files\microsoft visual studio 10.0\vc\include\stdio.h 245 1 fineError 错误 16 error C2146: 语法错误: 缺少“;”(在标识符“_ElementSize”的前面) c:\program files\microsoft visual studio 10.0\vc\include\stdio.h 247 1 fineError 错误 84 error C2146: 语法错误: 缺少“;”(在标识符“_ElementSize”的前面) c:\program files\microsoft visual studio 10.0\vc\include\stdio.h 680 1 fineError 错误 94 error C2146: 语法错误: 缺少“;”(在标识符“_ElementSize”的前面) c:\program files\microsoft visual studio 10.0\vc\include\stdio.h 681 1 fineError 错误 28 error C2146: 语法错误: 缺少“;”(在标识符“_MaxCount”的前面) c:\program files\microsoft visual studio 10.0\vc\include\stdio.h 318 1 fineError 错误 27 error C2146: 语法错误: 缺少“;”(在标识符“_SizeInchars”的前面) c:\program files\microsoft visual studio 10.0\vc\include\stdio.h 318 1 fineError 错误 35 error C2146: 语法错误: 缺少“;”(在标识符“_SizeInchars”的前面) c:\program files\microsoft visual studio 10.0\vc\include\stdio.h 321 1 fineError 错误 105 error C2146: 语法错误: 缺少“;”(在标识符“size”的前面) c:\program files\microsoft visual studio 10.0\vc\include\wchar.h 94 1 fineError 错误 108 error C2146: 语法错误: 缺少“;”(在标识符“size”的前面) c:\program files\microsoft visual studio 10.0\vc\include\wchar.h 112 1 fineError 错误 92 error C2448: “_fread_nolock_s”: 函数样式初始值设定项类似函数定义 c:\program files\microsoft visual studio 10.0\vc\include\stdio.h 681 1 fineError 错误 83 error C2448: “_fread_nolock”: 函数样式初始值设定项类似函数定义 c:\program files\microsoft visual studio 10.0\vc\include\stdio.h 680 1 fineError 错误 26 error C2448: “_snprintf_s”: 函数样式初始值设定项类似函数定义 c:\program files\microsoft visual studio 10.0\vc\include\stdio.h 318 1 fineError 错误 65 error C2448: “_sprintf_s_l”: 函数样式初始值设定项类似函数定义 c:\program files\microsoft visual studio 10.0\vc\include\stdio.h 404 1 fineError 错误 14 error C2448: “fread_s”: 函数样式初始值设定项类似函数定义 c:\program files\microsoft visual studio 10.0\vc\include\stdio.h 247 1 fineError 错误 5 error C2448: “fread”: 函数样式初始值设定项类似函数定义 c:\program files\microsoft visual studio 10.0\vc\include\stdio.h 245 1 fineError 错误 34 error C2448: “sprintf_s”: 函数样式初始值设定项类似函数定义 c:\program files\microsoft visual studio 10.0\vc\include\stdio.h 321 1 fineError 错误 103 error C2491: “_fwrite_nolock”: 不允许 dllimport 数据 的定义 c:\program files\microsoft visual studio 10.0\vc\include\stdio.h 686 1 fineError 错误 48 error C2491: “_snscanf_l”: 不允许 dllimport 数据 的定义 c:\program files\microsoft visual studio 10.0\vc\include\stdio.h 334 1 fineError 错误 60 error C2491: “_snscanf_s_l”: 不允许 dllimport 数据 的定义 c:\program files\microsoft visual studio 10.0\vc\include\stdio.h 336 1 fineError 错误 54 error C2491: “_snscanf_s”: 不允许 dllimport 数据 的定义 c:\program files\microsoft visual studio 10.0\vc\include\stdio.h 335 1 fineError 错误 42 error C2491: “_snscanf”: 不允许 dllimport 数据 的定义 c:\program files\microsoft visual studio 10.0\vc\include\stdio.h 333 1 fineError 错误 75 error C3861: “__vswprintf_l”: 找不到标识符 c:\program files\microsoft visual studio 10.0\vc\include\swprintf.inl 109 1 fineError 错误 76 error C3861: “__vswprintf_l”: 找不到标识符 c:\program files\microsoft visual studio 10.0\vc\include\swprintf.inl 119 1 fineError 错误 39 error C3861: “_In_charcount_”: 找不到标识符 c:\program files\microsoft visual studio 10.0\vc\include\stdio.h 333 1 fineError 错误 45 error C3861: “_In_charcount_”: 找不到标识符 c:\program files\microsoft visual studio 10.0\vc\include\stdio.h 334 1 fineError 错误 51 error C3861: “_In_charcount_”: 找不到标识符 c:\program files\microsoft visual studio 10.0\vc\include\stdio.h 335 1 fineError 错误 57 error C3861: “_In_charcount_”: 找不到标识符 c:\program files\microsoft visual studio 10.0\vc\include\stdio.h 336 1 fineError 错误 100 error C3861: “_In_charcount_x_”: 找不到标识符 c:\program files\microsoft visual studio 10.0\vc\include\stdio.h 686 1 fineError 错误 3 error C3861: “_Out_charcap_x_”: 找不到标识符 c:\program files\microsoft visual studio 10.0\vc\include\stdio.h 245 1 fineError 错误 12 error C3861: “_Out_charcap_x_”: 找不到标识符 c:\program files\microsoft visual studio 10.0\vc\include\stdio.h 247 1 fineError 错误 81 error C3861: “_Out_charcap_x_”: 找不到标识符 c:\program files\microsoft visual studio 10.0\vc\include\stdio.h 680 1 fineError 错误 90 error C3861: “_Out_charcap_x_”: 找不到标识符 c:\program files\microsoft visual studio 10.0\vc\include\stdio.h 681 1 fineError 错误 24 error C3861: “_Out_z_charcap_”: 找不到标识符 c:\program files\microsoft visual studio 10.0\vc\include\stdio.h 318 1 fineError 错误 32 error C3861: “_Out_z_charcap_”: 找不到标识符 c:\program files\microsoft visual studio 10.0\vc\include\stdio.h 321 1 fineError 错误 63 error C3861: “_Out_z_charcap_”: 找不到标识符 c:\program files\microsoft visual studio 10.0\vc\include\stdio.h 404 1 fineError 错误 69 error C3861: “_vswprintf_c_l”: 找不到标识符 c:\program files\microsoft visual studio 10.0\vc\include\swprintf.inl 41 1 fineError 错误 70 error C3861: “_vswprintf_c_l”: 找不到标识符 c:\program files\microsoft visual studio 10.0\vc\include\swprintf.inl 51 1 fineError 错误 71 error C3861: “_vswprintf_c_l”: 找不到标识符 c:\program files\microsoft visual studio 10.0\vc\include\swprintf.inl 65 1 fineError 错误 72 error C3861: “_vswprintf_c_l”: 找不到标识符 c:\program files\microsoft visual studio 10.0\vc\include\swprintf.inl 75 1 fineError 错误 73 error C3861: “_vswprintf”: 找不到标识符 c:\program files\microsoft visual studio 10.0\vc\include\swprintf.inl 89 1 fineError 错误 74 error C3861: “_vswprintf”: 找不到标识符 c:\program files\microsoft visual studio 10.0\vc\include\swprintf.inl 99 1 fineError 错误 77 error C3861: “fgetwc”: 找不到标识符 c:\program files\microsoft visual studio 10.0\vc\include\stdio.h 627 1 fineError 错误 78 error C3861: “fputwc”: 找不到标识符 c:\program files\microsoft visual studio 10.0\vc\include\stdio.h 629 1 fineError 错误 106 error C4430: 缺少类型说明符 - 假定为 int。注意: C++ 不支持默认 int c:\program files\microsoft visual studio 10.0\vc\include\wchar.h 94 1 fineError 错误 107 error C4430: 缺少类型说明符 - 假定为 int。注意: C++ 不支持默认 int c:\program files\microsoft visual studio 10.0\vc\include\wchar.h 94 1 fineError 警告 41 warning C4229: 使用了记时错误: 忽略数据上的修饰符 c:\program files\microsoft visual studio 10.0\vc\include\stdio.h 333 1 fineError 警告 47 warning C4229: 使用了记时错误: 忽略数据上的修饰符 c:\program files\microsoft visual studio 10.0\vc\include\stdio.h 334 1 fineError 警告 53 warning C4229: 使用了记时错误: 忽略数据上的修饰符 c:\program files\microsoft visual studio 10.0\vc\include\stdio.h 335 1 fineError 警告 59 warning C4229: 使用了记时错误: 忽略数据上的修饰符 c:\program files\microsoft visual studio 10.0\vc\include\stdio.h 336 1 fineError 警告 102 warning C4229: 使用了记时错误: 忽略数据上的修饰符 c:\program files\microsoft visual studio 10.0\vc\include\stdio.h 686 1 fineError
android stdio创建新项目时用不了了
前些天还好好的昨晚不知道弄了哪里,结果用不了了,提示说 Error:(24, 13) Failed to resolve: com.android.support:appcompat-v7:22.+ <a href="install.m2.repo">Install Repository and sync project</a><br><a href="openFile">Show in File</a><br><a href="open.dependency.in.project.structure">Show in Project Structure dialog</a>,崩溃!
编译报错为[Error] ld returned 1 exit status,但经检查无在运行的程序
//【日期】黑色星期五 #include "stdio.h" #include <stdlib.h> #include "math.h" extern int a; int fa(int b) //判断为星期几的函数,返回值x {int c=13,x,y=0; if(b>12||b<1){ printf("month is error.\n"); goto out; } if(a<=1900){ printf("year is error.\n"); goto out; } if(((b==1||b==3||b==5||b==7||b==8||b==10||b==12)&&c>31)||(((a%4==0&&a%100!=0)||(a%400==0))&&b==2&&c>29)||((a%4!=0||a%100==0)&&c>28)||((b==6||b==4||b==9||b==11)&&c>31)||(c<1)){ printf("day is error.\n"); goto out; } switch(b) { case 1:x=c%7+1;break; case 2:x=(31+c)%7+1;break; case 3:x=(31+28+c)%7+1;break; case 4:x=(31+28+31+c)%7+1;break; case 5:x=(31+28+31+30+c)%7+1;break; case 6:x=(31+28+31+30+31+c)%7+1;break; case 7:x=(31+28+31+30+31+30+c)%7+1;break; case 8:x=(31+28+31+30+31+30+31+c)%7+1;break; case 9:x=(31+28+31+30+31+30+31+31+c)%7+1;break; case 10:x=(31+28+31+30+31+30+31+31+30+c)%7+1;break; case 11:x=(31+28+31+30+31+30+31+31+30+31+c)%7+1;break; case 12:x=(31+28+31+30+31+30+31+31+30+31+30+c)%7+1;break; } if(a>2013)x+=(a-2013)/4+(a-2013); if(a<2013) { x-=(2016-a)/4+(2013-a)-7; x+=7*((2015-x)/7); } if(x>=7)x=x%7; out: return x; } //主函数判断某一年的13号是不是为星期五 int main() { int fa(int b) ; int i=0,j[10],b,s; scanf("%d",&a); for(b=1;b<13;b++){ if(fa(b)==5){ j[i]=b; i++; } } s=i; printf("There are %d Black Fridays in year %d.\n",i,a); printf("They are:\n"); for(i=0;i<s;i++){ printf("%d/%d/13\n",a,j[i]); } } ``` ```
visual stdio2010 c++ 中怎么编译多文件
请问如何visual stdio 2010 c++ 中编译多文件。我的情况是这样的,使用了默认的windons console 模式。在工程中,包含了stdafx.h stdafx.cpp targetver.h和main.cpp这几个文件.我在写入一个test.cpp文件,里面有一个函数void test().但是总是提示我说:找到一个或多个多重定义的符号。不知道一般怎样在visual stdio中写这样的包含文件的工程啊?
编译报错,destroyList要先声明后使用,但是为什么initSqlist不报错
#include <stdio.h> #include <stdlib.h> //定义一个三元数组 typedef struct Sqlist{ int * elem;//起始地址 int length;//初始长度 int listSize;//线性表容量 }Sqlist; int main(int argc, char *argv[]) { Sqlist q; initSqlist(&q,10); //destroyList(&q); printf("%d\n",q.listSize); system("PAUSE"); return 0; } /* *初始化一个线性列表 *list 是需要被初始化的列表引用 *size 是分配的空间大小 */ int initSqlist(Sqlist* list,int size) { list->length = 0; list->listSize = size; list->elem = (int*) malloc(size*sizeof(int)); } /* 释放malloc分配的内存空间 */ void destroyList(Sqlist* list) { free(list); }
Android stdio 没有layout_land文件夹,这么创建水平布局,新人求救
Android stdio 没有layout_land文件夹,这么创建水平布局,新人求救,
关于QT上编译运行报错的问题
最近在编写一个试验程序,中间需要用到读取一个文件夹中全部txt文件的操作,便谢了个小程序返回指定文件夹下所有txt文件名的小程序,开始用QT编译运行,才输出一行就报错 截图如下图一二: 开始一直以为是自己程序的问题,检查觉得没错,就用DevC++编译了一下 能够成功运行并输出,截图如下图三 求问大神,这是什么问题呢 并求解决办法 谢谢 附加我的代码: ``` #include <stdio.h> #include <io.h> #include <iostream> #include <string> using namespace std; const char *to_search="D:\\FileTest\\test\\*.txt"; //欲查找的文件,支持通配符 int main() { string location_base="D:\\FileTest\\test\\"; string location[4]; long handle; //用于查找的句柄 struct _finddata_t fileinfo; //文件信息的结构体 handle=_findfirst(to_search,&fileinfo); //第一次查找 int i=0; if(-1==handle)return -1; printf("%s\n",fileinfo.name); //打印出找到的文件的文件名 location[i]=location_base; location[i].append(fileinfo.name); cout<<location[i]<<endl; while(_findnext(handle,&fileinfo)==0) //循环查找其他符合的文件,知道找不到其他的为止 { i++; printf("%s\n",fileinfo.name); location[i]=location_base; location[i].append(fileinfo.name); cout<<location[i]<<endl; } _findclose(handle); //关闭句柄 return 0; } ``` ![图片说明](https://img-ask.csdn.net/upload/201610/15/1476497715_84069.png)![图片说明](https://img-ask.csdn.net/upload/201610/15/1476497734_728545.png) ![图片说明](https://img-ask.csdn.net/upload/201610/15/1476498026_396549.png)
c中定义全局变量,用此变量定义数组长度问题,为什么编译器报错
#include<stdio.h> int =5; struct data { int f[n]; int mid; int h; }x.y; 哪里不对 编译器说expected constant experssion
终于明白阿里百度这样的大公司,为什么面试经常拿ThreadLocal考验求职者了
点击上面↑「爱开发」关注我们每晚10点,捕获技术思考和创业资源洞察什么是ThreadLocalThreadLocal是一个本地线程副本变量工具类,各个线程都拥有一份线程私有的数
《奇巧淫技》系列-python!!每天早上八点自动发送天气预报邮件到QQ邮箱
此博客仅为我业余记录文章所用,发布到此,仅供网友阅读参考,如有侵权,请通知我,我会删掉。 补充 有不少读者留言说本文章没有用,因为天气预报直接打开手机就可以收到了,为何要多此一举发送到邮箱呢!!!那我在这里只能说:因为你没用,所以你没用!!! 这里主要介绍的是思路,不是天气预报!不是天气预报!!不是天气预报!!!天气预报只是用于举例。请各位不要再刚了!!! 下面是我会用到的两个场景: 每日下
面试官问我:什么是消息队列?什么场景需要他?用了会出现什么问题?
你知道的越多,你不知道的越多 点赞再看,养成习惯 GitHub上已经开源 https://github.com/JavaFamily 有一线大厂面试点脑图、个人联系方式,欢迎Star和完善 前言 消息队列在互联网技术存储方面使用如此广泛,几乎所有的后端技术面试官都要在消息队列的使用和原理方面对小伙伴们进行360°的刁难。 作为一个在互联网公司面一次拿一次Offer的面霸,打败了无数
8年经验面试官详解 Java 面试秘诀
    作者 | 胡书敏 责编 | 刘静 出品 | CSDN(ID:CSDNnews) 本人目前在一家知名外企担任架构师,而且最近八年来,在多家外企和互联网公司担任Java技术面试官,前后累计面试了有两三百位候选人。在本文里,就将结合本人的面试经验,针对Java初学者、Java初级开发和Java开发,给出若干准备简历和准备面试的建议。   Java程序员准备和投递简历的实
究竟你适不适合买Mac?
我清晰的记得,刚买的macbook pro回到家,开机后第一件事情,就是上了淘宝网,花了500元钱,找了一个上门维修电脑的师傅,上门给我装了一个windows系统。。。。。。 表砍我。。。 当时买mac的初衷,只是想要个固态硬盘的笔记本,用来运行一些复杂的扑克软件。而看了当时所有的SSD笔记本后,最终决定,还是买个好(xiong)看(da)的。 已经有好几个朋友问我mba怎么样了,所以今天尽量客观
MyBatis研习录(01)——MyBatis概述与入门
C语言自学完备手册(33篇) Android多分辨率适配框架 JavaWeb核心技术系列教程 HTML5前端开发实战系列教程 MySQL数据库实操教程(35篇图文版) 推翻自己和过往——自定义View系列教程(10篇) 走出思维困境,踏上精进之路——Android开发进阶精华录 讲给Android程序员看的前端系列教程(40集免费视频教程+源码) 版权声明 本文原创作者:谷哥的小弟 作者博客
程序员一般通过什么途径接私活?
二哥,你好,我想知道一般程序猿都如何接私活,我也想接,能告诉我一些方法吗? 上面是一个读者“烦不烦”问我的一个问题。其实不止是“烦不烦”,还有很多读者问过我类似这样的问题。 我接的私活不算多,挣到的钱也没有多少,加起来不到 20W。说实话,这个数目说出来我是有点心虚的,毕竟太少了,大家轻喷。但我想,恰好配得上“一般程序员”这个称号啊。毕竟苍蝇再小也是肉,我也算是有经验的人了。 唾弃接私活、做外
Python爬虫爬取淘宝,京东商品信息
小编是一个理科生,不善长说一些废话。简单介绍下原理然后直接上代码。 使用的工具(Python+pycharm2019.3+selenium+xpath+chromedriver)其中要使用pycharm也可以私聊我selenium是一个框架可以通过pip下载 pip install selenium -i https://pypi.tuna.tsinghua.edu.cn/simple/ 
阿里程序员写了一个新手都写不出的低级bug,被骂惨了。
你知道的越多,你不知道的越多 点赞再看,养成习惯 本文 GitHub https://github.com/JavaFamily 已收录,有一线大厂面试点思维导图,也整理了很多我的文档,欢迎Star和完善,大家面试可以参照考点复习,希望我们一起有点东西。 前前言 为啥今天有个前前言呢? 因为你们的丙丙啊,昨天有牌面了哟,直接被微信官方推荐,知乎推荐,也就仅仅是还行吧(心里乐开花)
Java工作4年来应聘要16K最后没要,细节如下。。。
前奏: 今天2B哥和大家分享一位前几天面试的一位应聘者,工作4年26岁,统招本科。 以下就是他的简历和面试情况。 基本情况: 专业技能: 1、&nbsp;熟悉Sping了解SpringMVC、SpringBoot、Mybatis等框架、了解SpringCloud微服务 2、&nbsp;熟悉常用项目管理工具:SVN、GIT、MAVEN、Jenkins 3、&nbsp;熟悉Nginx、tomca
Python爬虫精简步骤1 获取数据
爬虫的工作分为四步: 1.获取数据。爬虫程序会根据我们提供的网址,向服务器发起请求,然后返回数据。 2.解析数据。爬虫程序会把服务器返回的数据解析成我们能读懂的格式。 3.提取数据。爬虫程序再从中提取出我们需要的数据。 4.储存数据。爬虫程序把这些有用的数据保存起来,便于你日后的使用和分析。 这一篇的内容就是:获取数据。 首先,我们将会利用一个强大的库——requests来获取数据。 在电脑上安装
Python绘图,圣诞树,花,爱心 | Turtle篇
1.画圣诞树 import turtle screen = turtle.Screen() screen.setup(800,600) circle = turtle.Turtle() circle.shape('circle') circle.color('red') circle.speed('fastest') circle.up() square = turtle.Turtle()
作为一个程序员,CPU的这些硬核知识你必须会!
CPU对每个程序员来说,是个既熟悉又陌生的东西? 如果你只知道CPU是中央处理器的话,那可能对你并没有什么用,那么作为程序员的我们,必须要搞懂的就是CPU这家伙是如何运行的,尤其要搞懂它里面的寄存器是怎么一回事,因为这将让你从底层明白程序的运行机制。 随我一起,来好好认识下CPU这货吧 把CPU掰开来看 对于CPU来说,我们首先就要搞明白它是怎么回事,也就是它的内部构造,当然,CPU那么牛的一个东
破14亿,Python分析我国存在哪些人口危机!
2020年1月17日,国家统计局发布了2019年国民经济报告,报告中指出我国人口突破14亿。 猪哥的朋友圈被14亿人口刷屏,但是很多人并没有看到我国复杂的人口问题:老龄化、男女比例失衡、生育率下降、人口红利下降等。 今天我们就来分析一下我们国家的人口数据吧! 更多有趣分析教程,扫描下方二维码关注vx公号「裸睡的猪」 即可查看! 一、背景 1.人口突破14亿 2020年1月17日,国家统计局发布
web前端javascript+jquery知识点总结
Javascript javascript 在前端网页中占有非常重要的地位,可以用于验证表单,制作特效等功能,它是一种描述语言,也是一种基于对象(Object)和事件驱动并具有安全性的脚本语言 ,语法同java类似,是一种解释性语言,边执行边解释。 JavaScript的组成: ECMAScipt 用于描述: 语法,变量和数据类型,运算符,逻辑控制语句,关键字保留字,对象。 浏览器对象模型(Br
Python实战:抓肺炎疫情实时数据,画2019-nCoV疫情地图
文章目录1. 前言2. 数据下载3. 数据处理4. 数据可视化 1. 前言 今天,群里白垩老师问如何用python画武汉肺炎疫情地图。白垩老师是研究海洋生态与地球生物的学者,国家重点实验室成员,于不惑之年学习python,实为我等学习楷模。先前我并没有关注武汉肺炎的具体数据,也没有画过类似的数据分布图。于是就拿了两个小时,专门研究了一下,遂成此文。 2月6日追记:本文发布后,腾讯的数据源多次变更u
听说想当黑客的都玩过这个Monyer游戏(1~14攻略)
第零关 进入传送门开始第0关(游戏链接) 请点击链接进入第1关: 连接在左边→ ←连接在右边 看不到啊。。。。(只能看到一堆大佬做完的留名,也能看到菜鸡的我,在后面~~) 直接fn+f12吧 &lt;span&gt;连接在左边→&lt;/span&gt; &lt;a href="first.php"&gt;&lt;/a&gt; &lt;span&gt;←连接在右边&lt;/span&gt; o
在家远程办公效率低?那你一定要收好这个「在家办公」神器!
相信大家都已经收到国务院延长春节假期的消息,接下来,在家远程办公可能将会持续一段时间。 但是问题来了。远程办公不是人在电脑前就当坐班了,相反,对于沟通效率,文件协作,以及信息安全都有着极高的要求。有着非常多的挑战,比如: 1在异地互相不见面的会议上,如何提高沟通效率? 2文件之间的来往反馈如何做到及时性?如何保证信息安全? 3如何规划安排每天工作,以及如何进行成果验收? ......
作为一个程序员,内存和磁盘的这些事情,你不得不知道啊!!!
截止目前,我已经分享了如下几篇文章: 一个程序在计算机中是如何运行的?超级干货!!! 作为一个程序员,CPU的这些硬核知识你必须会! 作为一个程序员,内存的这些硬核知识你必须懂! 这些知识可以说是我们之前都不太重视的基础知识,可能大家在上大学的时候都学习过了,但是嘞,当时由于老师讲解的没那么有趣,又加上这些知识本身就比较枯燥,所以嘞,大家当初几乎等于没学。 再说啦,学习这些,也看不出来有什么用啊!
渗透测试-灰鸽子远控木马
木马概述 灰鸽子( Huigezi),原本该软件适用于公司和家庭管理,其功能十分强大,不但能监视摄像头、键盘记录、监控桌面、文件操作等。还提供了黑客专用功能,如:伪装系统图标、随意更换启动项名称和表述、随意更换端口、运行后自删除、毫无提示安装等,并采用反弹链接这种缺陷设计,使得使用者拥有最高权限,一经破解即无法控制。最终导致被黑客恶意使用。原作者的灰鸽子被定义为是一款集多种控制方式于一体的木马程序
Python:爬取疫情每日数据
前言 有部分同学留言说为什么412,这是因为我代码里全国的cookies需要你自己打开浏览器更新好后替换,而且这个cookies大概只能持续20秒左右! 另外全国卫健委的数据格式一直在变,也有可能会导致爬取失败! 我现在已根据2月14日最新通报稿的格式修正了! 目前每天各大平台,如腾讯、今日头条都会更新疫情每日数据,他们的数据源都是一样的,主要都是通过各地的卫健委官网通报。 为什么已经有大量平台做
这个世界上人真的分三六九等,你信吗?
偶然间,在知乎上看到一个问题 一时间,勾起了我深深的回忆。 以前在厂里打过两次工,做过家教,干过辅导班,做过中介。零下几度的晚上,贴过广告,满脸、满手地长冻疮。   再回首那段岁月,虽然苦,但让我学会了坚持和忍耐。让我明白了,在这个世界上,无论环境多么的恶劣,只要心存希望,星星之火,亦可燎原。   下文是原回答,希望能对你能有所启发。   如果我说,这个世界上人真的分三六九等,
B 站上有哪些很好的学习资源?
哇说起B站,在小九眼里就是宝藏般的存在,放年假宅在家时一天刷6、7个小时不在话下,更别提今年的跨年晚会,我简直是跪着看完的!! 最早大家聚在在B站是为了追番,再后来我在上面刷欧美新歌和漂亮小姐姐的舞蹈视频,最近两年我和周围的朋友们已经把B站当作学习教室了,而且学习成本还免费,真是个励志的好平台ヽ(.◕ฺˇд ˇ◕ฺ;)ノ 下面我们就来盘点一下B站上优质的学习资源: 综合类 Oeasy: 综合
雷火神山直播超两亿,Web播放器事件监听是怎么实现的?
Web播放器解决了在手机浏览器和PC浏览器上播放音视频数据的问题,让视音频内容可以不依赖用户安装App,就能进行播放以及在社交平台进行传播。在视频业务大数据平台中,播放数据的统计分析非常重要,所以Web播放器在使用过程中,需要对其内部的数据进行收集并上报至服务端,此时,就需要对发生在其内部的一些播放行为进行事件监听。 那么Web播放器事件监听是怎么实现的呢? 01 监听事件明细表 名
3万字总结,Mysql优化之精髓
本文知识点较多,篇幅较长,请耐心学习 MySQL已经成为时下关系型数据库产品的中坚力量,备受互联网大厂的青睐,出门面试想进BAT,想拿高工资,不会点MySQL优化知识,拿offer的成功率会大大下降。 为什么要优化 系统的吞吐量瓶颈往往出现在数据库的访问速度上 随着应用程序的运行,数据库的中的数据会越来越多,处理时间会相应变慢 数据是存放在磁盘上的,读写速度无法和内存相比 如何优化 设计
Python新型冠状病毒疫情数据自动爬取+统计+发送报告+数据屏幕(三)发送篇
今天介绍的项目是使用 Itchat 发送统计报告 项目功能设计: 定时爬取疫情数据存入Mysql 进行数据分析制作疫情报告 使用itchat给亲人朋友发送分析报告(本文) 基于Django做数据屏幕 使用Tableau做数据分析 来看看最终效果 目前已经完成,预计2月12日前更新 使用 itchat 发送数据统计报告 itchat 是一个基于 web微信的一个框架,但微信官方并不允
作为程序员的我,大学四年一直自学,全靠这些实用工具和学习网站!
我本人因为高中沉迷于爱情,导致学业荒废,后来高考,毫无疑问进入了一所普普通通的大学,实在惭愧...... 我又是那么好强,现在学历不行,没办法改变的事情了,所以,进入大学开始,我就下定决心,一定要让自己掌握更多的技能,尤其选择了计算机这个行业,一定要多学习技术。 在进入大学学习不久后,我就认清了一个现实:我这个大学的整体教学质量和学习风气,真的一言难尽,懂的人自然知道怎么回事? 怎么办?我该如何更好的提升
粒子群算法求解物流配送路线问题(python)
粒子群算法求解物流配送路线问题(python) 1.查找论文文献 找一篇物流配送路径优化+粒子群算法求解的论文 参考文献:基于混沌粒子群算法的物流配送路径优化 2.了解粒子群算法的原理 讲解通俗易懂,有数学实例的博文:https://blog.csdn.net/daaikuaichuan/article/details/81382794 3.确定编码方式和解码策略 3.1编码方式 物流配送路线的
教你如何编写第一个简单的爬虫
很多人知道爬虫,也很想利用爬虫去爬取自己想要的数据,那么爬虫到底怎么用呢?今天就教大家编写一个简单的爬虫。 下面以爬取笔者的个人博客网站为例获取第一篇文章的标题名称,教大家学会一个简单的爬虫。 第一步:获取页面 #!/usr/bin/python # coding: utf-8 import requests #引入包requests link = "http://www.santostang.
前端JS初级面试题二 (。•ˇ‸ˇ•。)老铁们!快来瞧瞧自己都会了么
1. 传统事件绑定和符合W3C标准的事件绑定有什么区别? 传统事件绑定 &lt;div onclick=""&gt;123&lt;/div&gt; div1.onclick = function(){}; &lt;button onmouseover=""&gt;&lt;/button&gt; 注意: 如果给同一个元素绑定了两次或多次相同类型的事件,那么后面的绑定会覆盖前面的绑定 (不支持DOM事...
相关热词 c# 压缩图片好麻烦 c#计算数组中的平均值 c#获取路由参数 c#日期精确到分钟 c#自定义异常必须继承 c#查表并返回值 c# 动态 表达式树 c# 监控方法耗时 c# listbox c#chart显示滚动条
立即提问

相似问题

3
【Android stdio】运行hello world报错,希望大神答疑解惑
1
C中指向double型的指针作形参,在运算编译的时候报错,不知道原因?
2
安卓Android stdio,遇到了这个问题,图片
1
总是gcc: fatal error: input file ‘\xe6\x9c\xaa\xe5\x90\x8d’ is the same as output file报错怎么办呀
3
VS2010 编译出错 无法打开包括文件:“stdio.h”: No such file or directory 1>,还有救吗
2
android stdio新建项目出现error(27,13)求解决
0
android stdio程序不能在虚拟机上运行怎么办?
3
(C语言)在一组字符串中查找某个特定的字符值,编译无错误,但是运行总是报错
2
数组元素ch[j]=='('报错,我是想作比较不是赋值,编译器报错->'=' : left operand must be l-value 。
1
Xcode 编译问题,出现Thread 1: EXC_BAD_ACCESS (code=1, address=0x7ffee876ff3c)
1
以下交换值得函数为何在.c格式下报错,.cpp才成功,为何?
0
Android stdio 模拟器一直黑(白)屏,一直出现emulator: Trying to vcpu execute at eip:8ad16f
2
求教本机编译通过oj上却显示编译错误的原因?
2
给字符数组赋值的小问题
3
大一新生刷题遇到的问题,为什么报错??
1
Android stdio中写好的程序在虚拟器中不能运行是为什么?
1
code blocks可以编译但是到Linux里的vim时无法编译成功是怎么回事?
1
导入*.cpp文件后,编译出现错误error LNK2005
1
这是一个关于输入语句报错的问题
1
用posix共享内存api,报错segmentation fault(core dump)