IDEA2019.2版本,无法识别本地Maven的问题

图片说明

图片说明

就是不显示本地仓库信息。这就导致Maven无法导入jar包。编写POM.xml也没有提示啥的。

1个回答

TIN9514
TIN9514 这些配置我知道,问题是IDEA在加载本地仓库的时候无法加载本地仓库创建索引。
2 个月之前 回复
TIN9514
TIN9514 这些配置我知道,问题是IDEA在加载本地仓库的时候无法加载本地仓库创建索引。
2 个月之前 回复
Csdn user default icon
上传中...
上传图片
插入图片
抄袭、复制答案,以达到刷声望分或其他目的的行为,在CSDN问答是严格禁止的,一经发现立刻封号。是时候展现真正的技术了!
其他相关推荐
IDEA 的maven出错 Unable to import maven project
maven也自己下了,配置也都照着网上配了,环境变量什么的都弄了,IDEA的maven也照着网上配了 这是错误日志 java.lang.RuntimeException: Cannot reconnect. at org.jetbrains.idea.maven.server.RemoteObjectWrapper.perform(RemoteObjectWrapper.java:82) at org.jetbrains.idea.maven.server.MavenServerManager.applyProfiles(MavenServerManager.java:550) at org.jetbrains.idea.maven.project.MavenProjectReader.applyProfiles(MavenProjectReader.java:397) at org.jetbrains.idea.maven.project.MavenProjectReader.doReadProjectModel(MavenProjectReader.java:103) at org.jetbrains.idea.maven.project.MavenProjectReader.readProject(MavenProjectReader.java:62) at org.jetbrains.idea.maven.project.MavenProject.read(MavenProject.java:639) at org.jetbrains.idea.maven.project.MavenProjectsTree.doUpdate(MavenProjectsTree.java:554) at org.jetbrains.idea.maven.project.MavenProjectsTree.doAdd(MavenProjectsTree.java:499) at org.jetbrains.idea.maven.project.MavenProjectsTree.update(MavenProjectsTree.java:460) at org.jetbrains.idea.maven.project.MavenProjectsTree.updateAll(MavenProjectsTree.java:431) at org.jetbrains.idea.maven.project.MavenProjectsProcessorReadingTask.perform(MavenProjectsProcessorReadingTask.java:60) at org.jetbrains.idea.maven.project.MavenProjectsProcessor.doProcessPendingTasks(MavenProjectsProcessor.java:132) at org.jetbrains.idea.maven.project.MavenProjectsProcessor.access$000(MavenProjectsProcessor.java:32) at org.jetbrains.idea.maven.project.MavenProjectsProcessor$2.run(MavenProjectsProcessor.java:107) at org.jetbrains.idea.maven.utils.MavenUtil.lambda$runInBackground$5(MavenUtil.java:460) at com.intellij.openapi.application.impl.ApplicationImpl$1.run(ApplicationImpl.java:330) at java.util.concurrent.Executors$RunnableAdapter.call(Executors.java:511) at java.util.concurrent.FutureTask.run(FutureTask.java:266) at java.util.concurrent.ThreadPoolExecutor.runWorker(ThreadPoolExecutor.java:1142) at java.util.concurrent.ThreadPoolExecutor$Worker.run(ThreadPoolExecutor.java:617) at java.lang.Thread.run(Thread.java:745) Caused by: java.rmi.RemoteException: Cannot start maven service; nested exception is: com.intellij.execution.ExecutionException: at org.jetbrains.idea.maven.server.MavenServerManager.create(MavenServerManager.java:175) at org.jetbrains.idea.maven.server.MavenServerManager.create(MavenServerManager.java:80) at org.jetbrains.idea.maven.server.RemoteObjectWrapper.getOrCreateWrappee(RemoteObjectWrapper.java:41) at org.jetbrains.idea.maven.server.MavenServerManager$7.execute(MavenServerManager.java:553) at org.jetbrains.idea.maven.server.MavenServerManager$7.execute(MavenServerManager.java:550) at org.jetbrains.idea.maven.server.RemoteObjectWrapper.perform(RemoteObjectWrapper.java:76) ... 20 more Caused by: com.intellij.execution.ExecutionException: at com.intellij.execution.rmi.RemoteProcessSupport.acquire(RemoteProcessSupport.java:166) at org.jetbrains.idea.maven.server.MavenServerManager.create(MavenServerManager.java:172) ... 25 more 2017-10-27 13:52:43,319 [ 628599] ERROR - #org.jetbrains.idea.maven - IntelliJ IDEA 2017.2.5 Build #IU-172.4343.14 2017-10-27 13:52:43,319 [ 628599] ERROR - #org.jetbrains.idea.maven - JDK: 1.8.0_152-release 2017-10-27 13:52:43,319 [ 628599] ERROR - #org.jetbrains.idea.maven - VM: OpenJDK 64-Bit Server VM 2017-10-27 13:52:43,319 [ 628599] ERROR - #org.jetbrains.idea.maven - Vendor: JetBrains s.r.o 2017-10-27 13:52:43,319 [ 628599] ERROR - #org.jetbrains.idea.maven - OS: Windows 10 2017-10-27 13:52:43,319 [ 628599] ERROR - #org.jetbrains.idea.maven - Last Action: ShowSettings
maven配置私服打包报错Failed to execute goal org.apache.maven.plugins:maven-compiler-plugin:3.5:compile
直接使用阿里云镜像仓库打包没问题,替换为私服镜像仓库后报错: 就是pom.xml中的plugin报错 ``` <plugin> <groupId>org.apache.maven.plugins</groupId> <artifactId>maven-compiler-plugin</artifactId> <version>3.5</version> <configuration> <source>1.8</source> <target>1.8</target> <encoding>UTF-8</encoding> </configuration> </plugin> ``` 网上找了半天说这个指定的jdk版本的问题,查了一下版本没问题都是1.8 报错内容: [ERROR] Failed to execute goal org.apache.maven.plugins:maven-compiler-plugin:3.5:compile (default-compile) on project mytest-web: Execution default-compile of goal org.apache.maven.plugins:maven-compiler-plugin:3.5:compile failed: Plugin org.apache.maven.plugins:maven-compiler-plugin:3.5 or one of its dependencies could not be resolved: Failed to collect dependencies at org.apache.maven.plugins:maven-compiler-plugin:jar:3.5 -> org.apache.maven:maven-toolchain:jar:2.2.1 -> org.apache.maven:maven-core:jar:2.2.1 -> commons-cli:commons-cli:jar:1.2: Failed to read artifact descriptor for commons-cli:commons-cli:jar:1.2: Failure to find org.apache:apache:pom:4 in http://localhost:8081/nexus/content/groups/public/ was cached in the local repository, resolution will not be reattempted until the update interval of public has elapsed or updates are forced -> [Help 1] org.apache.maven.lifecycle.LifecycleExecutionException: Failed to execute goal org.apache.maven.plugins:maven-compiler-plugin:3.5:compile (default-compile) on project mytest-web: Execution default-compile of goal org.apache.maven.plugins:maven-compiler-plugin:3.5:compile failed: Plugin org.apache.maven.plugins:maven-compiler-plugin:3.5 or one of its dependencies could not be resolved: Failed to collect dependencies at org.apache.maven.plugins:maven-compiler-plugin:jar:3.5 -> org.apache.maven:maven-toolchain:jar:2.2.1 -> org.apache.maven:maven-core:jar:2.2.1 -> commons-cli:commons-cli:jar:1.2 at org.apache.maven.lifecycle.internal.MojoExecutor.execute(MojoExecutor.java:213) at org.apache.maven.lifecycle.internal.MojoExecutor.execute(MojoExecutor.java:154) at org.apache.maven.lifecycle.internal.MojoExecutor.execute(MojoExecutor.java:146) at org.apache.maven.lifecycle.internal.LifecycleModuleBuilder.buildProject(LifecycleModuleBuilder.java:117) at org.apache.maven.lifecycle.internal.LifecycleModuleBuilder.buildProject(LifecycleModuleBuilder.java:81) at org.apache.maven.lifecycle.internal.builder.singlethreaded.SingleThreadedBuilder.build(SingleThreadedBuilder.java:51) at org.apache.maven.lifecycle.internal.LifecycleStarter.execute(LifecycleStarter.java:128) at org.apache.maven.DefaultMaven.doExecute(DefaultMaven.java:309) at org.apache.maven.DefaultMaven.doExecute(DefaultMaven.java:194) at org.apache.maven.DefaultMaven.execute(DefaultMaven.java:107) at org.apache.maven.cli.MavenCli.execute(MavenCli.java:993) at org.apache.maven.cli.MavenCli.doMain(MavenCli.java:345) at org.apache.maven.cli.MavenCli.main(MavenCli.java:191) at sun.reflect.NativeMethodAccessorImpl.invoke0(Native Method) at sun.reflect.NativeMethodAccessorImpl.invoke(NativeMethodAccessorImpl.java:62) at sun.reflect.DelegatingMethodAccessorImpl.invoke(DelegatingMethodAccessorImpl.java:43) at java.lang.reflect.Method.invoke(Method.java:498) at org.codehaus.plexus.classworlds.launcher.Launcher.launchEnhanced(Launcher.java:289) at org.codehaus.plexus.classworlds.launcher.Launcher.launch(Launcher.java:229) at org.codehaus.plexus.classworlds.launcher.Launcher.mainWithExitCode(Launcher.java:415) at org.codehaus.plexus.classworlds.launcher.Launcher.main(Launcher.java:356) Caused by: org.apache.maven.plugin.PluginExecutionException: Execution default-compile of goal org.apache.maven.plugins:maven-compiler-plugin:3.5:compile failed: Plugin org.apache.maven.plugins:maven-compiler-plugin:3.5 or one of its dependencies could not be resolved: Failed to collect dependencies at org.apache.maven.plugins:maven-compiler-plugin:jar:3.5 -> org.apache.maven:maven-toolchain:jar:2.2.1 -> org.apache.maven:maven-core:jar:2.2.1 -> commons-cli:commons-cli:jar:1.2 at org.apache.maven.plugin.DefaultBuildPluginManager.executeMojo(DefaultBuildPluginManager.java:106) at org.apache.maven.lifecycle.internal.MojoExecutor.execute(MojoExecutor.java:208) ... 20 more Caused by: org.apache.maven.plugin.PluginResolutionException: Plugin org.apache.maven.plugins:maven-compiler-plugin:3.5 or one of its dependencies could not be resolved: Failed to collect dependencies at org.apache.maven.plugins:maven-compiler-plugin:jar:3.5 -> org.apache.maven:maven-toolchain:jar:2.2.1 -> org.apache.maven:maven-core:jar:2.2.1 -> commons-cli:commons-cli:jar:1.2 at org.apache.maven.plugin.internal.DefaultPluginDependenciesResolver.resolveInternal(DefaultPluginDependenciesResolver.java:214) at org.apache.maven.plugin.internal.DefaultPluginDependenciesResolver.resolve(DefaultPluginDependenciesResolver.java:149) at org.apache.maven.plugin.internal.DefaultMavenPluginManager.createPluginRealm(DefaultMavenPluginManager.java:402) at org.apache.maven.plugin.internal.DefaultMavenPluginManager.setupPluginRealm(DefaultMavenPluginManager.java:374) at org.apache.maven.plugin.DefaultBuildPluginManager.getPluginRealm(DefaultBuildPluginManager.java:231) at org.apache.maven.plugin.DefaultBuildPluginManager.executeMojo(DefaultBuildPluginManager.java:102) ... 21 more Caused by: org.eclipse.aether.collection.DependencyCollectionException: Failed to collect dependencies at org.apache.maven.plugins:maven-compiler-plugin:jar:3.5 -> org.apache.maven:maven-toolchain:jar:2.2.1 -> org.apache.maven:maven-core:jar:2.2.1 -> commons-cli:commons-cli:jar:1.2 at org.eclipse.aether.internal.impl.DefaultDependencyCollector.collectDependencies(DefaultDependencyCollector.java:300) at org.eclipse.aether.internal.impl.DefaultRepositorySystem.collectDependencies(DefaultRepositorySystem.java:325) at org.apache.maven.plugin.internal.DefaultPluginDependenciesResolver.resolveInternal(DefaultPluginDependenciesResolver.java:202) ... 26 more Caused by: org.eclipse.aether.resolution.ArtifactDescriptorException: Failed to read artifact descriptor for commons-cli:commons-cli:jar:1.2 at org.apache.maven.repository.internal.DefaultArtifactDescriptorReader.loadPom(DefaultArtifactDescriptorReader.java:330) at org.apache.maven.repository.internal.DefaultArtifactDescriptorReader.readArtifactDescriptor(DefaultArtifactDescriptorReader.java:199) at org.eclipse.aether.internal.impl.DefaultDependencyCollector.resolveCachedArtifactDescriptor(DefaultDependencyCollector.java:544) at org.eclipse.aether.internal.impl.DefaultDependencyCollector.getArtifactDescriptorResult(DefaultDependencyCollector.java:528) at org.eclipse.aether.internal.impl.DefaultDependencyCollector.processDependency(DefaultDependencyCollector.java:418) at org.eclipse.aether.internal.impl.DefaultDependencyCollector.processDependency(DefaultDependencyCollector.java:372) at org.eclipse.aether.internal.impl.DefaultDependencyCollector.process(DefaultDependencyCollector.java:360) at org.eclipse.aether.internal.impl.DefaultDependencyCollector.doRecurse(DefaultDependencyCollector.java:513) at org.eclipse.aether.internal.impl.DefaultDependencyCollector.processDependency(DefaultDependencyCollector.java:467) at org.eclipse.aether.internal.impl.DefaultDependencyCollector.processDependency(DefaultDependencyCollector.java:372) at org.eclipse.aether.internal.impl.DefaultDependencyCollector.process(DefaultDependencyCollector.java:360) at org.eclipse.aether.internal.impl.DefaultDependencyCollector.doRecurse(DefaultDependencyCollector.java:513) at org.eclipse.aether.internal.impl.DefaultDependencyCollector.processDependency(DefaultDependencyCollector.java:467) at org.eclipse.aether.internal.impl.DefaultDependencyCollector.processDependency(DefaultDependencyCollector.java:372) at org.eclipse.aether.internal.impl.DefaultDependencyCollector.process(DefaultDependencyCollector.java:360) at org.eclipse.aether.internal.impl.DefaultDependencyCollector.collectDependencies(DefaultDependencyCollector.java:263) ... 28 more Caused by: org.apache.maven.model.resolution.UnresolvableModelException: Failure to find org.apache:apache:pom:4 in http://localhost:8081/nexus/content/groups/public/ was cached in the local repository, resolution will not be reattempted until the update interval of public has elapsed or updates are forced at org.apache.maven.repository.internal.DefaultModelResolver.resolveModel(DefaultModelResolver.java:178) at org.apache.maven.repository.internal.DefaultModelResolver.resolveModel(DefaultModelResolver.java:224) at org.apache.maven.model.building.DefaultModelBuilder.readParentExternally(DefaultModelBuilder.java:1051) at org.apache.maven.model.building.DefaultModelBuilder.readParent(DefaultModelBuilder.java:829) at org.apache.maven.model.building.DefaultModelBuilder.build(DefaultModelBuilder.java:331) at org.apache.maven.repository.internal.DefaultArtifactDescriptorReader.loadPom(DefaultArtifactDescriptorReader.java:321) ... 43 more Caused by: org.eclipse.aether.resolution.ArtifactResolutionException: Failure to find org.apache:apache:pom:4 in http://localhost:8081/nexus/content/groups/public/ was cached in the local repository, resolution will not be reattempted until the update interval of public has elapsed or updates are forced at org.eclipse.aether.internal.impl.DefaultArtifactResolver.resolve(DefaultArtifactResolver.java:453) at org.eclipse.aether.internal.impl.DefaultArtifactResolver.resolveArtifacts(DefaultArtifactResolver.java:255) at org.eclipse.aether.internal.impl.DefaultArtifactResolver.resolveArtifact(DefaultArtifactResolver.java:232) at org.apache.maven.repository.internal.DefaultModelResolver.resolveModel(DefaultModelResolver.java:174) ... 48 more Caused by: org.eclipse.aether.transfer.ArtifactNotFoundException: Failure to find org.apache:apache:pom:4 in http://localhost:8081/nexus/content/groups/public/ was cached in the local repository, resolution will not be reattempted until the update interval of public has elapsed or updates are forced at org.eclipse.aether.internal.impl.DefaultUpdateCheckManager.newException(DefaultUpdateCheckManager.java:240) at org.eclipse.aether.internal.impl.DefaultUpdateCheckManager.checkArtifact(DefaultUpdateCheckManager.java:215) at org.eclipse.aether.internal.impl.DefaultArtifactResolver.gatherDownloads(DefaultArtifactResolver.java:594) at org.eclipse.aether.internal.impl.DefaultArtifactResolver.performDownloads(DefaultArtifactResolver.java:512) at org.eclipse.aether.internal.impl.DefaultArtifactResolver.resolve(DefaultArtifactResolver.java:430) ... 51 more [ERROR] [ERROR] Re-run Maven using the -X switch to enable full debug logging. [ERROR] [ERROR] For more information about the errors and possible solutions, please read the following articles: [ERROR] [Help 1] http://cwiki.apache.org/confluence/display/MAVEN/PluginResolutionException
新建maven环境,没有junit:jar:3.8.1 ,但是maven自己是依赖这个版本的
新建了maven环境 打包的时候报Failed to execute goal org.apache.maven.plugins:maven-resources-plugin:2.6:resources (default-resources) on project wostore: Execution default-resources of goal org.apache.maven.plugins:maven-resources-plugin:2.6:resources failed: Plugin org.apache.maven.plugins:maven-resources-plugin:2.6 or one of its dependencies could not be resolved: Failure to find junit:junit:jar:3.8.1 in http://repo.maven.apache.org/maven2 was cached in the local repository, resolution will not be reattempted until the update interval of central has elapsed or updates are forced -> [Help 1] 这是他自己需要的依赖,但是发现现在maven自己已经不能提供这个版本了,真奇怪
关于ideal2019版本配置maven问题
![图片说明](https://img-ask.csdn.net/upload/201909/13/1568352987_566484.png) 今天配置idea时候,我是用的是idea2019版本以及maven3.6的版本,以前用的是老版本没有问题,但是我觉得这不是版本的问题存在,我在cmd里面输入命令mvn -v是没有任何问题的系统可以看见![图片说明](https://img-ask.csdn.net/upload/201909/13/1568353130_795335.png) 但是一创建maven项目以后就报这个错误,我真的很无助,昨晚已经搞了好久,今天又重新安装了一遍maven还是不行,能给各位大佬提供解决思路的唯有我的错误日志,![图片说明](https://img-ask.csdn.net/upload/201909/13/1568353190_197996.png) 而且我确定一定以及肯定是,我的maven的本地仓库配置以及ideal里面maven版本的地址没有一点的问题。 1) No implementation for org.apache.maven.model.path.PathTranslator was bound. while locating org.apache.maven.model.path.PathTranslator for field at org.apache.maven.model.interpolation.AbstractStringBasedModelInterpolator.pathTranslator(Unknown Source) at org.codehaus.plexus.DefaultPlexusContainer$1.configure(DefaultPlexusContainer.java:350) 2) No implementation for org.apache.maven.model.path.UrlNormalizer was bound. while locating org.apache.maven.model.path.UrlNormalizer for field at org.apache.maven.model.interpolation.AbstractStringBasedModelInterpolator.urlNormalizer(Unknown Source) at org.codehaus.plexus.DefaultPlexusContainer$1.configure(DefaultPlexusContainer.java:350) 2 errors java.lang.RuntimeException: com.google.inject.CreationException: Unable to create injector, see the following errors: 1) No implementation for org.apache.maven.model.path.PathTranslator was bound. while locating org.apache.maven.model.path.PathTranslator for field at org.apache.maven.model.interpolation.AbstractStringBasedModelInterpolator.pathTranslator(Unknown Source) at org.codehaus.plexus.DefaultPlexusContainer$1.configure(DefaultPlexusContainer.java:350) 2) No implementation for org.apache.maven.model.path.UrlNormalizer was bound. while locating org.apache.maven.model.path.UrlNormalizer for field at org.apache.maven.model.interpolation.AbstractStringBasedModelInterpolator.urlNormalizer(Unknown Source) at org.codehaus.plexus.DefaultPlexusContainer$1.configure(DefaultPlexusContainer.java:350) 2 errors at com.google.inject.internal.Errors.throwCreationExceptionIfErrorsExist(Errors.java:543) at com.google.inject.internal.InternalInjectorCreator.initializeStatically(InternalInjectorCreator.java:159) at com.google.inject.internal.InternalInjectorCreator.build(InternalInjectorCreator.java:106) at com.google.inject.Guice.createInjector(Guice.java:87) at com.google.inject.Guice.createInjector(Guice.java:69) at com.google.inject.Guice.createInjector(Guice.java:59) at org.codehaus.plexus.DefaultPlexusContainer.addComponent(DefaultPlexusContainer.java:344) at org.codehaus.plexus.DefaultPlexusContainer.addComponent(DefaultPlexusContainer.java:332) at org.jetbrains.idea.maven.server.Maven3XServerEmbedder.customizeComponents(Maven3XServerEmbedder.java:573) at org.jetbrains.idea.maven.server.Maven3XServerEmbedder.customize(Maven3XServerEmbedder.java:542) at java.base/jdk.internal.reflect.NativeMethodAccessorImpl.invoke0(Native Method) at java.base/jdk.internal.reflect.NativeMethodAccessorImpl.invoke(NativeMethodAccessorImpl.java:62) at java.base/jdk.internal.reflect.DelegatingMethodAccessorImpl.invoke(DelegatingMethodAccessorImpl.java:43) at java.base/java.lang.reflect.Method.invoke(Method.java:566) at java.rmi/sun.rmi.server.UnicastServerRef.dispatch(UnicastServerRef.java:359) at java.rmi/sun.rmi.transport.Transport$1.run(Transport.java:200) at java.rmi/sun.rmi.transport.Transport$1.run(Transport.java:197) at java.base/java.security.AccessController.doPrivileged(Native Method) at java.rmi/sun.rmi.transport.Transport.serviceCall(Transport.java:196) at java.rmi/sun.rmi.transport.tcp.TCPTransport.handleMessages(TCPTransport.java:562) at java.rmi/sun.rmi.transport.tcp.TCPTransport$ConnectionHandler.run0(TCPTransport.java:796) at java.rmi/sun.rmi.transport.tcp.TCPTransport$ConnectionHandler.lambda$run$0(TCPTransport.java:677) at java.base/java.security.AccessController.doPrivileged(Native Method) at java.rmi/sun.rmi.transport.tcp.TCPTransport$ConnectionHandler.run(TCPTransport.java:676) at java.base/java.util.concurrent.ThreadPoolExecutor.runWorker(ThreadPoolExecutor.java:1128) at java.base/java.util.concurrent.ThreadPoolExecutor$Worker.run(ThreadPoolExecutor.java:628) at java.base/java.lang.Thread.run(Thread.java:834) at java.rmi/sun.rmi.transport.StreamRemoteCall.exceptionReceivedFromServer(StreamRemoteCall.java:283) at java.rmi/sun.rmi.transport.StreamRemoteCall.executeCall(StreamRemoteCall.java:260) at java.rmi/sun.rmi.server.UnicastRef.invoke(UnicastRef.java:161) at java.rmi/java.rmi.server.RemoteObjectInvocationHandler.invokeRemoteMethod(RemoteObjectInvocationHandler.java:209) at java.rmi/java.rmi.server.RemoteObjectInvocationHandler.invoke(RemoteObjectInvocationHandler.java:161) at com.sun.proxy.$Proxy135.customize(Unknown Source) at java.base/jdk.internal.reflect.NativeMethodAccessorImpl.invoke0(Native Method) at java.base/jdk.internal.reflect.NativeMethodAccessorImpl.invoke(NativeMethodAccessorImpl.java:62) at java.base/jdk.internal.reflect.DelegatingMethodAccessorImpl.invoke(DelegatingMethodAccessorImpl.java:43) at java.base/java.lang.reflect.Method.invoke(Method.java:566) at com.intellij.execution.rmi.RemoteUtil.invokeRemote(RemoteUtil.java:175) at com.intellij.execution.rmi.RemoteUtil.access$200(RemoteUtil.java:38) at com.intellij.execution.rmi.RemoteUtil$1$1$1.compute(RemoteUtil.java:156) at com.intellij.openapi.util.ClassLoaderUtil.computeWithClassLoader(ClassLoaderUtil.java:45) at com.intellij.execution.rmi.RemoteUtil.executeWithClassLoader(RemoteUtil.java:227) at com.intellij.execution.rmi.RemoteUtil$1$1.invoke(RemoteUtil.java:153) at com.sun.proxy.$Proxy135.customize(Unknown Source) at org.jetbrains.idea.maven.server.MavenEmbedderWrapper.doCustomize(MavenEmbedderWrapper.java:92) at org.jetbrains.idea.maven.server.MavenEmbedderWrapper.lambda$customizeForResolve$1(MavenEmbedderWrapper.java:65) at org.jetbrains.idea.maven.server.RemoteObjectWrapper.perform(RemoteObjectWrapper.java:76) at org.jetbrains.idea.maven.server.MavenEmbedderWrapper.customizeForResolve(MavenEmbedderWrapper.java:64) at org.jetbrains.idea.maven.project.MavenProjectsTree.resolve(MavenProjectsTree.java:1261) at org.jetbrains.idea.maven.project.MavenProjectsProcessorResolvingTask.perform(MavenProjectsProcessorResolvingTask.java:45) at org.jetbrains.idea.maven.project.MavenProjectsProcessor.doProcessPendingTasks(MavenProjectsProcessor.java:140) at org.jetbrains.idea.maven.project.MavenProjectsProcessor.access$000(MavenProjectsProcessor.java:33) at org.jetbrains.idea.maven.project.MavenProjectsProcessor$2.run(MavenProjectsProcessor.java:114) at org.jetbrains.idea.maven.utils.MavenUtil.lambda$runInBackground$5(MavenUtil.java:468) at com.intellij.openapi.application.impl.ApplicationImpl$1.run(ApplicationImpl.java:294) at java.base/java.util.concurrent.Executors$RunnableAdapter.call(Executors.java:515) at java.base/java.util.concurrent.FutureTask.run(FutureTask.java:264) at java.base/java.util.concurrent.ThreadPoolExecutor.runWorker(ThreadPoolExecutor.java:1128) at java.base/java.util.concurrent.ThreadPoolExecutor$Worker.run(ThreadPoolExecutor.java:628) at java.base/java.lang.Thread.run(Thread.java:834) 这么说吧,如若帮我解决了这个问题,微信加我 我给你发个红包算是我的心意了,求求大佬们,好无助,解决了好久没
maven项目创建失败,有IDEA错误日志但还是找不到问题根源
``` 2019-10-08 10:51:50,509 [1021249] INFO - ide.actions.ShowFilePathAction - Exit code 1 2019-10-08 10:51:51,396 [1022136] INFO - mponents.impl.stores.StoreUtil - saveProjectsAndApp took 254 ms 2019-10-08 10:53:28,265 [1119005] INFO - mponents.impl.stores.StoreUtil - saveProjectsAndApp took 142 ms 2019-10-08 10:53:47,104 [1137844] WARN - .impl.LineStatusTrackerManager - Tracker for is being held on dispose by com.intellij.openapi.editor.impl.EditorImpl@5d5743a 2019-10-08 10:53:47,104 [1137844] WARN - .impl.LineStatusTrackerManager - Tracker for is being held on dispose by com.intellij.openapi.editor.impl.EditorImpl@40247cea 2019-10-08 10:53:47,712 [1138452] INFO - mponents.impl.stores.StoreUtil - saveProjectsAndApp took 103 ms 2019-10-08 10:53:49,229 [1139969] INFO - pl.projectlevelman.NewMappings - VCS Root: [svn] - [<Project>] 2019-10-08 10:53:49,396 [1140136] INFO - PerformancePlugin - Performance Plugin is in silent mode 2019-10-08 10:53:49,401 [1140141] INFO - odeStyleSettingsInferComponent - settings inference skipped: already done 2019-10-08 10:53:49,402 [1140142] INFO - .ScalaCompilerReferenceService - Initialized ScalaCompilerReferenceService in clinic_hospital, current compiler mode = JPS 2019-10-08 10:53:49,449 [1140189] INFO - ution.rmi.RemoteProcessSupport - Terminating: 63844/Maven36ServerImpl9b210999 2019-10-08 10:53:49,665 [1140405] INFO - ge.ExternalProjectsDataStorage - Load external projects data in 1 millis (read time: 0) 2019-10-08 10:53:49,691 [1140431] INFO - j.ide.ui.OptionsTopHitProvider - 42 ms spent to cache options in project 2019-10-08 10:53:49,725 [1140465] INFO - .diagnostic.PerformanceWatcher - Post-startup activities under progress took 167ms; general responsiveness: ok; EDT responsiveness: ok 2019-10-08 10:53:49,732 [1140472] INFO - .diagnostic.PerformanceWatcher - Pushing properties took 140ms; general responsiveness: ok; EDT responsiveness: ok 2019-10-08 10:53:49,768 [1140508] INFO - tartup.impl.StartupManagerImpl - D:/clinic_hospital/.idea case-sensitivity: expected=false actual=false 2019-10-08 10:53:49,877 [1140617] INFO - tor.impl.FileEditorManagerImpl - Project opening took 680 ms 2019-10-08 10:53:49,914 [1140654] INFO - .diagnostic.PerformanceWatcher - Indexable file iteration took 182ms; general responsiveness: ok; EDT responsiveness: ok 2019-10-08 10:53:49,934 [1140674] INFO - cloudConfig.CloudConfigManager - === StatusBar ignored === 2019-10-08 10:53:50,028 [1140768] INFO - Json.PackageJsonUpdateNotifier - processPackageJsonFiles [] 2019-10-08 10:53:50,289 [1141029] INFO - j.compiler.server.BuildManager - BUILDER_PROCESS [stdout]: Build process started. Classpath: C:/Program Files/JetBrains/IntelliJ IDEA 2019.2.2/plugins/java/lib/jps-launcher.jar;C:/Program Files/Java/jdk1.8.0_221/lib/tools.jar 2019-10-08 10:53:50,372 [1141112] INFO - pl.projectlevelman.NewMappings - Mapped Roots: 1 2019-10-08 10:53:50,411 [1141151] INFO - j.compiler.server.BuildManager - BUILDER_PROCESS [stderr]: SLF4J: Failed to load class "org.slf4j.impl.StaticLoggerBinder". 2019-10-08 10:53:50,411 [1141151] INFO - j.compiler.server.BuildManager - BUILDER_PROCESS [stderr]: SLF4J: Defaulting to no-operation (NOP) logger implementation 2019-10-08 10:53:50,411 [1141151] INFO - j.compiler.server.BuildManager - BUILDER_PROCESS [stderr]: SLF4J: See http://www.slf4j.org/codes.html#StaticLoggerBinder for further details. 2019-10-08 10:53:51,086 [1141826] INFO - .ScalaCompilerReferenceService - [compiler indices] onCompilationStart. active indexing phases: 1 2019-10-08 10:53:52,381 [1143121] INFO - .ScalaCompilerReferenceService - [compiler indices] onCompilationFinish. success: true, active indexing phases: 0 2019-10-08 10:53:52,867 [1143607] INFO - j.compiler.server.BuildManager - BUILDER_PROCESS [stdout]: Build process started. Classpath: C:/Program Files/JetBrains/IntelliJ IDEA 2019.2.2/plugins/java/lib/jps-launcher.jar;C:/Program Files/Java/jdk1.8.0_221/lib/tools.jar 2019-10-08 10:53:52,924 [1143664] INFO - j.compiler.server.BuildManager - BUILDER_PROCESS [stderr]: SLF4J: Failed to load class "org.slf4j.impl.StaticLoggerBinder". 2019-10-08 10:53:52,924 [1143664] INFO - j.compiler.server.BuildManager - BUILDER_PROCESS [stderr]: SLF4J: Defaulting to no-operation (NOP) logger implementation 2019-10-08 10:53:52,924 [1143664] INFO - j.compiler.server.BuildManager - BUILDER_PROCESS [stderr]: SLF4J: See http://www.slf4j.org/codes.html#StaticLoggerBinder for further details. 2019-10-08 10:53:54,965 [1145705] INFO - ings.impl.UpdateCheckerService - channel: release 2019-10-08 10:54:23,804 [1174544] ERROR - #org.jetbrains.idea.maven - com.google.inject.CreationException: Unable to create injector, see the following errors: 1) No implementation for org.apache.maven.model.path.PathTranslator was bound. while locating org.apache.maven.model.path.PathTranslator for field at org.apache.maven.model.interpolation.AbstractStringBasedModelInterpolator.pathTranslator(Unknown Source) at org.codehaus.plexus.DefaultPlexusContainer$1.configure(DefaultPlexusContainer.java:350) 2) No implementation for org.apache.maven.model.path.UrlNormalizer was bound. while locating org.apache.maven.model.path.UrlNormalizer for field at org.apache.maven.model.interpolation.AbstractStringBasedModelInterpolator.urlNormalizer(Unknown Source) at org.codehaus.plexus.DefaultPlexusContainer$1.configure(DefaultPlexusContainer.java:350) 2 errors java.lang.RuntimeException: com.google.inject.CreationException: Unable to create injector, see the following errors: 1) No implementation for org.apache.maven.model.path.PathTranslator was bound. while locating org.apache.maven.model.path.PathTranslator for field at org.apache.maven.model.interpolation.AbstractStringBasedModelInterpolator.pathTranslator(Unknown Source) at org.codehaus.plexus.DefaultPlexusContainer$1.configure(DefaultPlexusContainer.java:350) 2) No implementation for org.apache.maven.model.path.UrlNormalizer was bound. while locating org.apache.maven.model.path.UrlNormalizer for field at org.apache.maven.model.interpolation.AbstractStringBasedModelInterpolator.urlNormalizer(Unknown Source) at org.codehaus.plexus.DefaultPlexusContainer$1.configure(DefaultPlexusContainer.java:350) 2 errors at com.google.inject.internal.Errors.throwCreationExceptionIfErrorsExist(Errors.java:543) at com.google.inject.internal.InternalInjectorCreator.initializeStatically(InternalInjectorCreator.java:159) at com.google.inject.internal.InternalInjectorCreator.build(InternalInjectorCreator.java:106) at com.google.inject.Guice.createInjector(Guice.java:87) at com.google.inject.Guice.createInjector(Guice.java:69) at com.google.inject.Guice.createInjector(Guice.java:59) at org.codehaus.plexus.DefaultPlexusContainer.addComponent(DefaultPlexusContainer.java:344) at org.codehaus.plexus.DefaultPlexusContainer.addComponent(DefaultPlexusContainer.java:332) at org.jetbrains.idea.maven.server.Maven3XServerEmbedder.customizeComponents(Maven3XServerEmbedder.java:573) at org.jetbrains.idea.maven.server.Maven3XServerEmbedder.customize(Maven3XServerEmbedder.java:542) at java.base/jdk.internal.reflect.NativeMethodAccessorImpl.invoke0(Native Method) at java.base/jdk.internal.reflect.NativeMethodAccessorImpl.invoke(NativeMethodAccessorImpl.java:62) at java.base/jdk.internal.reflect.DelegatingMethodAccessorImpl.invoke(DelegatingMethodAccessorImpl.java:43) at java.base/java.lang.reflect.Method.invoke(Method.java:566) at java.rmi/sun.rmi.server.UnicastServerRef.dispatch(UnicastServerRef.java:359) at java.rmi/sun.rmi.transport.Transport$1.run(Transport.java:200) at java.rmi/sun.rmi.transport.Transport$1.run(Transport.java:197) at java.base/java.security.AccessController.doPrivileged(Native Method) at java.rmi/sun.rmi.transport.Transport.serviceCall(Transport.java:196) at java.rmi/sun.rmi.transport.tcp.TCPTransport.handleMessages(TCPTransport.java:562) at java.rmi/sun.rmi.transport.tcp.TCPTransport$ConnectionHandler.run0(TCPTransport.java:796) at java.rmi/sun.rmi.transport.tcp.TCPTransport$ConnectionHandler.lambda$run$0(TCPTransport.java:677) at java.base/java.security.AccessController.doPrivileged(Native Method) at java.rmi/sun.rmi.transport.tcp.TCPTransport$ConnectionHandler.run(TCPTransport.java:676) at java.base/java.util.concurrent.ThreadPoolExecutor.runWorker(ThreadPoolExecutor.java:1128) at java.base/java.util.concurrent.ThreadPoolExecutor$Worker.run(ThreadPoolExecutor.java:628) at java.base/java.lang.Thread.run(Thread.java:834) at java.rmi/sun.rmi.transport.StreamRemoteCall.exceptionReceivedFromServer(StreamRemoteCall.java:283) at java.rmi/sun.rmi.transport.StreamRemoteCall.executeCall(StreamRemoteCall.java:260) at java.rmi/sun.rmi.server.UnicastRef.invoke(UnicastRef.java:161) at java.rmi/java.rmi.server.RemoteObjectInvocationHandler.invokeRemoteMethod(RemoteObjectInvocationHandler.java:209) at java.rmi/java.rmi.server.RemoteObjectInvocationHandler.invoke(RemoteObjectInvocationHandler.java:161) at com.sun.proxy.$Proxy185.customize(Unknown Source) at java.base/jdk.internal.reflect.NativeMethodAccessorImpl.invoke0(Native Method) at java.base/jdk.internal.reflect.NativeMethodAccessorImpl.invoke(NativeMethodAccessorImpl.java:62) at java.base/jdk.internal.reflect.DelegatingMethodAccessorImpl.invoke(DelegatingMethodAccessorImpl.java:43) at java.base/java.lang.reflect.Method.invoke(Method.java:566) at com.intellij.execution.rmi.RemoteUtil.invokeRemote(RemoteUtil.java:175) at com.intellij.execution.rmi.RemoteUtil.access$200(RemoteUtil.java:38) at com.intellij.execution.rmi.RemoteUtil$1$1$1.compute(RemoteUtil.java:156) at com.intellij.openapi.util.ClassLoaderUtil.computeWithClassLoader(ClassLoaderUtil.java:45) at com.intellij.execution.rmi.RemoteUtil.executeWithClassLoader(RemoteUtil.java:227) at com.intellij.execution.rmi.RemoteUtil$1$1.invoke(RemoteUtil.java:153) at com.sun.proxy.$Proxy185.customize(Unknown Source) at org.jetbrains.idea.maven.server.MavenEmbedderWrapper.doCustomize(MavenEmbedderWrapper.java:92) at org.jetbrains.idea.maven.server.MavenEmbedderWrapper.onWrappeeCreated(MavenEmbedderWrapper.java:45) at org.jetbrains.idea.maven.server.RemoteObjectWrapper.getOrCreateWrappee(RemoteObjectWrapper.java:42) at org.jetbrains.idea.maven.server.MavenEmbedderWrapper.doCustomize(MavenEmbedderWrapper.java:92) at org.jetbrains.idea.maven.server.MavenEmbedderWrapper.lambda$customizeForResolve$1(MavenEmbedderWrapper.java:65) at org.jetbrains.idea.maven.server.RemoteObjectWrapper.perform(RemoteObjectWrapper.java:76) at org.jetbrains.idea.maven.server.MavenEmbedderWrapper.customizeForResolve(MavenEmbedderWrapper.java:64) at org.jetbrains.idea.maven.project.MavenProjectsTree.resolve(MavenProjectsTree.java:1261) at org.jetbrains.idea.maven.project.MavenProjectsProcessorResolvingTask.perform(MavenProjectsProcessorResolvingTask.java:45) at org.jetbrains.idea.maven.project.MavenProjectsProcessor.doProcessPendingTasks(MavenProjectsProcessor.java:140) at org.jetbrains.idea.maven.project.MavenProjectsProcessor.access$000(MavenProjectsProcessor.java:33) at org.jetbrains.idea.maven.project.MavenProjectsProcessor$2.run(MavenProjectsProcessor.java:114) at org.jetbrains.idea.maven.utils.MavenUtil.lambda$runInBackground$5(MavenUtil.java:468) at com.intellij.openapi.application.impl.ApplicationImpl$1.run(ApplicationImpl.java:294) at java.base/java.util.concurrent.Executors$RunnableAdapter.call(Executors.java:515) at java.base/java.util.concurrent.FutureTask.run(FutureTask.java:264) at java.base/java.util.concurrent.ThreadPoolExecutor.runWorker(ThreadPoolExecutor.java:1128) at java.base/java.util.concurrent.ThreadPoolExecutor$Worker.run(ThreadPoolExecutor.java:628) at java.base/java.lang.Thread.run(Thread.java:834) 2019-10-08 10:54:23,805 [1174545] ERROR - #org.jetbrains.idea.maven - IntelliJ IDEA 2019.2.2 Build #IU-192.6603.28 2019-10-08 10:54:23,805 [1174545] ERROR - #org.jetbrains.idea.maven - JDK: 11.0.3; VM: OpenJDK 64-Bit Server VM; Vendor: JetBrains s.r.o 2019-10-08 10:54:23,805 [1174545] ERROR - #org.jetbrains.idea.maven - OS: Windows 8.1 2019-10-08 10:54:23,810 [1174550] ERROR - #org.jetbrains.idea.maven - Last Action: Maven.Reimport 2019-10-08 10:54:26,474 [1177214] INFO - ide.actions.ShowFilePathAction - Exit code 1 2019-10-08 10:54:27,591 [1178331] INFO - mponents.impl.stores.StoreUtil - saveProjectsAndApp took 301 ms ``` 这是从IDEA错误日志上显示的,求个大神帮我找到根源
IDEA 14不能用本地maven下包
IDEA 14不能用本地maven下包IDEA 14不能用本地maven下包 IDEA 14不能用本地maven下包 IDEA 14不能用本地maven下包 只能用自带的
idea无法导入org.springframework.data.jpa.repository.JpaRepository;但是maven存在这个jar
![图片说明](https://img-ask.csdn.net/upload/201905/28/1559011716_244295.png) 求解答是什么原因
springboot2.2.2版本导入Thymeleaf的时候报404,已解决
![图片说明](https://img-ask.csdn.net/upload/201912/30/1577669996_618100.png) springboot2.x版本以及默认是Thymeleaf3.x,我也检查过了, 如果springboot是用1.5的版本的 那时候thymeleaf默认版本是2,需要使用3版本要添加如下版本号:thymeleaf.version 为3.0.9还有thymeleaf-layout-dialect.version为2.1.1那个配置。 而我的springboot是2.2.2版本的,加了这个就找不到thymeleaf的版本了,也就找不到thymeleaf了,动态网页就无法显示。所以我去掉这两行就但还是报404,我就纳闷了,望高人指点!!!
java.util.concurrent.ExecutionException: org.apache.catalina.LifecycleException: Failed to start component [StandardEngine[Tomcat].StandardHost[localhost].TomcatEmbeddedContext[]]
"C:\idea\IntelliJ IDEA 2019.2.4\jbr\bin\java.exe" -agentlib:jdwp=transport=dt_socket,address=127.0.0.1:56203,suspend=y,server=n -XX:TieredStopAtLevel=1 -noverify -Dspring.output.ansi.enabled=always -Dcom.sun.management.jmxremote -Dspring.jmx.enabled=true -Dspring.liveBeansView.mbeanDomain -Dspring.application.admin.enabled=true -Dfile.encoding=UTF-8 -classpath "E:\java\develop\javacode\spring-boot\target\classes;E:\java\develop\javacode\spring-boot\lib\javaee.jar;E:\maven\maven_repository\org\apache\tomcat\embed\tomcat-embed-websocket\8.5.27\tyrus-container-servlet.jar;E:\maven\maven_repository\org\apache\tomcat\embed\tomcat-embed-websocket\8.5.27\javax.websocket-api.jar;E:\maven\maven_repository\org\apache\tomcat\embed\tomcat-embed-websocket\8.5.27\tyrus-container-glassfish-cdi.jar;E:\maven\maven_repository\org\apache\tomcat\embed\tomcat-embed-websocket\8.5.27\tyrus-server.jar;E:\maven\maven_repository\org\apache\tomcat\embed\tomcat-embed-websocket\8.5.27\tyrus-client.jar;E:\maven\maven_repository\org\apache\tomcat\embed\tomcat-embed-websocket\8.5.27\tyrus-spi.jar;E:\maven\maven_repository\org\apache\tomcat\embed\tomcat-embed-websocket\8.5.27\tyrus-container-grizzly.jar;E:\maven\maven_repository\org\apache\tomcat\embed\tomcat-embed-websocket\8.5.27\tyrus-core.jar;E:\maven\maven_repository\org\apache\tomcat\embed\tomcat-embed-websocket\8.5.27\tyrus-websocket-core.jar;E:\maven\maven_repository\org\springframework\boot\spring-boot-starter\2.0.1.RELEASE\spring-boot-starter-2.0.1.RELEASE.jar;E:\maven\maven_repository\org\springframework\boot\spring-boot\2.0.1.RELEASE\spring-boot-2.0.1.RELEASE.jar;E:\maven\maven_repository\org\springframework\spring-context\5.0.5.RELEASE\spring-context-5.0.5.RELEASE.jar;E:\maven\maven_repository\org\springframework\boot\spring-boot-autoconfigure\2.0.1.RELEASE\spring-boot-autoconfigure-2.0.1.RELEASE.jar;E:\maven\maven_repository\org\springframework\boot\spring-boot-starter-logging\2.0.1.RELEASE\spring-boot-starter-logging-2.0.1.RELEASE.jar;E:\maven\maven_repository\ch\qos\logback\logback-classic\1.2.3\logback-classic-1.2.3.jar;E:\maven\maven_repository\ch\qos\logback\logback-core\1.2.3\logback-core-1.2.3.jar;E:\maven\maven_repository\org\apache\logging\log4j\log4j-to-slf4j\2.10.0\log4j-to-slf4j-2.10.0.jar;E:\maven\maven_repository\org\apache\logging\log4j\log4j-api\2.10.0\log4j-api-2.10.0.jar;E:\maven\maven_repository\org\slf4j\jul-to-slf4j\1.7.25\jul-to-slf4j-1.7.25.jar;E:\maven\maven_repository\javax\annotation\javax.annotation-api\1.3.2\javax.annotation-api-1.3.2.jar;E:\maven\maven_repository\org\springframework\spring-core\5.0.5.RELEASE\spring-core-5.0.5.RELEASE.jar;E:\maven\maven_repository\org\springframework\spring-jcl\5.0.5.RELEASE\spring-jcl-5.0.5.RELEASE.jar;E:\maven\maven_repository\org\yaml\snakeyaml\1.19\snakeyaml-1.19.jar;E:\maven\maven_repository\org\springframework\boot\spring-boot-starter-web\2.0.1.RELEASE\spring-boot-starter-web-2.0.1.RELEASE.jar;E:\maven\maven_repository\org\springframework\boot\spring-boot-starter-json\2.0.1.RELEASE\spring-boot-starter-json-2.0.1.RELEASE.jar;E:\maven\maven_repository\com\fasterxml\jackson\core\jackson-databind\2.9.5\jackson-databind-2.9.5.jar;E:\maven\maven_repository\com\fasterxml\jackson\core\jackson-annotations\2.9.0\jackson-annotations-2.9.0.jar;E:\maven\maven_repository\com\fasterxml\jackson\core\jackson-core\2.9.5\jackson-core-2.9.5.jar;E:\maven\maven_repository\com\fasterxml\jackson\datatype\jackson-datatype-jdk8\2.9.5\jackson-datatype-jdk8-2.9.5.jar;E:\maven\maven_repository\com\fasterxml\jackson\datatype\jackson-datatype-jsr310\2.9.5\jackson-datatype-jsr310-2.9.5.jar;E:\maven\maven_repository\com\fasterxml\jackson\module\jackson-module-parameter-names\2.9.5\jackson-module-parameter-names-2.9.5.jar;E:\maven\maven_repository\org\springframework\boot\spring-boot-starter-tomcat\2.0.1.RELEASE\spring-boot-starter-tomcat-2.0.1.RELEASE.jar;E:\maven\maven_repository\org\apache\tomcat\embed\tomcat-embed-core\8.5.29\tomcat-embed-core-8.5.29.jar;E:\maven\maven_repository\org\apache\tomcat\embed\tomcat-embed-el\8.5.29\tomcat-embed-el-8.5.29.jar;E:\maven\maven_repository\org\apache\tomcat\embed\tomcat-embed-websocket\8.5.29\tomcat-embed-websocket-8.5.29.jar;E:\maven\maven_repository\org\hibernate\validator\hibernate-validator\6.0.9.Final\hibernate-validator-6.0.9.Final.jar;E:\maven\maven_repository\javax\validation\validation-api\2.0.1.Final\validation-api-2.0.1.Final.jar;E:\maven\maven_repository\org\jboss\logging\jboss-logging\3.3.2.Final\jboss-logging-3.3.2.Final.jar;E:\maven\maven_repository\com\fasterxml\classmate\1.3.4\classmate-1.3.4.jar;E:\maven\maven_repository\org\springframework\spring-web\5.0.5.RELEASE\spring-web-5.0.5.RELEASE.jar;E:\maven\maven_repository\org\springframework\spring-beans\5.0.5.RELEASE\spring-beans-5.0.5.RELEASE.jar;E:\maven\maven_repository\org\springframework\spring-webmvc\5.0.5.RELEASE\spring-webmvc-5.0.5.RELEASE.jar;E:\maven\maven_repository\org\springframework\spring-aop\5.0.5.RELEASE\spring-aop-5.0.5.RELEASE.jar;E:\maven\maven_repository\org\springframework\spring-expression\5.0.5.RELEASE\spring-expression-5.0.5.RELEASE.jar;E:\maven\maven_repository\org\mybatis\generator\mybatis-generator-core\1.3.5\mybatis-generator-core-1.3.5.jar;E:\maven\maven_repository\mysql\mysql-connector-java\8.0.11\mysql-connector-java-8.0.11.jar;E:\maven\maven_repository\com\google\protobuf\protobuf-java\2.6.0\protobuf-java-2.6.0.jar;E:\maven\maven_repository\org\slf4j\slf4j-api\1.7.25\slf4j-api-1.7.25.jar;C:\idea\IntelliJ IDEA 2019.2.4\lib\idea_rt.jar" com.aipuer.springboot.Application Connected to the target VM, address: '127.0.0.1:56203', transport: 'socket' . ____ _ __ _ _ /\\ / ___'_ __ _ _(_)_ __ __ _ \ \ \ \ ( ( )\___ | '_ | '_| | '_ \/ _` | \ \ \ \ \\/ ___)| |_)| | | | | || (_| | ) ) ) ) ' |____| .__|_| |_|_| |_\__, | / / / / =========|_|==============|___/=/_/_/_/ :: Spring Boot :: (v2.0.1.RELEASE) 2019-12-02 11:09:39.252 INFO 8852 --- [ main] com.aipuer.springboot.Application : Starting Application on PC-20191121IKBV with PID 8852 (E:\java\develop\javacode\spring-boot\target\classes started by Administrator in E:\java\develop\javacode\spring-boot) 2019-12-02 11:09:39.254 INFO 8852 --- [ main] com.aipuer.springboot.Application : No active profile set, falling back to default profiles: default 2019-12-02 11:09:39.281 INFO 8852 --- [ main] ConfigServletWebServerApplicationContext : Refreshing org.springframework.boot.web.servlet.context.AnnotationConfigServletWebServerApplicationContext@78641d23: startup date [Mon Dec 02 11:09:39 CST 2019]; root of context hierarchy WARNING: An illegal reflective access operation has occurred WARNING: Illegal reflective access by org.springframework.cglib.core.ReflectUtils$1 (file:/E:/maven/maven_repository/org/springframework/spring-core/5.0.5.RELEASE/spring-core-5.0.5.RELEASE.jar) to method java.lang.ClassLoader.defineClass(java.lang.String,byte[],int,int,java.security.ProtectionDomain) WARNING: Please consider reporting this to the maintainers of org.springframework.cglib.core.ReflectUtils$1 WARNING: Use --illegal-access=warn to enable warnings of further illegal reflective access operations WARNING: All illegal access operations will be denied in a future release 2019-12-02 11:09:39.917 INFO 8852 --- [ main] o.s.b.w.embedded.tomcat.TomcatWebServer : Tomcat initialized with port(s): 8080 (http) 2019-12-02 11:09:39.932 INFO 8852 --- [ main] o.apache.catalina.core.StandardService : Starting service [Tomcat] 2019-12-02 11:09:39.932 INFO 8852 --- [ main] org.apache.catalina.core.StandardEngine : Starting Servlet Engine: Apache Tomcat/8.5.29 2019-12-02 11:09:39.936 INFO 8852 --- [ost-startStop-1] o.a.catalina.core.AprLifecycleListener : The APR based Apache Tomcat Native library which allows optimal performance in production environments was not found on the java.library.path: [C:\idea\IntelliJ IDEA 2019.2.4\jbr\bin;C:\Windows\Sun\Java\bin;C:\Windows\system32;C:\Windows;E:\app\Administrator\product\11.2.0\dbhome_1\bin;C:\Windows\system32;C:\Windows;C:\Windows\System32\Wbem;C:\Windows\System32\WindowsPowerShell\v1.0\;C:\Program Files (x86)\NVIDIA Corporation\PhysX\Common;E:\java\development\jdk8\bin;E:\java\development\jdk8\jre\bin;E:\java\development\apache-maven-3.3.9-bin\bin;C:\Program Files\MySQL\MySQL Server 8.0\bin\;C:\Program Files\nodejs\;E:\java\svn\bin;C:\Program Files (x86)\Microsoft SQL Server\100\Tools\Binn\;C:\Program Files\Microsoft SQL Server\100\Tools\Binn\;C:\Program Files\Microsoft SQL Server\100\DTS\Binn\;C:\Program Files (x86)\Microsoft SQL Server\100\Tools\Binn\VSShell\Common7\IDE\;C:\Program Files (x86)\Microsoft Visual Studio 9.0\Common7\IDE\PrivateAssemblies\;C:\Program Files (x86)\Microsoft SQL Server\100\DTS\Binn\;C:\Program Files\dotnet\;C:\Program Files\Microsoft SQL Server\130\Tools\Binn\;C:\Program Files\Microsoft SQL Server\Client SDK\ODBC\170\Tools\Binn\;C:\Users\Administrator\AppData\Roaming\npm;.] 2019-12-02 11:09:39.981 ERROR 8852 --- [cat-startStop-1] org.apache.catalina.core.ContainerBase : A child container failed during start java.util.concurrent.ExecutionException: org.apache.catalina.LifecycleException: Failed to start component [StandardEngine[Tomcat].StandardHost[localhost].TomcatEmbeddedContext[]] at java.base/java.util.concurrent.FutureTask.report(FutureTask.java:122) ~[na:na] at java.base/java.util.concurrent.FutureTask.get(FutureTask.java:191) ~[na:na] at org.apache.catalina.core.ContainerBase.startInternal(ContainerBase.java:941) ~[tomcat-embed-core-8.5.29.jar:8.5.29] at org.apache.catalina.core.StandardHost.startInternal(StandardHost.java:872) ~[tomcat-embed-core-8.5.29.jar:8.5.29] at org.apache.catalina.util.LifecycleBase.start(LifecycleBase.java:150) ~[tomcat-embed-core-8.5.29.jar:8.5.29] at org.apache.catalina.core.ContainerBase$StartChild.call(ContainerBase.java:1421) ~[tomcat-embed-core-8.5.29.jar:8.5.29] at org.apache.catalina.core.ContainerBase$StartChild.call(ContainerBase.java:1411) ~[tomcat-embed-core-8.5.29.jar:8.5.29] at java.base/java.util.concurrent.FutureTask.run(FutureTask.java:264) ~[na:na] at java.base/java.util.concurrent.ThreadPoolExecutor.runWorker(ThreadPoolExecutor.java:1128) ~[na:na] at java.base/java.util.concurrent.ThreadPoolExecutor$Worker.run(ThreadPoolExecutor.java:628) ~[na:na] at java.base/java.lang.Thread.run(Thread.java:834) ~[na:na] Caused by: org.apache.catalina.LifecycleException: Failed to start component [StandardEngine[Tomcat].StandardHost[localhost].TomcatEmbeddedContext[]] at org.apache.catalina.util.LifecycleBase.start(LifecycleBase.java:167) ~[tomcat-embed-core-8.5.29.jar:8.5.29] ... 6 common frames omitted Caused by: org.apache.catalina.LifecycleException: Failed to start component [Pipeline[StandardEngine[Tomcat].StandardHost[localhost].TomcatEmbeddedContext[]]] at org.apache.catalina.util.LifecycleBase.start(LifecycleBase.java:167) ~[tomcat-embed-core-8.5.29.jar:8.5.29] at org.apache.catalina.core.StandardContext.startInternal(StandardContext.java:5125) ~[tomcat-embed-core-8.5.29.jar:8.5.29] at org.apache.catalina.util.LifecycleBase.start(LifecycleBase.java:150) ~[tomcat-embed-core-8.5.29.jar:8.5.29] ... 6 common frames omitted Caused by: org.apache.catalina.LifecycleException: Failed to start component [org.apache.catalina.authenticator.NonLoginAuthenticator[]] at org.apache.catalina.util.LifecycleBase.start(LifecycleBase.java:167) ~[tomcat-embed-core-8.5.29.jar:8.5.29] at org.apache.catalina.core.StandardPipeline.startInternal(StandardPipeline.java:182) ~[tomcat-embed-core-8.5.29.jar:8.5.29] at org.apache.catalina.util.LifecycleBase.start(LifecycleBase.java:150) ~[tomcat-embed-core-8.5.29.jar:8.5.29] ... 8 common frames omitted Caused by: java.lang.NoSuchMethodError: 'java.lang.String javax.servlet.ServletContext.getVirtualServerName()' at org.apache.catalina.authenticator.AuthenticatorBase.startInternal(AuthenticatorBase.java:1186) ~[tomcat-embed-core-8.5.29.jar:8.5.29] at org.apache.catalina.util.LifecycleBase.start(LifecycleBase.java:150) ~[tomcat-embed-core-8.5.29.jar:8.5.29] ... 10 common frames omitted 2019-12-02 11:09:39.982 ERROR 8852 --- [ main] org.apache.catalina.core.ContainerBase : A child container failed during start java.util.concurrent.ExecutionException: org.apache.catalina.LifecycleException: Failed to start component [StandardEngine[Tomcat].StandardHost[localhost]] at java.base/java.util.concurrent.FutureTask.report(FutureTask.java:122) ~[na:na] at java.base/java.util.concurrent.FutureTask.get(FutureTask.java:191) ~[na:na] at org.apache.catalina.core.ContainerBase.startInternal(ContainerBase.java:941) ~[tomcat-embed-core-8.5.29.jar:8.5.29] at org.apache.catalina.core.StandardEngine.startInternal(StandardEngine.java:262) ~[tomcat-embed-core-8.5.29.jar:8.5.29] at org.apache.catalina.util.LifecycleBase.start(LifecycleBase.java:150) ~[tomcat-embed-core-8.5.29.jar:8.5.29] at org.apache.catalina.core.StandardService.startInternal(StandardService.java:422) ~[tomcat-embed-core-8.5.29.jar:8.5.29] at org.apache.catalina.util.LifecycleBase.start(LifecycleBase.java:150) ~[tomcat-embed-core-8.5.29.jar:8.5.29] at org.apache.catalina.core.StandardServer.startInternal(StandardServer.java:793) ~[tomcat-embed-core-8.5.29.jar:8.5.29] at org.apache.catalina.util.LifecycleBase.start(LifecycleBase.java:150) ~[tomcat-embed-core-8.5.29.jar:8.5.29] at org.apache.catalina.startup.Tomcat.start(Tomcat.java:367) ~[tomcat-embed-core-8.5.29.jar:8.5.29] at org.springframework.boot.web.embedded.tomcat.TomcatWebServer.initialize(TomcatWebServer.java:107) ~[spring-boot-2.0.1.RELEASE.jar:2.0.1.RELEASE] at org.springframework.boot.web.embedded.tomcat.TomcatWebServer.<init>(TomcatWebServer.java:86) ~[spring-boot-2.0.1.RELEASE.jar:2.0.1.RELEASE] at org.springframework.boot.web.embedded.tomcat.TomcatServletWebServerFactory.getTomcatWebServer(TomcatServletWebServerFactory.java:409) ~[spring-boot-2.0.1.RELEASE.jar:2.0.1.RELEASE] at org.springframework.boot.web.embedded.tomcat.TomcatServletWebServerFactory.getWebServer(TomcatServletWebServerFactory.java:174) ~[spring-boot-2.0.1.RELEASE.jar:2.0.1.RELEASE] at org.springframework.boot.web.servlet.context.ServletWebServerApplicationContext.createWebServer(ServletWebServerApplicationContext.java:179) ~[spring-boot-2.0.1.RELEASE.jar:2.0.1.RELEASE] at org.springframework.boot.web.servlet.context.ServletWebServerApplicationContext.onRefresh(ServletWebServerApplicationContext.java:152) ~[spring-boot-2.0.1.RELEASE.jar:2.0.1.RELEASE] at org.springframework.context.support.AbstractApplicationContext.refresh(AbstractApplicationContext.java:544) ~[spring-context-5.0.5.RELEASE.jar:5.0.5.RELEASE] at org.springframework.boot.web.servlet.context.ServletWebServerApplicationContext.refresh(ServletWebServerApplicationContext.java:140) ~[spring-boot-2.0.1.RELEASE.jar:2.0.1.RELEASE] at org.springframework.boot.SpringApplication.refresh(SpringApplication.java:759) ~[spring-boot-2.0.1.RELEASE.jar:2.0.1.RELEASE] at org.springframework.boot.SpringApplication.refreshContext(SpringApplication.java:395) ~[spring-boot-2.0.1.RELEASE.jar:2.0.1.RELEASE] at org.springframework.boot.SpringApplication.run(SpringApplication.java:327) ~[spring-boot-2.0.1.RELEASE.jar:2.0.1.RELEASE] at org.springframework.boot.SpringApplication.run(SpringApplication.java:1255) ~[spring-boot-2.0.1.RELEASE.jar:2.0.1.RELEASE] at org.springframework.boot.SpringApplication.run(SpringApplication.java:1243) ~[spring-boot-2.0.1.RELEASE.jar:2.0.1.RELEASE] at com.aipuer.springboot.Application.main(Application.java:9) ~[classes/:na] Caused by: org.apache.catalina.LifecycleException: Failed to start component [StandardEngine[Tomcat].StandardHost[localhost]] at org.apache.catalina.util.LifecycleBase.start(LifecycleBase.java:167) ~[tomcat-embed-core-8.5.29.jar:8.5.29] at org.apache.catalina.core.ContainerBase$StartChild.call(ContainerBase.java:1421) ~[tomcat-embed-core-8.5.29.jar:8.5.29] at org.apache.catalina.core.ContainerBase$StartChild.call(ContainerBase.java:1411) ~[tomcat-embed-core-8.5.29.jar:8.5.29] at java.base/java.util.concurrent.FutureTask.run(FutureTask.java:264) ~[na:na] at java.base/java.util.concurrent.ThreadPoolExecutor.runWorker(ThreadPoolExecutor.java:1128) ~[na:na] at java.base/java.util.concurrent.ThreadPoolExecutor$Worker.run(ThreadPoolExecutor.java:628) ~[na:na] at java.base/java.lang.Thread.run(Thread.java:834) ~[na:na] Caused by: org.apache.catalina.LifecycleException: A child container failed during start at org.apache.catalina.core.ContainerBase.startInternal(ContainerBase.java:949) ~[tomcat-embed-core-8.5.29.jar:8.5.29] at org.apache.catalina.core.StandardHost.startInternal(StandardHost.java:872) ~[tomcat-embed-core-8.5.29.jar:8.5.29] at org.apache.catalina.util.LifecycleBase.start(LifecycleBase.java:150) ~[tomcat-embed-core-8.5.29.jar:8.5.29] ... 6 common frames omitted 2019-12-02 11:09:39.982 INFO 8852 --- [ main] o.apache.catalina.core.StandardService : Stopping service [Tomcat] 2019-12-02 11:09:39.983 WARN 8852 --- [ main] ConfigServletWebServerApplicationContext : Exception encountered during context initialization - cancelling refresh attempt: org.springframework.context.ApplicationContextException: Unable to start web server; nested exception is org.springframework.boot.web.server.WebServerException: Unable to start embedded Tomcat 2019-12-02 11:09:39.987 INFO 8852 --- [ main] ConditionEvaluationReportLoggingListener : Error starting ApplicationContext. To display the conditions report re-run your application with 'debug' enabled. 2019-12-02 11:09:39.990 ERROR 8852 --- [ main] o.s.boot.SpringApplication : Application run failed org.springframework.context.ApplicationContextException: Unable to start web server; nested exception is org.springframework.boot.web.server.WebServerException: Unable to start embedded Tomcat at org.springframework.boot.web.servlet.context.ServletWebServerApplicationContext.onRefresh(ServletWebServerApplicationContext.java:155) ~[spring-boot-2.0.1.RELEASE.jar:2.0.1.RELEASE] at org.springframework.context.support.AbstractApplicationContext.refresh(AbstractApplicationContext.java:544) ~[spring-context-5.0.5.RELEASE.jar:5.0.5.RELEASE] at org.springframework.boot.web.servlet.context.ServletWebServerApplicationContext.refresh(ServletWebServerApplicationContext.java:140) ~[spring-boot-2.0.1.RELEASE.jar:2.0.1.RELEASE] at org.springframework.boot.SpringApplication.refresh(SpringApplication.java:759) ~[spring-boot-2.0.1.RELEASE.jar:2.0.1.RELEASE] at org.springframework.boot.SpringApplication.refreshContext(SpringApplication.java:395) ~[spring-boot-2.0.1.RELEASE.jar:2.0.1.RELEASE] at org.springframework.boot.SpringApplication.run(SpringApplication.java:327) ~[spring-boot-2.0.1.RELEASE.jar:2.0.1.RELEASE] at org.springframework.boot.SpringApplication.run(SpringApplication.java:1255) ~[spring-boot-2.0.1.RELEASE.jar:2.0.1.RELEASE] at org.springframework.boot.SpringApplication.run(SpringApplication.java:1243) ~[spring-boot-2.0.1.RELEASE.jar:2.0.1.RELEASE] at com.aipuer.springboot.Application.main(Application.java:9) ~[classes/:na] Caused by: org.springframework.boot.web.server.WebServerException: Unable to start embedded Tomcat at org.springframework.boot.web.embedded.tomcat.TomcatWebServer.initialize(TomcatWebServer.java:126) ~[spring-boot-2.0.1.RELEASE.jar:2.0.1.RELEASE] at org.springframework.boot.web.embedded.tomcat.TomcatWebServer.<init>(TomcatWebServer.java:86) ~[spring-boot-2.0.1.RELEASE.jar:2.0.1.RELEASE] at org.springframework.boot.web.embedded.tomcat.TomcatServletWebServerFactory.getTomcatWebServer(TomcatServletWebServerFactory.java:409) ~[spring-boot-2.0.1.RELEASE.jar:2.0.1.RELEASE] at org.springframework.boot.web.embedded.tomcat.TomcatServletWebServerFactory.getWebServer(TomcatServletWebServerFactory.java:174) ~[spring-boot-2.0.1.RELEASE.jar:2.0.1.RELEASE] at org.springframework.boot.web.servlet.context.ServletWebServerApplicationContext.createWebServer(ServletWebServerApplicationContext.java:179) ~[spring-boot-2.0.1.RELEASE.jar:2.0.1.RELEASE] at org.springframework.boot.web.servlet.context.ServletWebServerApplicationContext.onRefresh(ServletWebServerApplicationContext.java:152) ~[spring-boot-2.0.1.RELEASE.jar:2.0.1.RELEASE] ... 8 common frames omitted Caused by: org.apache.catalina.LifecycleException: Failed to start component [StandardServer[-1]] at org.apache.catalina.util.LifecycleBase.start(LifecycleBase.java:167) ~[tomcat-embed-core-8.5.29.jar:8.5.29] at org.apache.catalina.startup.Tomcat.start(Tomcat.java:367) ~[tomcat-embed-core-8.5.29.jar:8.5.29] at org.springframework.boot.web.embedded.tomcat.TomcatWebServer.initialize(TomcatWebServer.java:107) ~[spring-boot-2.0.1.RELEASE.jar:2.0.1.RELEASE] ... 13 common frames omitted Caused by: org.apache.catalina.LifecycleException: Failed to start component [StandardService[Tomcat]] at org.apache.catalina.util.LifecycleBase.start(LifecycleBase.java:167) ~[tomcat-embed-core-8.5.29.jar:8.5.29] at org.apache.catalina.core.StandardServer.startInternal(StandardServer.java:793) ~[tomcat-embed-core-8.5.29.jar:8.5.29] at org.apache.catalina.util.LifecycleBase.start(LifecycleBase.java:150) ~[tomcat-embed-core-8.5.29.jar:8.5.29] ... 15 common frames omitted Caused by: org.apache.catalina.LifecycleException: Failed to start component [StandardEngine[Tomcat]] at org.apache.catalina.util.LifecycleBase.start(LifecycleBase.java:167) ~[tomcat-embed-core-8.5.29.jar:8.5.29] at org.apache.catalina.core.StandardService.startInternal(StandardService.java:422) ~[tomcat-embed-core-8.5.29.jar:8.5.29] at org.apache.catalina.util.LifecycleBase.start(LifecycleBase.java:150) ~[tomcat-embed-core-8.5.29.jar:8.5.29] ... 17 common frames omitted Caused by: org.apache.catalina.LifecycleException: A child container failed during start at org.apache.catalina.core.ContainerBase.startInternal(ContainerBase.java:949) ~[tomcat-embed-core-8.5.29.jar:8.5.29] at org.apache.catalina.core.StandardEngine.startInternal(StandardEngine.java:262) ~[tomcat-embed-core-8.5.29.jar:8.5.29] at org.apache.catalina.util.LifecycleBase.start(LifecycleBase.java:150) ~[tomcat-embed-core-8.5.29.jar:8.5.29] ... 19 common frames omitted Disconnected from the target VM, address: '127.0.0.1:56203', transport: 'socket' Process finished with exit code 1
idea创建Maven项目没有src目录 Run有错误
![图片说明](https://img-ask.csdn.net/upload/201911/02/1572702296_122439.png) ``` "C:\Program Files\Java\jdk1.8.0_202\bin\java.exe" -Dmaven.multiModuleProjectDirectory=C:\Users\dx\AppData\Local\Temp\archetype1tmp -Xms128m -Xmx512m -Duser.language=zh -Dfile.encoding=UTF-8 -Dmaven.home=E:\server\apache-maven-3.6.1 -Dclassworlds.conf=E:\server\apache-maven-3.6.1\bin\m2.conf "-Dmaven.ext.class.path=E:\IntelliJ IDEA 2019.2\plugins\maven\lib\maven-event-listener.jar" -classpath E:\server\apache-maven-3.6.1\boot\plexus-classworlds-2.6.0.jar org.codehaus.classworlds.Launcher -Didea.version2019.2 --offline -s E:\server\apache-maven-3.6.1\conf\settings.xml -Dmaven.repo.local=E:\server\Repository -DinteractiveMode=false -DgroupId=com -DartifactId=demo33333333 -Dversion=1.0-SNAPSHOT -DarchetypeGroupId=org.apache.maven.archetypes -DarchetypeArtifactId=maven-archetype-webapp -DarchetypeVersion=RELEASE org.apache.maven.plugins:maven-archetype-plugin:RELEASE:generate [INFO] Scanning for projects... [INFO] ------------------------------------------------------------------------ [INFO] BUILD FAILURE [INFO] ------------------------------------------------------------------------ [INFO] Total time: 0.140 s [INFO] Finished at: 2019-11-02T21:41:10+08:00 [INFO] ------------------------------------------------------------------------ [ERROR] Plugin org.apache.maven.plugins:maven-archetype-plugin:RELEASE or one of its dependencies could not be resolved: Failed to read artifact descriptor for org.apache.maven.plugins:maven-archetype-plugin:jar:RELEASE: Failed to resolve version for org.apache.maven.plugins:maven-archetype-plugin:jar:RELEASE: Could not find metadata org.apache.maven.plugins:maven-archetype-plugin/maven-metadata.xml in local (E:\server\Repository) -> [Help 1] [ERROR] [ERROR] To see the full stack trace of the errors, re-run Maven with the -e switch. [ERROR] Re-run Maven using the -X switch to enable full debug logging. [ERROR] [ERROR] For more information about the errors and possible solutions, please read the following articles: [ERROR] [Help 1] http://cwiki.apache.org/confluence/display/MAVEN/PluginResolutionException 网上的解决方法我都试过了还是报错,有大佬帮忙看下吗? ```
maven打包本地jar包出现问题,求解答
maven本地仓库install外部的jar包,出现这个错误 [WARNING] Failed to retrieve plugin descriptor for org.apache.maven.plugins:maven-clean-plugin:2.5: Plugin org.apache.maven.plugins:maven-clean-plugin:2.5 or one of its dependencies could not be resolved: Failed to read artifact descriptor for org.apache.maven.plugins:maven-clean-plugin:jar:2.5 Downloading from central: https://repo.maven.apache.org/maven2/org/apache/maven/plugins/maven-install-plugin/2.4/maven-install-plugin-2.4.pom [WARNING] Failed to retrieve plugin descriptor for org.apache.maven.plugins:maven-install-plugin:2.4: Plugin org.apache.maven.plugins:maven-install-plugin:2.4 or one of its dependencies could not be resolved: Failed to read artifact descriptor for org.apache.maven.plugins:maven-install-plugin:jar:2.4 Downloading from central: https://repo.maven.apache.org/maven2/org/apache/maven/plugins/maven-site-plugin/3.3/maven-site-plugin-3.3.pom [WARNING] Failed to retrieve plugin descriptor for org.apache.maven.plugins:maven-site-plugin:3.3: Plugin org.apache.maven.plugins:maven-site-plugin:3.3 or one of its dependencies could not be resolved: Failed to read artifact descriptor for org.apache.maven.plugins:maven-site-plugin:jar:3.3 Downloading from central: https://repo.maven.apache.org/maven2/org/apache/maven/plugins/maven-antrun-plugin/1.3/maven-antrun-plugin-1.3.pom [WARNING] Failed to retrieve plugin descriptor for org.apache.maven.plugins:maven-antrun-plugin:1.3: Plugin org.apache.maven.plugins:maven-antrun-plugin:1.3 or one of its dependencies could not be resolved: Failed to read artifact descriptor for org.apache.maven.plugins:maven-antrun-plugin:jar:1.3 Downloading from central: https://repo.maven.apache.org/maven2/org/apache/maven/plugins/maven-assembly-plugin/2.2-beta-5/maven-assembly-plugin-2.2-beta-5.pom [WARNING] Failed to retrieve plugin descriptor for org.apache.maven.plugins:maven-assembly-plugin:2.2-beta-5: Plugin org.apache.maven.plugins:maven-assembly-plugin:2.2-beta-5 or one of its dependencies could not be resolved: Failed to read artifact descriptor for org.apache.maven.plugins:maven-assembly-plugin:jar:2.2-beta-5 Downloading from central: https://repo.maven.apache.org/maven2/org/apache/maven/plugins/maven-dependency-plugin/2.8/maven-dependency-plugin-2.8.pom [WARNING] Failed to retrieve plugin descriptor for org.apache.maven.plugins:maven-dependency-plugin:2.8: Plugin org.apache.maven.plugins:maven-dependency-plugin:2.8 or one of its dependencies could not be resolved: Failed to read artifact descriptor for org.apache.maven.plugins:maven-dependency-plugin:jar:2.8 Downloading from central: https://repo.maven.apache.org/maven2/org/apache/maven/plugins/maven-release-plugin/2.5.3/maven-release-plugin-2.5.3.pom [WARNING] Failed to retrieve plugin descriptor for org.apache.maven.plugins:maven-release-plugin:2.5.3: Plugin org.apache.maven.plugins:maven-release-plugin:2.5.3 or one of its dependencies could not be resolved: Failed to read artifact descriptor for org.apache.maven.plugins:maven-release-plugin:jar:2.5.3 Downloading from central: https://repo.maven.apache.org/maven2/org/codehaus/mojo/maven-metadata.xml Downloading from central: https://repo.maven.apache.org/maven2/org/apache/maven/plugins/maven-metadata.xml [WARNING] Could not transfer metadata org.apache.maven.plugins/maven-metadata.xml from/to central (https://repo.maven.apache.org/maven2): Received fatal alert: protocol_version [WARNING] Could not transfer metadata org.codehaus.mojo/maven-metadata.xml from/to central (https://repo.maven.apache.org/maven2): Received fatal alert: protocol_version [WARNING] Failure to transfer org.apache.maven.plugins/maven-metadata.xml from https://repo.maven.apache.org/maven2 was cached in the local repository, resolution will not be reattempted until the update interval of central has elapsed or updates are forced. Original error: Could not transfer metadata org.apache.maven.plugins/maven-metadata.xml from/to central (https://repo.maven.apache.org/maven2): Received fatal alert: protocol_version [WARNING] Failure to transfer org.codehaus.mojo/maven-metadata.xml from https://repo.maven.apache.org/maven2 was cached in the local repository, resolution will not be reattempted until the update interval of central has elapsed or updates are forced. Original error: Could not transfer metadata org.codehaus.mojo/maven-metadata.xml from/to central (https://repo.maven.apache.org/maven2): Received fatal alert: protocol_version [INFO] ------------------------------------------------------------------------ [INFO] BUILD FAILURE [INFO] ------------------------------------------------------------------------ [INFO] Total time: 6.191 s [INFO] Finished at: 2018-07-25T21:57:45+08:00 [INFO] ------------------------------------------------------------------------ [ERROR] No plugin found for prefix 'install' in the current project and in the plugin groups [org.apache.maven.plugins, org.codehaus.mojo] available from the repositories [local (C:\Users\Administrator\.m2\repository), central (https://repo.maven.apache.org/maven2)] -> [Help 1] [ERROR] [ERROR] To see the full stack trace of the errors, re-run Maven with the -e switch. [ERROR] Re-run Maven using the -X switch to enable full debug logging. [ERROR] [ERROR] For more information about the errors and possible solutions, please read the following articles: [ERROR] [Help 1] http://cwiki.apache.org/confluence/display/MAVEN/NoPluginFoundForPrefixException
idea中maven pom.xml 文件不识别
![图片说明](https://img-ask.csdn.net/upload/201705/08/1494233097_734585.jpg) 现在展示的是上面这种, 很多GitHub上导下来的项目,pom文件都不能正常显示。 正常图标应该是下面这种 ![图片说明](https://img-ask.csdn.net/upload/201705/08/1494233123_744224.jpg) 求指点,多谢, pom不识别,导致后面的install打包也都不正常,很不理解为什么会这样。
intellij idea 11.1.3 mybatis自动生成代码异常;求高手
"c:\program files (x86)\jetbrains\intellij idea 11.1.3\jre\jre\bin\java" -Dclassworlds.conf=D:\maven\apache-maven-3.3.9-bin\apache-maven-3.3.9\bin\m2.conf -Dmaven.home=D:\maven\apache-maven-3.3.9-bin\apache-maven-3.3.9 -Didea.launcher.port=7533 "-Didea.launcher.bin.path=C:\Program Files (x86)\JetBrains\IntelliJ IDEA 11.1.3\bin" -Dfile.encoding=UTF-8 -classpath "D:\maven\apache-maven-3.3.9-bin\apache-maven-3.3.9\boot\plexus-classworlds-2.5.2.jar;C:\Program Files (x86)\JetBrains\IntelliJ IDEA 11.1.3\lib\idea_rt.jar" com.intellij.rt.execution.application.AppMain org.codehaus.classworlds.Launcher --no-plugin-registry --fail-fast --strict-checksums --update-snapshots -s D:\maven\apache-maven-3.3.9-bin\apache-maven-3.3.9\conf\settings.xml -Dmaven.repo.local=D:\MvnRepository -f D:\workspace\user_center\pom.xml mybatis-generator:generate -e Exception in thread "main" java.lang.UnsupportedClassVersionError: org/apache/maven/cli/MavenCli : Unsupported major.minor version 51.0 at java.lang.ClassLoader.defineClass1(Native Method) at java.lang.ClassLoader.defineClassCond(ClassLoader.java:631) at java.lang.ClassLoader.defineClass(ClassLoader.java:615) at java.security.SecureClassLoader.defineClass(SecureClassLoader.java:141) at java.net.URLClassLoader.defineClass(URLClassLoader.java:283) at java.net.URLClassLoader.access$000(URLClassLoader.java:58) at java.net.URLClassLoader$1.run(URLClassLoader.java:197) at java.security.AccessController.doPrivileged(Native Method) at java.net.URLClassLoader.findClass(URLClassLoader.java:190) at org.codehaus.plexus.classworlds.realm.ClassRealm.loadClassFromSelf(ClassRealm.java:401) at org.codehaus.plexus.classworlds.strategy.SelfFirstStrategy.loadClass(SelfFirstStrategy.java:42) at org.codehaus.plexus.classworlds.realm.ClassRealm.unsynchronizedLoadClass(ClassRealm.java:271) at org.codehaus.plexus.classworlds.realm.ClassRealm.loadClass(ClassRealm.java:254) at org.codehaus.plexus.classworlds.realm.ClassRealm.loadClass(ClassRealm.java:239) at org.codehaus.plexus.classworlds.launcher.Launcher.getMainClass(Launcher.java:144) at org.codehaus.plexus.classworlds.launcher.Launcher.launchEnhanced(Launcher.java:266) at org.codehaus.plexus.classworlds.launcher.Launcher.launch(Launcher.java:229) at org.codehaus.plexus.classworlds.launcher.Launcher.mainWithExitCode(Launcher.java:415) at org.codehaus.plexus.classworlds.launcher.Launcher.main(Launcher.java:356) at org.codehaus.classworlds.Launcher.main(Launcher.java:47) at sun.reflect.NativeMethodAccessorImpl.invoke0(Native Method) at sun.reflect.NativeMethodAccessorImpl.invoke(NativeMethodAccessorImpl.java:39) at sun.reflect.DelegatingMethodAccessorImpl.invoke(DelegatingMethodAccessorImpl.java:25) at java.lang.reflect.Method.invoke(Method.java:597) at com.intellij.rt.execution.application.AppMain.main(AppMain.java:120) Process finished with exit code 1
IntelliJ IDEA 2019 不支持JDK1.5?
公司有一个老的项目,使用IDEA2019无法编译 项目情况:web工程(非maven项目),jdk1.5,tomcat5.5,struts。 网上所有的情况都试过了,是不是IDEA放弃JDK1.5了? 报错: ![图片说明](https://img-ask.csdn.net/upload/201912/29/1577591916_922722.jpg) 项目设置: 1 ![图片说明](https://img-ask.csdn.net/upload/201912/29/1577591928_74051.png) 2 ![图片说明](https://img-ask.csdn.net/upload/201912/29/1577591971_204515.png) 3 ![图片说明](https://img-ask.csdn.net/upload/201912/29/1577591979_44981.png) idea设置: ![图片说明](https://img-ask.csdn.net/upload/201912/29/1577591993_593724.jpg) 按照官网所说设置成jdk1.5,idea无法启动,报版本过低! ``` https://intellij-support.jetbrains.com/hc/en-us/articles/206544879-Selecting-the-JDK-version-the-IDE-will-run-under ``` ![图片说明](https://img-ask.csdn.net/upload/201912/29/1577601649_947426.png)
在做一个淘淘商城的项目,出现了子项目pom.xml报错的问题
子项目pom.xml区 ``` <project xmlns="http://maven.apache.org/POM/4.0.0" xmlns:xsi="http://www.w3.org/2001/XMLSchema-instance" xsi:schemaLocation="http://maven.apache.org/POM/4.0.0 http://maven.apache.org/xsd/maven-4.0.0.xsd"> <modelVersion>4.0.0</modelVersion> <parent> <groupId>cn.itcast.parent</groupId> <artifactId>itcast-parent</artifactId> <version>0.0.1-SNAPSHOT</version> </parent> <groupId>cn.itcast.usermanage</groupId> <artifactId>itcast-usermanage</artifactId> <version>1.0.0-SNAPSHOT</version> <packaging>war</packaging> <dependencies> <!-- 单元测试 --> <dependency> <groupId>junit</groupId> <artifactId>junit</artifactId> <scope>test</scope> </dependency> <dependency> <groupId>org.springframework</groupId> <artifactId>spring-webmvc</artifactId> </dependency> <dependency> <groupId>org.springframework</groupId> <artifactId>spring-jdbc</artifactId> </dependency> <dependency> <groupId>org.springframework</groupId> <artifactId>spring-aspects</artifactId> </dependency> <!-- Mybatis --> <dependency> <groupId>org.mybatis</groupId> <artifactId>mybatis</artifactId> </dependency> <dependency> <groupId>org.mybatis</groupId> <artifactId>mybatis-spring</artifactId> </dependency> <!-- MySql --> <dependency> <groupId>mysql</groupId> <artifactId>mysql-connector-java</artifactId> </dependency> <dependency> <groupId>org.slf4j</groupId> <artifactId>slf4j-log4j12</artifactId> </dependency> <!-- Jackson Json处理工具包 --> <dependency> <groupId>com.fasterxml.jackson.core</groupId> <artifactId>jackson-databind</artifactId> </dependency> <!-- 连接池 --> <dependency> <groupId>com.jolbox</groupId> <artifactId>bonecp-spring</artifactId> </dependency> <!-- JSP相关 --> <dependency> <groupId>jstl</groupId> <artifactId>jstl</artifactId> </dependency> <dependency> <groupId>javax.servlet</groupId> <artifactId>servlet-api</artifactId> <scope>provided</scope> </dependency> <dependency> <groupId>javax.servlet</groupId> <artifactId>jsp-api</artifactId> <scope>provided</scope> </dependency> <!-- Apache工具组件 --> <dependency> <groupId>org.apache.commons</groupId> <artifactId>commons-lang3</artifactId> </dependency> <dependency> <groupId>org.apache.commons</groupId> <artifactId>commons-io</artifactId> </dependency> <dependency> <groupId>com.github.pagehelper</groupId> <artifactId>pagehelper</artifactId> </dependency> <dependency> <groupId>com.github.jsqlparser</groupId> <artifactId>jsqlparser</artifactId> </dependency> <dependency> <groupId>com.github.abel533</groupId> <artifactId>mapper</artifactId> </dependency> </dependencies> <build> <plugins> <!-- 配置Tomcat插件 --> <plugin> <groupId>org.apache.tomcat.maven</groupId> <artifactId>tomcat7-maven-plugin</artifactId> <configuration> <port>80</port> <!-- http://127.0.0.1:{port}/{path} --> <path>/</path> </configuration> </plugin> </plugins> </build> </project> ``` 报错问题代码区: ``` Multiple annotations found at this line: - Execution default-resources of goal org.apache.maven.plugins:maven-resources-plugin:2.7:resources failed: Plugin org.apache.maven.plugins:maven-resources-plugin:2.7 or one of its dependencies could not be resolved: The following artifacts could not be resolved: org.apache.maven.doxia:doxia-sink-api:jar:1.1, org.apache.maven.doxia:doxia-logging-api:jar:1.1, org.apache.maven:maven-repository-metadata:jar:2.2.1, org.apache.maven:maven-error-diagnostics:jar:2.2.1, org.apache.maven:maven- plugin-descriptor:jar:2.2.1, org.sonatype.plexus:plexus-sec-dispatcher:jar:1.3, org.sonatype.plexus:plexus-cipher:jar:1.4, org.apache.maven:maven-settings:jar:2.2.1, org.apache.maven:maven-monitor:jar:2.2.1: Failure to transfer org.apache.maven.doxia:doxia- sink-api:jar:1.1 from http://maven.aliyun.com/nexus/content/repositories/central/ was cached in the local repository, resolution will not be reattempted until the update interval of alimaven has elapsed or updates are forced. Original error: Could not transfer artifact org.apache.maven.doxia:doxia-sink-api:jar:1.1 from/to alimaven (http://maven.aliyun.com/nexus/content/repositories/central/): The operation was cancelled. (org.apache.maven.plugins:maven-resources-plugin:2.7:resources:default-resources:process-resources) org.apache.maven.plugin.PluginExecutionException: Execution default-resources of goal org.apache.maven.plugins:maven-resources- plugin:2.7:resources failed: Plugin org.apache.maven.plugins:maven-resources-plugin:2.7 or one of its dependencies could not be resolved: The following artifacts could not be resolved: org.apache.maven.doxia:doxia-sink-api:jar:1.1, org.apache.maven.doxia:doxia- logging-api:jar:1.1, org.apache.maven:maven-repository-metadata:jar:2.2.1, org.apache.maven:maven-error-diagnostics:jar:2.2.1, org.apache.maven:maven-plugin-descriptor:jar:2.2.1, org.sonatype.plexus:plexus-sec-dispatcher:jar:1.3, org.sonatype.plexus:plexus- cipher:jar:1.4, org.apache.maven:maven-settings:jar:2.2.1, org.apache.maven:maven-monitor:jar:2.2.1: Failure to transfer org.apache.maven.doxia:doxia-sink-api:jar:1.1 from http://maven.aliyun.com/nexus/content/repositories/central/ was cached in the local repository, resolution will not be reattempted until the update interval of alimaven has elapsed or updates are forced. Original error: Could not transfer artifact org.apache.maven.doxia:doxia-sink-api:jar:1.1 from/to alimaven (http://maven.aliyun.com/nexus/content/ repositories/central/): The operation was cancelled. at org.apache.maven.plugin.DefaultBuildPluginManager.executeMojo(DefaultBuildPluginManager.java:109) at org.eclipse.m2e.core.internal.embedder.MavenImpl.execute(MavenImpl.java:331) at org.eclipse.m2e.core.internal.embedder.MavenImpl.lambda$7(MavenImpl.java:1342) at org.eclipse.m2e.core.internal.embedder.MavenExecutionContext.executeBare(MavenExecutionContext.java:177) at org.eclipse.m2e.core.internal.embedder.MavenExecutionContext.execute(MavenExecutionContext.java:112) at org.eclipse.m2e.core.internal.embedder.MavenImpl.execute(MavenImpl.java:1341) at org.eclipse.m2e.core.project.configurator.MojoExecutionBuildParticipant.build(MojoExecutionBuildParticipant.java:52) at org.eclipse.m2e.core.internal.builder.MavenBuilderImpl.build(MavenBuilderImpl.java:137) at org.eclipse.m2e.core.internal.builder.MavenBuilder$1.method(MavenBuilder.java:173) at org.eclipse.m2e.core.internal.builder.MavenBuilder$1.method(MavenBuilder.java:1) at org.eclipse.m2e.core.internal.builder.MavenBuilder$BuildMethod$1$1.call(MavenBuilder.java:116) at org.eclipse.m2e.core.internal.embedder.MavenExecutionContext.executeBare(MavenExecutionContext.java:177) at org.eclipse.m2e.core.internal.embedder.MavenExecutionContext.execute(MavenExecutionContext.java:112) at org.eclipse.m2e.core.internal.builder.MavenBuilder$BuildMethod$1.call(MavenBuilder.java:106) at org.eclipse.m2e.core.internal.embedder.MavenExecutionContext.executeBare(MavenExecutionContext.java:177) at org.eclipse.m2e.core.internal.embedder.MavenExecutionContext.execute(MavenExecutionContext.java:151) at org.eclipse.m2e.core.internal.embedder.MavenExecutionContext.execute(MavenExecutionContext.java:99) at org.eclipse.m2e.core.internal.builder.MavenBuilder$BuildMethod.execute(MavenBuilder.java:87) at org.eclipse.m2e.core.internal.builder.MavenBuilder.build(MavenBuilder.java:201) at org.eclipse.core.internal.events.BuildManager$2.run(BuildManager.java:833) at org.eclipse.core.runtime.SafeRunner.run(SafeRunner.java: 45) at org.eclipse.core.internal.events.BuildManager.basicBuild(BuildManager.java:220) at org.eclipse.core.internal.events.BuildManager.basicBuild(BuildManager.java:263) at org.eclipse.core.internal.events.BuildManager$1.run(BuildManager.java:316) at org.eclipse.core.runtime.SafeRunner.run(SafeRunner.java: 45) at org.eclipse.core.internal.events.BuildManager.basicBuild(BuildManager.java:319) at org.eclipse.core.internal.events.BuildManager.basicBuildLoop(BuildManager.java:371) at org.eclipse.core.internal.events.BuildManager.build(BuildManager.java:392) at org.eclipse.core.internal.events.AutoBuildJob.doBuild(AutoBuildJob.java:154) at org.eclipse.core.internal.events.AutoBuildJob.run(AutoBuildJob.java:244) at org.eclipse.core.internal.jobs.Worker.run(Worker.java:63) Caused by: org.apache.maven.plugin.PluginResolutionException: Plugin org.apache.maven.plugins:maven-resources-plugin:2.7 or one of its dependencies could not be resolved: The following artifacts could not be resolved: org.apache.maven.doxia:doxia-sink-api:jar:1.1, org.apache.maven.doxia:doxia-logging-api:jar:1.1, org.apache.maven:maven-repository-metadata:jar:2.2.1, org.apache.maven:maven- error-diagnostics:jar:2.2.1, org.apache.maven:maven-plugin-descriptor:jar:2.2.1, org.sonatype.plexus:plexus-sec-dispatcher:jar:1.3, org.sonatype.plexus:plexus-cipher:jar:1.4, org.apache.maven:maven-settings:jar:2.2.1, org.apache.maven:maven-monitor:jar:2.2.1: Failure to transfer org.apache.maven.doxia:doxia-sink-api:jar:1.1 from http://maven.aliyun.com/nexus/content/repositories/central/ was cached in the local repository, resolution will not be reattempted until the update interval of alimaven has elapsed or updates are forced. Original error: Could not transfer artifact org.apache.maven.doxia:doxia-sink-api:jar:1.1 from/to alimaven (http://maven.aliyun.com/nexus/ content/repositories/central/): The operation was cancelled. at org.apache.maven.plugin.internal.DefaultPluginDependenciesResolver.resolveInternal(DefaultPluginDependenciesResolver.java:218) at org.apache.maven.plugin.internal.DefaultPluginDependenciesResolver.resolve(DefaultPluginDependenciesResolver.java:149) at org.eclipse.m2e.core.internal.project.registry.EclipsePluginDependenciesResolver.resolve(EclipsePluginDependenciesResolver.java:59) at org.apache.maven.plugin.internal.DefaultMavenPluginManager.createPluginRealm(DefaultMavenPluginManager.java:402) at org.apache.maven.plugin.internal.DefaultMavenPluginManager.setupPluginRealm(DefaultMavenPluginManager.java:374) at org.apache.maven.plugin.DefaultBuildPluginManager.getPluginRealm(DefaultBuildPluginManager.java:234) at org.apache.maven.plugin.DefaultBuildPluginManager.executeMojo(DefaultBuildPluginManager.java:105) ... 30 more Caused by: org.eclipse.aether.resolution.ArtifactResolutionException: The following artifacts could not be resolved: org.apache.maven.doxia:doxia- sink-api:jar:1.1, org.apache.maven.doxia:doxia-logging-api:jar:1.1, org.apache.maven:maven-repository-metadata:jar:2.2.1, org.apache.maven:maven-error-diagnostics:jar:2.2.1, org.apache.maven:maven-plugin-descriptor:jar:2.2.1, org.sonatype.plexus:plexus- sec-dispatcher:jar:1.3, org.sonatype.plexus:plexus-cipher:jar:1.4, org.apache.maven:maven-settings:jar:2.2.1, org.apache.maven:maven- monitor:jar:2.2.1: Failure to transfer org.apache.maven.doxia:doxia-sink-api:jar:1.1 from http://maven.aliyun.com/nexus/content/ repositories/central/ was cached in the local repository, resolution will not be reattempted until the update interval of alimaven has elapsed or updates are forced. Original error: Could not transfer artifact org.apache.maven.doxia:doxia-sink-api:jar:1.1 from/to alimaven (http://maven.aliyun.com/nexus/content/repositories/central/): The operation was cancelled. at org.eclipse.aether.internal.impl.DefaultArtifactResolver.resolve(DefaultArtifactResolver.java:422) at org.eclipse.aether.internal.impl.DefaultArtifactResolver.resolveArtifacts(DefaultArtifactResolver.java:224) at org.eclipse.aether.internal.impl.DefaultRepositorySystem.resolveDependencies(DefaultRepositorySystem.java:338) at org.apache.maven.plugin.internal.DefaultPluginDependenciesResolver.resolveInternal(DefaultPluginDependenciesResolver.java:210) ... 36 more Caused by: org.eclipse.aether.transfer.ArtifactTransferException: Failure to transfer org.apache.maven.doxia:doxia-sink-api:jar: 1.1 from http://maven.aliyun.com/nexus/content/repositories/central/ was cached in the local repository, resolution will not be reattempted until the update interval of alimaven has elapsed or updates are forced. Original error: Could not transfer artifact org.apache.maven.doxia:doxia-sink-api:jar:1.1 from/to alimaven (http://maven.aliyun.com/nexus/content/repositories/central/): The operation was cancelled. at org.eclipse.aether.internal.impl.DefaultUpdateCheckManager.newException(DefaultUpdateCheckManager.java:240) at org.eclipse.aether.internal.impl.DefaultUpdateCheckManager.checkArtifact(DefaultUpdateCheckManager.java:208) at org.eclipse.aether.internal.impl.DefaultArtifactResolver.gatherDownloads(DefaultArtifactResolver.java:563) at org.eclipse.aether.internal.impl.DefaultArtifactResolver.performDownloads(DefaultArtifactResolver.java:481) at org.eclipse.aether.internal.impl.DefaultArtifactResolver.resolve(DefaultArtifactResolver.java:399) ... 39 more - Execution default-testResources of goal org.apache.maven.plugins:maven-resources-plugin:2.7:testResources failed: Plugin org.apache.maven.plugins:maven-resources-plugin:2.7 or one of its dependencies could not be resolved: The following artifacts could not be resolved: org.apache.maven.doxia:doxia-sink-api:jar:1.1, org.apache.maven.doxia:doxia-logging-api:jar:1.1, org.apache.maven:maven-repository-metadata:jar:2.2.1, org.apache.maven:maven-error-diagnostics:jar:2.2.1, org.apache.maven:maven- plugin-descriptor:jar:2.2.1, org.sonatype.plexus:plexus-sec-dispatcher:jar:1.3, org.sonatype.plexus:plexus-cipher:jar:1.4, org.apache.maven:maven-settings:jar:2.2.1, org.apache.maven:maven-monitor:jar:2.2.1: Failure to transfer org.apache.maven.doxia:doxia- sink-api:jar:1.1 from http://maven.aliyun.com/nexus/content/repositories/central/ was cached in the local repository, resolution will not be reattempted until the update interval of alimaven has elapsed or updates are forced. Original error: Could not transfer artifact org.apache.maven.doxia:doxia-sink-api:jar:1.1 from/to alimaven (http://maven.aliyun.com/nexus/content/repositories/central/): The operation was cancelled. (org.apache.maven.plugins:maven-resources-plugin:2.7:testResources:default-testResources:process-test- resources) org.apache.maven.plugin.PluginExecutionException: Execution default-testResources of goal org.apache.maven.plugins:maven-resources-plugin:2.7:testResources failed: Plugin org.apache.maven.plugins:maven-resources-plugin: 2.7 or one of its dependencies could not be resolved: The following artifacts could not be resolved: org.apache.maven.doxia:doxia-sink- api:jar:1.1, org.apache.maven.doxia:doxia-logging-api:jar:1.1, org.apache.maven:maven-repository-metadata:jar:2.2.1, org.apache.maven:maven-error-diagnostics:jar:2.2.1, org.apache.maven:maven-plugin-descriptor:jar:2.2.1, org.sonatype.plexus:plexus- sec-dispatcher:jar:1.3, org.sonatype.plexus:plexus-cipher:jar:1.4, org.apache.maven:maven-settings:jar:2.2.1, org.apache.maven:maven- monitor:jar:2.2.1: Failure to transfer org.apache.maven.doxia:doxia-sink-api:jar:1.1 from http://maven.aliyun.com/nexus/content/ repositories/central/ was cached in the local repository, resolution will not be reattempted until the update interval of alimaven has elapsed or updates are forced. Original error: Could not transfer artifact org.apache.maven.doxia:doxia-sink-api:jar:1.1 from/to alimaven (http://maven.aliyun.com/nexus/content/repositories/central/): The operation was cancelled. at org.apache.maven.plugin.DefaultBuildPluginManager.executeMojo(DefaultBuildPluginManager.java:109) at org.eclipse.m2e.core.internal.embedder.MavenImpl.execute(MavenImpl.java:331) at org.eclipse.m2e.core.internal.embedder.MavenImpl.lambda$7(MavenImpl.java:1342) at org.eclipse.m2e.core.internal.embedder.MavenExecutionContext.executeBare(MavenExecutionContext.java:177) at org.eclipse.m2e.core.internal.embedder.MavenExecutionContext.execute(MavenExecutionContext.java:112) at org.eclipse.m2e.core.internal.embedder.MavenImpl.execute(MavenImpl.java:1341) at org.eclipse.m2e.core.project.configurator.MojoExecutionBuildParticipant.build(MojoExecutionBuildParticipant.java:52) at org.eclipse.m2e.core.internal.builder.MavenBuilderImpl.build(MavenBuilderImpl.java:137) at org.eclipse.m2e.core.internal.builder.MavenBuilder$1.method(MavenBuilder.java:173) at org.eclipse.m2e.core.internal.builder.MavenBuilder$1.method(MavenBuilder.java:1) at org.eclipse.m2e.core.internal.builder.MavenBuilder$BuildMethod$1$1.call(MavenBuilder.java:116) at org.eclipse.m2e.core.internal.embedder.MavenExecutionContext.executeBare(MavenExecutionContext.java:177) at org.eclipse.m2e.core.internal.embedder.MavenExecutionContext.execute(MavenExecutionContext.java:112) at org.eclipse.m2e.core.internal.builder.MavenBuilder$BuildMethod$1.call(MavenBuilder.java:106) at org.eclipse.m2e.core.internal.embedder.MavenExecutionContext.executeBare(MavenExecutionContext.java:177) at org.eclipse.m2e.core.internal.embedder.MavenExecutionContext.execute(MavenExecutionContext.java:151) at org.eclipse.m2e.core.internal.embedder.MavenExecutionContext.execute(MavenExecutionContext.java:99) at org.eclipse.m2e.core.internal.builder.MavenBuilder$BuildMethod.execute(MavenBuilder.java:87) at org.eclipse.m2e.core.internal.builder.MavenBuilder.build(MavenBuilder.java:201) at org.eclipse.core.internal.events.BuildManager$2.run(BuildManager.java:833) at org.eclipse.core.runtime.SafeRunner.run(SafeRunner.java: 45) at org.eclipse.core.internal.events.BuildManager.basicBuild(BuildManager.java:220) at org.eclipse.core.internal.events.BuildManager.basicBuild(BuildManager.java:263) at org.eclipse.core.internal.events.BuildManager$1.run(BuildManager.java:316) at org.eclipse.core.runtime.SafeRunner.run(SafeRunner.java: 45) at org.eclipse.core.internal.events.BuildManager.basicBuild(BuildManager.java:319) at org.eclipse.core.internal.events.BuildManager.basicBuildLoop(BuildManager.java:371) at org.eclipse.core.internal.events.BuildManager.build(BuildManager.java:392) at org.eclipse.core.internal.events.AutoBuildJob.doBuild(AutoBuildJob.java:154) at org.eclipse.core.internal.events.AutoBuildJob.run(AutoBuildJob.java:244) at org.eclipse.core.internal.jobs.Worker.run(Worker.java:63) Caused by: org.apache.maven.plugin.PluginResolutionException: Plugin org.apache.maven.plugins:maven-resources-plugin:2.7 or one of its dependencies could not be resolved: The following artifacts could not be resolved: org.apache.maven.doxia:doxia-sink-api:jar:1.1, org.apache.maven.doxia:doxia-logging-api:jar:1.1, org.apache.maven:maven-repository-metadata:jar:2.2.1, org.apache.maven:maven- error-diagnostics:jar:2.2.1, org.apache.maven:maven-plugin-descriptor:jar:2.2.1, org.sonatype.plexus:plexus-sec-dispatcher:jar:1.3, org.sonatype.plexus:plexus-cipher:jar:1.4, org.apache.maven:maven-settings:jar:2.2.1, org.apache.maven:maven-monitor:jar:2.2.1: Failure to transfer org.apache.maven.doxia:doxia-sink-api:jar:1.1 from http://maven.aliyun.com/nexus/content/repositories/central/ was cached in the local repository, resolution will not be reattempted until the update interval of alimaven has elapsed or updates are forced. Original error: Could not transfer artifact org.apache.maven.doxia:doxia-sink-api:jar:1.1 from/to alimaven (http://maven.aliyun.com/nexus/ content/repositories/central/): The operation was cancelled. at org.apache.maven.plugin.internal.DefaultPluginDependenciesResolver.resolveInternal(DefaultPluginDependenciesResolver.java:218) at org.apache.maven.plugin.internal.DefaultPluginDependenciesResolver.resolve(DefaultPluginDependenciesResolver.java:149) at org.eclipse.m2e.core.internal.project.registry.EclipsePluginDependenciesResolver.resolve(EclipsePluginDependenciesResolver.java:59) at org.apache.maven.plugin.internal.DefaultMavenPluginManager.createPluginRealm(DefaultMavenPluginManager.java:402) at org.apache.maven.plugin.internal.DefaultMavenPluginManager.setupPluginRealm(DefaultMavenPluginManager.java:374) at org.apache.maven.plugin.DefaultBuildPluginManager.getPluginRealm(DefaultBuildPluginManager.java:234) at org.apache.maven.plugin.DefaultBuildPluginManager.executeMojo(DefaultBuildPluginManager.java:105) ... 30 more Caused by: org.eclipse.aether.resolution.ArtifactResolutionException: The following artifacts could not be resolved: org.apache.maven.doxia:doxia- sink-api:jar:1.1, org.apache.maven.doxia:doxia-logging-api:jar:1.1, org.apache.maven:maven-repository-metadata:jar:2.2.1, org.apache.maven:maven-error-diagnostics:jar:2.2.1, org.apache.maven:maven-plugin-descriptor:jar:2.2.1, org.sonatype.plexus:plexus- sec-dispatcher:jar:1.3, org.sonatype.plexus:plexus-cipher:jar:1.4, org.apache.maven:maven-settings:jar:2.2.1, org.apache.maven:maven- monitor:jar:2.2.1: Failure to transfer org.apache.maven.doxia:doxia-sink-api:jar:1.1 from http://maven.aliyun.com/nexus/content/ repositories/central/ was cached in the local repository, resolution will not be reattempted until the update interval of alimaven has elapsed or updates are forced. Original error: Could not transfer artifact org.apache.maven.doxia:doxia-sink-api:jar:1.1 from/to alimaven (http://maven.aliyun.com/nexus/content/repositories/central/): The operation was cancelled. at org.eclipse.aether.internal.impl.DefaultArtifactResolver.resolve(DefaultArtifactResolver.java:422) at org.eclipse.aether.internal.impl.DefaultArtifactResolver.resolveArtifacts(DefaultArtifactResolver.java:224) at org.eclipse.aether.internal.impl.DefaultRepositorySystem.resolveDependencies(DefaultRepositorySystem.java:338) at org.apache.maven.plugin.internal.DefaultPluginDependenciesResolver.resolveInternal(DefaultPluginDependenciesResolver.java:210) ... 36 more Caused by: org.eclipse.aether.transfer.ArtifactTransferException: Failure to transfer org.apache.maven.doxia:doxia-sink-api:jar: 1.1 from http://maven.aliyun.com/nexus/content/repositories/central/ was cached in the local repository, resolution will not be reattempted until the update interval of alimaven has elapsed or updates are forced. Original error: Could not transfer artifact org.apache.maven.doxia:doxia-sink-api:jar:1.1 from/to alimaven (http://maven.aliyun.com/nexus/content/repositories/central/): The operation was cancelled. at org.eclipse.aether.internal.impl.DefaultUpdateCheckManager.newException(DefaultUpdateCheckManager.java:240) at org.eclipse.aether.internal.impl.DefaultUpdateCheckManager.checkArtifact(DefaultUpdateCheckManager.java:208) at org.eclipse.aether.internal.impl.DefaultArtifactResolver.gatherDownloads(DefaultArtifactResolver.java:563) at org.eclipse.aether.internal.impl.DefaultArtifactResolver.performDownloads(DefaultArtifactResolver.java:481) at org.eclipse.aether.internal.impl.DefaultArtifactResolver.resolve(DefaultArtifactResolver.java:399) ... 39 more ```
hadoop2.3的fuse怎么用maven编译?
网上给出的方法都是用ant编译的,但是新版的hadoop都已经用maven了,源码的目录中没有build.xml是pom.xml,如何把hdfs fuse的模块编译出来呢?
关于maven的使用问题 , 没有 .m2 文件夹
我使用的是非安装版的maven 配置好环境变量以后 , 根据网上说的执行了 mvn -help:system 但是执行后还是没有 .m2 文件夹 现在 CMD 的相关命令都可以使用 , 但是没有 .m2文件夹 顺便问一下 1.其他人传给我 maven jar 包文件夹怎么使用 ? 放在 .m2 文件夹里就可以了吗?(我没有这个文件夹怎么办?) 2.eclipse 里怎么使用 maven ?
eclipse的maven导入时报错
第一次装maven,按步骤是装好了。导入第一个maven项目就报错了,求大神不吝赐教! 以下是错误提示 Errors occurred during the build. Errors running builder 'Maven Project Builder' on project 'jeecg'. Could not calculate build plan: Plugin org.apache.maven.plugins:maven-resources-plugin:2.6 or one of its dependencies could not be resolved: Cannot access central (https://repo.maven.apache.org/maven2) in offline mode and the artifact org.apache.maven.plugins:maven-resources-plugin:jar:2.6 has not been downloaded from it before. Plugin org.apache.maven.plugins:maven-resources-plugin:2.6 or one of its dependencies could not be resolved: Cannot access central (https://repo.maven.apache.org/maven2) in offline mode and the artifact org.apache.maven.plugins:maven-resources-plugin:jar:2.6 has not been downloaded from it before. Could not calculate build plan: Plugin org.apache.maven.plugins:maven-resources-plugin:2.6 or one of its dependencies could not be resolved: Cannot access central (https://repo.maven.apache.org/maven2) in offline mode and the artifact org.apache.maven.plugins:maven-resources-plugin:jar:2.6 has not been downloaded from it before. Plugin org.apache.maven.plugins:maven-resources-plugin:2.6 or one of its dependencies could not be resolved: Cannot access central (https://repo.maven.apache.org/maven2) in offline mode and the artifact org.apache.maven.plugins:maven-resources-plugin:jar:2.6 has not been downloaded from it before.
hudson3.1.2+maven3.1.1 构建异常,内容如下,求指导
Started by user anonymous Updating svn://172.17.199.42/Bidding/test At revision 726 no change for svn://172.17.199.42/Bidding/test since the previous build Parsing POMs [test] $ C:\Java\jdk1.7.0_51/bin/java -cp D:\hudson\plugins\maven-plugin\WEB-INF\lib\maven-agent-1.384.jar;D:\apache-maven-3.1.1\boot\plexus-classworlds-2.5.1.jar hudson.maven.agent.Main D:\apache-maven-3.1.1 D:\apache-tomcat-7.0.52\webapps\hudson\WEB-INF\lib\remoting-1.384.jar D:\hudson\plugins\maven-plugin\WEB-INF\lib\maven-interceptor-1.384.jar 58704 Exception in thread "main" java.lang.NoSuchMethodError: org.codehaus.classworlds.Launcher.getWorld()Lorg/codehaus/classworlds/ClassWorld; at hudson.maven.agent.Main.main(Main.java:115) at hudson.maven.agent.Main.main(Main.java:62) ERROR: Failed to launch Maven. Exit code = 1 Finished: FAILURE 在网上找不到此类型的错误,如有 帮助,不胜感激
爬虫福利二 之 妹子图网MM批量下载
爬虫福利一:27报网MM批量下载 点击 看了本文,相信大家对爬虫一定会产生强烈的兴趣,激励自己去学习爬虫,在这里提前祝:大家学有所成! 目标网站:妹子图网 环境:Python3.x 相关第三方模块:requests、beautifulsoup4 Re:各位在测试时只需要将代码里的变量path 指定为你当前系统要保存的路径,使用 python xxx.py 或IDE运行即可。 ...
Java学习的正确打开方式
在博主认为,对于入门级学习java的最佳学习方法莫过于视频+博客+书籍+总结,前三者博主将淋漓尽致地挥毫于这篇博客文章中,至于总结在于个人,实际上越到后面你会发现学习的最好方式就是阅读参考官方文档其次就是国内的书籍,博客次之,这又是一个层次了,这里暂时不提后面再谈。博主将为各位入门java保驾护航,各位只管冲鸭!!!上天是公平的,只要不辜负时间,时间自然不会辜负你。 何谓学习?博主所理解的学习,它是一个过程,是一个不断累积、不断沉淀、不断总结、善于传达自己的个人见解以及乐于分享的过程。
大学四年自学走来,这些私藏的实用工具/学习网站我贡献出来了
大学四年,看课本是不可能一直看课本的了,对于学习,特别是自学,善于搜索网上的一些资源来辅助,还是非常有必要的,下面我就把这几年私藏的各种资源,网站贡献出来给你们。主要有:电子书搜索、实用工具、在线视频学习网站、非视频学习网站、软件下载、面试/求职必备网站。 注意:文中提到的所有资源,文末我都给你整理好了,你们只管拿去,如果觉得不错,转发、分享就是最大的支持了。 一、电子书搜索 对于大部分程序员...
linux系列之常用运维命令整理笔录
本博客记录工作中需要的linux运维命令,大学时候开始接触linux,会一些基本操作,可是都没有整理起来,加上是做开发,不做运维,有些命令忘记了,所以现在整理成博客,当然vi,文件操作等就不介绍了,慢慢积累一些其它拓展的命令,博客不定时更新 free -m 其中:m表示兆,也可以用g,注意都要小写 Men:表示物理内存统计 total:表示物理内存总数(total=used+free) use...
比特币原理详解
一、什么是比特币 比特币是一种电子货币,是一种基于密码学的货币,在2008年11月1日由中本聪发表比特币白皮书,文中提出了一种去中心化的电子记账系统,我们平时的电子现金是银行来记账,因为银行的背后是国家信用。去中心化电子记账系统是参与者共同记账。比特币可以防止主权危机、信用风险。其好处不多做赘述,这一层面介绍的文章很多,本文主要从更深层的技术原理角度进行介绍。 二、问题引入 假设现有4个人...
程序员接私活怎样防止做完了不给钱?
首先跟大家说明一点,我们做 IT 类的外包开发,是非标品开发,所以很有可能在开发过程中会有这样那样的需求修改,而这种需求修改很容易造成扯皮,进而影响到费用支付,甚至出现做完了项目收不到钱的情况。 那么,怎么保证自己的薪酬安全呢? 我们在开工前,一定要做好一些证据方面的准备(也就是“讨薪”的理论依据),这其中最重要的就是需求文档和验收标准。一定要让需求方提供这两个文档资料作为开发的基础。之后开发...
网页实现一个简单的音乐播放器(大佬别看。(⊙﹏⊙))
今天闲着无事,就想写点东西。然后听了下歌,就打算写个播放器。 于是乎用h5 audio的加上js简单的播放器完工了。 演示地点演示 html代码如下` music 这个年纪 七月的风 音乐 ` 然后就是css`*{ margin: 0; padding: 0; text-decoration: none; list-...
Python十大装B语法
Python 是一种代表简单思想的语言,其语法相对简单,很容易上手。不过,如果就此小视 Python 语法的精妙和深邃,那就大错特错了。本文精心筛选了最能展现 Python 语法之精妙的十个知识点,并附上详细的实例代码。如能在实战中融会贯通、灵活使用,必将使代码更为精炼、高效,同时也会极大提升代码B格,使之看上去更老练,读起来更优雅。
数据库优化 - SQL优化
以实际SQL入手,带你一步一步走上SQL优化之路!
2019年11月中国大陆编程语言排行榜
2019年11月2日,我统计了某招聘网站,获得有效程序员招聘数据9万条。针对招聘信息,提取编程语言关键字,并统计如下: 编程语言比例 rank pl_ percentage 1 java 33.62% 2 cpp 16.42% 3 c_sharp 12.82% 4 javascript 12.31% 5 python 7.93% 6 go 7.25% 7 p...
通俗易懂地给女朋友讲:线程池的内部原理
餐盘在灯光的照耀下格外晶莹洁白,女朋友拿起红酒杯轻轻地抿了一小口,对我说:“经常听你说线程池,到底线程池到底是个什么原理?”
经典算法(5)杨辉三角
杨辉三角 是经典算法,这篇博客对它的算法思想进行了讲解,并有完整的代码实现。
腾讯算法面试题:64匹马8个跑道需要多少轮才能选出最快的四匹?
昨天,有网友私信我,说去阿里面试,彻底的被打击到了。问了为什么网上大量使用ThreadLocal的源码都会加上private static?他被难住了,因为他从来都没有考虑过这个问题。无独有偶,今天笔者又发现有网友吐槽了一道腾讯的面试题,我们一起来看看。 腾讯算法面试题:64匹马8个跑道需要多少轮才能选出最快的四匹? 在互联网职场论坛,一名程序员发帖求助到。二面腾讯,其中一个算法题:64匹...
面试官:你连RESTful都不知道我怎么敢要你?
干货,2019 RESTful最贱实践
JDK12 Collectors.teeing 你真的需要了解一下
前言 在 Java 12 里面有个非常好用但在官方 JEP 没有公布的功能,因为它只是 Collector 中的一个小改动,它的作用是 merge 两个 collector 的结果,这句话显得很抽象,老规矩,我们先来看个图(这真是一个不和谐的图????): 管道改造经常会用这个小东西,通常我们叫它「三通」,它的主要作用就是将 downstream1 和 downstre...
为啥国人偏爱Mybatis,而老外喜欢Hibernate/JPA呢?
关于SQL和ORM的争论,永远都不会终止,我也一直在思考这个问题。昨天又跟群里的小伙伴进行了一番讨论,感触还是有一些,于是就有了今天这篇文。 声明:本文不会下关于Mybatis和JPA两个持久层框架哪个更好这样的结论。只是摆事实,讲道理,所以,请各位看官勿喷。 一、事件起因 关于Mybatis和JPA孰优孰劣的问题,争论已经很多年了。一直也没有结论,毕竟每个人的喜好和习惯是大不相同的。我也看...
SQL-小白最佳入门sql查询一
不要偷偷的查询我的个人资料,即使你再喜欢我,也不要这样,真的不好;
项目中的if else太多了,该怎么重构?
介绍 最近跟着公司的大佬开发了一款IM系统,类似QQ和微信哈,就是聊天软件。我们有一部分业务逻辑是这样的 if (msgType = "文本") { // dosomething } else if(msgType = "图片") { // doshomething } else if(msgType = "视频") { // doshomething } else { // doshom...
【图解经典算法题】如何用一行代码解决约瑟夫环问题
约瑟夫环问题算是很经典的题了,估计大家都听说过,然后我就在一次笔试中遇到了,下面我就用 3 种方法来详细讲解一下这道题,最后一种方法学了之后保证让你可以让你装逼。 问题描述:编号为 1-N 的 N 个士兵围坐在一起形成一个圆圈,从编号为 1 的士兵开始依次报数(1,2,3…这样依次报),数到 m 的 士兵会被杀死出列,之后的士兵再从 1 开始报数。直到最后剩下一士兵,求这个士兵的编号。 1、方...
致 Python 初学者
欢迎来到“Python进阶”专栏!来到这里的每一位同学,应该大致上学习了很多 Python 的基础知识,正在努力成长的过程中。在此期间,一定遇到了很多的困惑,对未来的学习方向感到迷茫。我非常理解你们所面临的处境。我从2007年开始接触 python 这门编程语言,从2009年开始单一使用 python 应对所有的开发工作,直至今天。回顾自己的学习过程,也曾经遇到过无数的困难,也曾经迷茫过、困惑过。开办这个专栏,正是为了帮助像我当年一样困惑的 Python 初学者走出困境、快速成长。希望我的经验能真正帮到你
“狗屁不通文章生成器”登顶GitHub热榜,分分钟写出万字形式主义大作
一、垃圾文字生成器介绍 最近在浏览GitHub的时候,发现了这样一个骨骼清奇的雷人项目,而且热度还特别高。 项目中文名:狗屁不通文章生成器 项目英文名:BullshitGenerator 根据作者的介绍,他是偶尔需要一些中文文字用于GUI开发时测试文本渲染,因此开发了这个废话生成器。但由于生成的废话实在是太过富于哲理,所以最近已经被小伙伴们给玩坏了。 他的文风可能是这样的: 你发现,...
程序员:我终于知道post和get的区别
是一个老生常谈的话题,然而随着不断的学习,对于以前的认识有很多误区,所以还是需要不断地总结的,学而时习之,不亦说乎
GitHub标星近1万:只需5秒音源,这个网络就能实时“克隆”你的声音
作者 | Google团队 译者 | 凯隐 编辑 | Jane 出品 | AI科技大本营(ID:rgznai100) 本文中,Google 团队提出了一种文本语音合成(text to speech)神经系统,能通过少量样本学习到多个不同说话者(speaker)的语音特征,并合成他们的讲话音频。此外,对于训练时网络没有接触过的说话者,也能在不重新训练的情况下,仅通过未知...
《程序人生》系列-这个程序员只用了20行代码就拿了冠军
你知道的越多,你不知道的越多 点赞再看,养成习惯GitHub上已经开源https://github.com/JavaFamily,有一线大厂面试点脑图,欢迎Star和完善 前言 这一期不算《吊打面试官》系列的,所有没前言我直接开始。 絮叨 本来应该是没有这期的,看过我上期的小伙伴应该是知道的嘛,双十一比较忙嘛,要值班又要去帮忙拍摄年会的视频素材,还得搞个程序员一天的Vlog,还要写BU...
加快推动区块链技术和产业创新发展,2019可信区块链峰会在京召开
11月8日,由中国信息通信研究院、中国通信标准化协会、中国互联网协会、可信区块链推进计划联合主办,科技行者协办的2019可信区块链峰会将在北京悠唐皇冠假日酒店开幕。   区块链技术被认为是继蒸汽机、电力、互联网之后,下一代颠覆性的核心技术。如果说蒸汽机释放了人类的生产力,电力解决了人类基本的生活需求,互联网彻底改变了信息传递的方式,区块链作为构造信任的技术有重要的价值。   1...
程序员把地府后台管理系统做出来了,还有3.0版本!12月7号最新消息:已在开发中有github地址
第一幕:缘起 听说阎王爷要做个生死簿后台管理系统,我们派去了一个程序员…… 996程序员做的梦: 第一场:团队招募 为了应对地府管理危机,阎王打算找“人”开发一套地府后台管理系统,于是就在地府总经办群中发了项目需求。 话说还是中国电信的信号好,地府都是满格,哈哈!!! 经常会有外行朋友问:看某网站做的不错,功能也简单,你帮忙做一下? 而这次,面对这样的需求,这个程序员...
网易云6亿用户音乐推荐算法
网易云音乐是音乐爱好者的集聚地,云音乐推荐系统致力于通过 AI 算法的落地,实现用户千人千面的个性化推荐,为用户带来不一样的听歌体验。 本次分享重点介绍 AI 算法在音乐推荐中的应用实践,以及在算法落地过程中遇到的挑战和解决方案。 将从如下两个部分展开: AI算法在音乐推荐中的应用 音乐场景下的 AI 思考 从 2013 年 4 月正式上线至今,网易云音乐平台持续提供着:乐屏社区、UGC...
【技巧总结】位运算装逼指南
位算法的效率有多快我就不说,不信你可以去用 10 亿个数据模拟一下,今天给大家讲一讲位运算的一些经典例子。不过,最重要的不是看懂了这些例子就好,而是要在以后多去运用位运算这些技巧,当然,采用位运算,也是可以装逼的,不信,你往下看。我会从最简单的讲起,一道比一道难度递增,不过居然是讲技巧,那么也不会太难,相信你分分钟看懂。 判断奇偶数 判断一个数是基于还是偶数,相信很多人都做过,一般的做法的代码如下...
【管理系统课程设计】美少女手把手教你后台管理
【文章后台管理系统】URL设计与建模分析+项目源码+运行界面 栏目管理、文章列表、用户管理、角色管理、权限管理模块(文章最后附有源码) 1. 这是一个什么系统? 1.1 学习后台管理系统的原因 随着时代的变迁,现如今各大云服务平台横空出世,市面上有许多如学生信息系统、图书阅读系统、停车场管理系统等的管理系统,而本人家里就有人在用烟草销售系统,直接在网上完成挑选、购买与提交收货点,方便又快捷。 试想,若没有烟草销售系统,本人家人想要购买烟草,还要独自前往药...
4G EPS 第四代移动通信系统
目录 文章目录目录4G 与 LTE/EPCLTE/EPC 的架构E-UTRANE-UTRAN 协议栈eNodeBEPCMMES-GWP-GWHSSLTE/EPC 协议栈概览 4G 与 LTE/EPC 4G,即第四代移动通信系统,提供了 3G 不能满足的无线网络宽带化,主要提供数据(上网)业务。而 LTE(Long Term Evolution,长期演进技术)是电信领域用于手机及数据终端的高速无线通...
相关热词 如何提升c#开发能力 矩阵乘法c# c#调用谷歌浏览器 c# 去空格去转义符 c#用户登录窗体代码 c# 流 c# linux 可视化 c# mvc 返回图片 c# 像素空间 c# 日期 最后一天
立即提问