请问在linux虚拟环境中python pip freeze> requirements.txt 如何revert?

目前是开的远程服务器跑Linux环境,手上有一份代码包,里面包含了requirements.txt。 想要直接通过pip3 install -r requirements.txt 导入packages,一直报错显示如图:图片说明
因为是新手小白,头脑一热用了pip3 freeze >requirements.txt 然后再pip3 install -r requirements.txt(这里我就用的是我存我代码包里现有的requirements.txt的路径) 。发现确实没报错。图片说明

但是...貌似是通过pip freeze指令新生成了一份requirements.txt,并且可能覆盖了原有的requirements.txt。 请问有什么办法能revert,让requirements.txt还是存着我原先存的东西吗?谢谢各位大佬!

Csdn user default icon
上传中...
上传图片
插入图片
抄袭、复制答案,以达到刷声望分或其他目的的行为,在CSDN问答是严格禁止的,一经发现立刻封号。是时候展现真正的技术了!
其他相关推荐
Linux下的python的pip问题
今天我安装了python3 然后pip安装tornado,测试发现导入不成功,通过find命令查到pip把tornado安装到python2.7里面去了 ![图片说明](https://img-ask.csdn.net/upload/201804/29/1525006422_521904.png) 通过搜索命令发现在python3.6里面有一个pip,于是我到usr/bin目录下面删除了pip的软连接 然后设置python3.6的pip软连接发现pip用不了 ![图片说明](https://img-ask.csdn.net/upload/201804/29/1525006713_105393.png)
[Python]为什么在win10系统中pip指令用不了?
**哪位大神能帮我解决一下?** 本人还是个小白,所以出现这个错误也不敢妄下断言。 ``` C:\Users\46000>pip Traceback (most recent call last): File "c:\program files\python38\lib\runpy.py", line 193, in _run_module_as_main return _run_code(code, main_globals, None, File "c:\program files\python38\lib\runpy.py", line 86, in _run_code exec(code, run_globals) File "C:\Program Files\Python38\Scripts\pip.exe\__main__.py", line 9, in <module> TypeError: 'module' object is not callable ``` 为什么'module'对象不可调用? ![图片说明](https://img-ask.csdn.net/upload/202001/06/1578279867_896220.png)
python pip导入包是出现错误
![图片说明](https://img-ask.csdn.net/upload/201911/27/1574785889_849707.png) 想用其他包..pyinstaller和opencv什么的 但是我用网上的代码pip这样的时候总是出错.. 想问问大佬们怎么解决??是不是我的pip安装有什么问题 直接输入pip也有问题也是zhe'y
python pip安装出错 无法安装其他模块
![图片说明](https://img-ask.csdn.net/upload/201911/27/1574787956_59573.png) pip的命令都是这样怎么办???我想安装pyinstaller和opencv都安装不了..有大佬告诉我是哪出错了m
python的pip工具安装第三方库,在不指定安装版本的情况自动安装兼容已有包的版本?
_在Ubuntu16.04的Python虚拟环境,使用pip工具安装了django-stack,默认安装的是django-stack的最新稳定版本,但是由于版本过新,而我电脑中现有的Django版本并不支持,所以pip在暗转django-stack的时候,自动将我的Django版本更新了;_ ![图片说明](https://img-ask.csdn.net/upload/201908/30/1567138036_161509.png) **请问一下各位大佬,除了制定版本号安装,能不能实现pip的默认安装是安装兼容现有依赖包的,而不是重装的依赖包?**
Pyltp有没有适用于python3.8的版本
我在构建知识图谱的时候想使用Pyltp,用pip直接安装会报错,于是想直接下载,想请教一下各位大佬Pyltp有没有适用于python3.8的版本,还是说pyltp0.2.1就可以适用
为什么用pip安装的库有的可以直接在终端用命令执行?
1.如题,在终端用pip安装一些第三方库,有些是需要进入python中,使用import该第三方库进行使用;另外有一种是用pip安装第三方库之后,直接在终端输入相关命令使用该第三方库,此时该三方库犹如一条命令,其中一些完美的库里还附带使用说明,查看该第三方库的使用说明,这是怎么做到的? 2.例如用pip安装TensorFlow深度学习框架下的tensorboard后,可以在命令行使用tensorbord --help查看tensorboard的使用说明。而自己写的一些.py文件就需要在python里用import进行导入后使用。 3.尝试过使用python自带的setuptools,但是不得其法。 4.求解。
Python全局环境下sklearn包中缺失Imputer函数
系统win10 64位,python版本3.7.4。 全局环境下,在我输入下载sklearn包的代码后,显示结果如下,包已经安装: ``` pip install sklearn Requirement already satisfied: sklearn in e:\python\lib\site-packages (0.0) Requirement already satisfied: scikit-learn in e:\python\lib\site-packages (from sklearn) (0.22) Requirement already satisfied: numpy>=1.11.0 in e:\python\lib\site-packages (from scikit-learn->sklearn) (1.17.4) Requirement already satisfied: scipy>=0.17.0 in e:\python\lib\site-packages (from scikit-learn->sklearn) (1.3.3) Requirement already satisfied: joblib>=0.11 in e:\python\lib\site-packages (from scikit-learn->sklearn) (0.14.1) ``` 然而在使用sklearn中的Imputer函数时,会出现报错: ``` >>> import numpy as np >>> import sklearn >>> from sklearn import preprocessing >>> from sklearn.preprocessing import Imputer Traceback (most recent call last): File "<stdin>", line 1, in <module> ImportError: cannot import name 'Imputer' from 'sklearn.preprocessing' (E:\python\lib\site-packages\sklearn\preprocessing\__init__.py) ``` 利用dir()查看包内的函数,发现没有Imputer: ``` >>> dir(sklearn.preprocessing) ['Binarizer', 'FunctionTransformer', 'KBinsDiscretizer', 'KernelCenterer', 'LabelBinarizer', 'LabelEncoder', 'MaxAbsScaler', 'MinMaxScaler', 'MultiLabelBinarizer', 'Normalizer', 'OneHotEncoder', 'OrdinalEncoder', 'PolynomialFeatures', 'PowerTransformer', 'QuantileTransformer', 'RobustScaler', 'StandardScaler', '__all__', '__builtins__', '__cached__', '__doc__', '__file__', '__loader__', '__name__', '__package__', '__path__', '__spec__', '_csr_polynomial_expansion', '_data', '_discretization', '_encoders', '_function_transformer', '_label', 'add_dummy_feature', 'binarize', 'label_binarize', 'maxabs_scale', 'minmax_scale', 'normalize', 'power_transform', 'quantile_transform', 'robust_scale', 'scale'] ``` 但是在conda的base环境下,陆续安装numpy、scipy、matplotlib后,安装 scikit-learn包,就可以使用这个函数了。 我寻找了很久的解决方案,网上说的路径和Imputer相同的情况没有发生,请问大佬们这究竟是怎么回事儿啊
ubuntu18.04 python3.6 pip安装mysqlclient报错
ubuntu18.04 python3.6 pip安装mysqlclient报错 求大佬解答 ``` Building wheels for collected packages: mysqlclient Running setup.py bdist_wheel for mysqlclient ... error Complete output from command /usr/bin/python3 -u -c "import setuptools, tokenize;__file__='/tmp/pip-build-njxuuzpo/mysqlclient/setup.py';f=getattr(tokenize, 'open', open)(__file__);code=f.read().replace('\r\n', '\n');f.close();exec(compile(code, __file__, 'exec'))" bdist_wheel -d /tmp/tmpzs54ny_2pip-wheel- --python-tag cp36: running bdist_wheel running build running build_py creating build creating build/lib.linux-x86_64-3.6 creating build/lib.linux-x86_64-3.6/MySQLdb copying MySQLdb/__init__.py -> build/lib.linux-x86_64-3.6/MySQLdb copying MySQLdb/_exceptions.py -> build/lib.linux-x86_64-3.6/MySQLdb copying MySQLdb/compat.py -> build/lib.linux-x86_64-3.6/MySQLdb copying MySQLdb/connections.py -> build/lib.linux-x86_64-3.6/MySQLdb copying MySQLdb/converters.py -> build/lib.linux-x86_64-3.6/MySQLdb copying MySQLdb/cursors.py -> build/lib.linux-x86_64-3.6/MySQLdb copying MySQLdb/release.py -> build/lib.linux-x86_64-3.6/MySQLdb copying MySQLdb/times.py -> build/lib.linux-x86_64-3.6/MySQLdb creating build/lib.linux-x86_64-3.6/MySQLdb/constants copying MySQLdb/constants/__init__.py -> build/lib.linux-x86_64-3.6/MySQLdb/constants copying MySQLdb/constants/CLIENT.py -> build/lib.linux-x86_64-3.6/MySQLdb/constants copying MySQLdb/constants/CR.py -> build/lib.linux-x86_64-3.6/MySQLdb/constants copying MySQLdb/constants/ER.py -> build/lib.linux-x86_64-3.6/MySQLdb/constants copying MySQLdb/constants/FIELD_TYPE.py -> build/lib.linux-x86_64-3.6/MySQLdb/constants copying MySQLdb/constants/FLAG.py -> build/lib.linux-x86_64-3.6/MySQLdb/constants running build_ext building 'MySQLdb._mysql' extension creating build/temp.linux-x86_64-3.6 creating build/temp.linux-x86_64-3.6/MySQLdb x86_64-linux-gnu-gcc -pthread -DNDEBUG -g -fwrapv -O2 -Wall -g -fstack-protector-strong -Wformat -Werror=format-security -Wdate-time -D_FORTIFY_SOURCE=2 -fPIC -Dversion_info=(1,4,5,'final',0) -D__version__=1.4.5 -I/usr/include/mysql -I/usr/include/python3.6m -c MySQLdb/_mysql.c -o build/temp.linux-x86_64-3.6/MySQLdb/_mysql.o x86_64-linux-gnu-gcc -pthread -shared -Wl,-O1 -Wl,-Bsymbolic-functions -Wl,-Bsymbolic-functions -Wl,-z,relro -Wl,-Bsymbolic-functions -Wl,-z,relro -g -fstack-protector-strong -Wformat -Werror=format-security -Wdate-time -D_FORTIFY_SOURCE=2 build/temp.linux-x86_64-3.6/MySQLdb/_mysql.o -lmysqlclient -lpthread -lz -lm -lrt -latomic -lssl -lcrypto -ldl -o build/lib.linux-x86_64-3.6/MySQLdb/_mysql.cpython-36m-x86_64-linux-gnu.so /usr/bin/ld: cannot find -lssl /usr/bin/ld: cannot find -lcrypto collect2: error: ld returned 1 exit status error: command 'x86_64-linux-gnu-gcc' failed with exit status 1 ---------------------------------------- Failed building wheel for mysqlclient Running setup.py clean for mysqlclient Failed to build mysqlclient Installing collected packages: mysqlclient Running setup.py install for mysqlclient ... error Complete output from command /usr/bin/python3 -u -c "import setuptools, tokenize;__file__='/tmp/pip-build-njxuuzpo/mysqlclient/setup.py';f=getattr(tokenize, 'open', open)(__file__);code=f.read().replace('\r\n', '\n');f.close();exec(compile(code, __file__, 'exec'))" install --record /tmp/pip-ldoqhl56-record/install-record.txt --single-version-externally-managed --compile --user --prefix=: running install running build running build_py creating build creating build/lib.linux-x86_64-3.6 creating build/lib.linux-x86_64-3.6/MySQLdb copying MySQLdb/__init__.py -> build/lib.linux-x86_64-3.6/MySQLdb copying MySQLdb/_exceptions.py -> build/lib.linux-x86_64-3.6/MySQLdb copying MySQLdb/compat.py -> build/lib.linux-x86_64-3.6/MySQLdb copying MySQLdb/connections.py -> build/lib.linux-x86_64-3.6/MySQLdb copying MySQLdb/converters.py -> build/lib.linux-x86_64-3.6/MySQLdb copying MySQLdb/cursors.py -> build/lib.linux-x86_64-3.6/MySQLdb copying MySQLdb/release.py -> build/lib.linux-x86_64-3.6/MySQLdb copying MySQLdb/times.py -> build/lib.linux-x86_64-3.6/MySQLdb creating build/lib.linux-x86_64-3.6/MySQLdb/constants copying MySQLdb/constants/__init__.py -> build/lib.linux-x86_64-3.6/MySQLdb/constants copying MySQLdb/constants/CLIENT.py -> build/lib.linux-x86_64-3.6/MySQLdb/constants copying MySQLdb/constants/CR.py -> build/lib.linux-x86_64-3.6/MySQLdb/constants copying MySQLdb/constants/ER.py -> build/lib.linux-x86_64-3.6/MySQLdb/constants copying MySQLdb/constants/FIELD_TYPE.py -> build/lib.linux-x86_64-3.6/MySQLdb/constants copying MySQLdb/constants/FLAG.py -> build/lib.linux-x86_64-3.6/MySQLdb/constants running build_ext building 'MySQLdb._mysql' extension creating build/temp.linux-x86_64-3.6 creating build/temp.linux-x86_64-3.6/MySQLdb x86_64-linux-gnu-gcc -pthread -DNDEBUG -g -fwrapv -O2 -Wall -g -fstack-protector-strong -Wformat -Werror=format-security -Wdate-time -D_FORTIFY_SOURCE=2 -fPIC -Dversion_info=(1,4,5,'final',0) -D__version__=1.4.5 -I/usr/include/mysql -I/usr/include/python3.6m -c MySQLdb/_mysql.c -o build/temp.linux-x86_64-3.6/MySQLdb/_mysql.o x86_64-linux-gnu-gcc -pthread -shared -Wl,-O1 -Wl,-Bsymbolic-functions -Wl,-Bsymbolic-functions -Wl,-z,relro -Wl,-Bsymbolic-functions -Wl,-z,relro -g -fstack-protector-strong -Wformat -Werror=format-security -Wdate-time -D_FORTIFY_SOURCE=2 build/temp.linux-x86_64-3.6/MySQLdb/_mysql.o -lmysqlclient -lpthread -lz -lm -lrt -latomic -lssl -lcrypto -ldl -o build/lib.linux-x86_64-3.6/MySQLdb/_mysql.cpython-36m-x86_64-linux-gnu.so /usr/bin/ld: cannot find -lssl /usr/bin/ld: cannot find -lcrypto collect2: error: ld returned 1 exit status error: command 'x86_64-linux-gnu-gcc' failed with exit status 1 ---------------------------------------- Command "/usr/bin/python3 -u -c "import setuptools, tokenize;__file__='/tmp/pip-build-njxuuzpo/mysqlclient/setup.py';f=getattr(tokenize, 'open', open)(__file__);code=f.read().replace('\r\n', '\n');f.close();exec(compile(code, __file__, 'exec'))" install --record /tmp/pip-ldoqhl56-record/install-record.txt --single-version-externally-managed --compile --user --prefix=" failed with error code 1 in /tmp/pip-build-njxuuzpo/mysqlclient/ ```
python】有requirements.txt文件后,如何创建对应的conda虚拟环境?可以使用pip命令来安装吗?
尝试在创建环境并激活 ``` conda create envname activate envname ``` 后,使用pip安装requirements.txt ``` pip install -r requirements.txt ``` 然后测试运行(newhello.py需要的包在requirements.txt中国,之前并未安装) ``` python newhello.py ``` 结果可以运行。 但发现 ``` conda list ``` 显示没有任何包安装, ``` pip list ``` 显示的包与主环境一致(增加了requirements.txt的内容)。 这是什么原因?pip和conda是怎么管理的?是完全独立的吗? 在conda虚拟环境中安装包时应该用conda install吗? 如果要依据requirements.txt并使用environment.yml来创建conda环境,应该怎么做?channel,dependencies要如何填写
TypeError: 'module' object is not callable cmd中pip无法使用?
C:\Users\lenovo>pip -version Traceback (most recent call last): File "c:\users\lenovo\appdata\local\programs\python\python38\lib\runpy.py", line 192, in _run_module_as_main ``` return _run_code(code, main_globals, None,"__main__", mod_spec) ``` File "c:\users\lenovo\appdata\local\programs\python\python38\lib\runpy.py", line 85, in _run_code ``` exec(code, run_globals) ``` File "C:\Users\lenovo\AppData\Local\Programs\Python\Python38\Scripts\pip.exe\__main.py", line 9, in ``` <module> ``` **TypeError: 'module' object is not callable** ![图片说明](https://img-ask.csdn.net/upload/201911/13/1573644096_292149.png) 我已经把网上所有的方法都试了, 设置添加路径 ![图片说明](https://img-ask.csdn.net/upload/201911/13/1573643660_888350.png) ![图片说明](https://img-ask.csdn.net/upload/201911/13/1573643548_640661.png) 我也重装了python 用python -m pip install -U pip 升级了pip (python -m pip可以使用) 都不行 到底怎么办啊!
pip升级怎么提示这个 怎么 解决 老版本也删除了 我的是python 3.7
``` D:\python>python -m pip install --upgrade pip Collecting pip Downloading https://files.pythonhosted.org/packages/30/db/9e38760b32e3e7f40cce46dd5fb107b8c73840df38f0046d8e6514e675a1/pip-19.2.3-py2.py3-none-any.whl (1.4MB) 1% |▌ | 20kB 1.4kB/s eta 0:16:35Exception: Traceback (most recent call last): File "D:\python\lib\site-packages\pip\_vendor\urllib3\response.py", line 302, in _error_catcher yield File "D:\python\lib\site-packages\pip\_vendor\urllib3\response.py", line 384, in read data = self._fp.read(amt) File "D:\python\lib\site-packages\pip\_vendor\cachecontrol\filewrapper.py", line 60, in read data = self.__fp.read(amt) File "D:\python\lib\http\client.py", line 447, in read n = self.readinto(b) File "D:\python\lib\http\client.py", line 491, in readinto n = self.fp.readinto(b) File "D:\python\lib\socket.py", line 589, in readinto return self._sock.recv_into(b) File "D:\python\lib\ssl.py", line 1049, in recv_into return self.read(nbytes, buffer) File "D:\python\lib\ssl.py", line 908, in read return self._sslobj.read(len, buffer) socket.timeout: The read operation timed out During handling of the above exception, another exception occurred: Traceback (most recent call last): File "D:\python\lib\site-packages\pip\_internal\basecommand.py", line 228, in main status = self.run(options, args) File "D:\python\lib\site-packages\pip\_internal\commands\install.py", line 291, in run resolver.resolve(requirement_set) File "D:\python\lib\site-packages\pip\_internal\resolve.py", line 103, in resolve self._resolve_one(requirement_set, req) File "D:\python\lib\site-packages\pip\_internal\resolve.py", line 257, in _resolve_one abstract_dist = self._get_abstract_dist_for(req_to_install) File "D:\python\lib\site-packages\pip\_internal\resolve.py", line 210, in _get_abstract_dist_for self.require_hashes File "D:\python\lib\site-packages\pip\_internal\operations\prepare.py", line 310, in prepare_linked_requirement progress_bar=self.progress_bar File "D:\python\lib\site-packages\pip\_internal\download.py", line 837, in unpack_url progress_bar=progress_bar File "D:\python\lib\site-packages\pip\_internal\download.py", line 674, in unpack_http_url progress_bar) File "D:\python\lib\site-packages\pip\_internal\download.py", line 898, in _download_http_url _download_url(resp, link, content_file, hashes, progress_bar) File "D:\python\lib\site-packages\pip\_internal\download.py", line 618, in _download_url hashes.check_against_chunks(downloaded_chunks) File "D:\python\lib\site-packages\pip\_internal\utils\hashes.py", line 48, in check_against_chunks for chunk in chunks: File "D:\python\lib\site-packages\pip\_internal\download.py", line 586, in written_chunks for chunk in chunks: File "D:\python\lib\site-packages\pip\_internal\utils\ui.py", line 159, in iter for x in it: File "D:\python\lib\site-packages\pip\_internal\download.py", line 575, in resp_read decode_content=False): File "D:\python\lib\site-packages\pip\_vendor\urllib3\response.py", line 436, in stream data = self.read(amt=amt, decode_content=decode_content) File "D:\python\lib\site-packages\pip\_vendor\urllib3\response.py", line 401, in read raise IncompleteRead(self._fp_bytes_read, self.length_remaining) File "D:\python\lib\contextlib.py", line 130, in __exit__ self.gen.throw(type, value, traceback) File "D:\python\lib\site-packages\pip\_vendor\urllib3\response.py", line 307, in _error_catcher raise ReadTimeoutError(self._pool, None, 'Read timed out.') pip._vendor.urllib3.exceptions.ReadTimeoutError: HTTPSConnectionPool(host='files.pythonhosted.org', port=443): Read timed out. ```
python 安装 pymssql 库时报错
安装第三方库 ``` pip install pymssql Traceback (most recent call last): File "c:\users\XXX\appdata\local\programs\python\python37\lib\site-packages\pip\_vendor\urllib3\response.py", line 425, in _error_catcher yield File "c:\users\XXX\appdata\local\programs\python\python37\lib\site-packages\pip\_vendor\urllib3\response.py", line 507, in read data = self._fp.read(amt) if not fp_closed else b"" File "c:\users\XXX\appdata\local\programs\python\python37\lib\site-packages\pip\_vendor\cachecontrol\filewrapper.py", line 62, in read data = self.__fp.read(amt) File "c:\users\XXX\appdata\local\programs\python\python37\lib\http\client.py", line 457, in read n = self.readinto(b) File "c:\users\XXX\appdata\local\programs\python\python37\lib\http\client.py", line 501, in readinto n = self.fp.readinto(b) File "c:\users\XXX\appdata\local\programs\python\python37\lib\socket.py", line 589, in readinto return self._sock.recv_into(b) File "c:\users\XXX\appdata\local\programs\python\python37\lib\ssl.py", line 1071, in recv_into return self.read(nbytes, buffer) File "c:\users\XXX\appdata\local\programs\python\python37\lib\ssl.py", line 929, in read return self._sslobj.read(len, buffer) socket.timeout: The read operation timed out During handling of the above exception, another exception occurred: Traceback (most recent call last): File "c:\users\XXX\appdata\local\programs\python\python37\lib\site-packages\pip\_internal\cli\base_command.py", line 153, in _main status = self.run(options, args) File "c:\users\XXX\appdata\local\programs\python\python37\lib\site-packages\pip\_internal\commands\install.py", line 382, in run resolver.resolve(requirement_set) File "c:\users\XXX\appdata\local\programs\python\python37\lib\site-packages\pip\_internal\legacy_resolve.py", line 201, in resolve self._resolve_one(requirement_set, req) File "c:\users\XXX\appdata\local\programs\python\python37\lib\site-packages\pip\_internal\legacy_resolve.py", line 365, in _resolve_one abstract_dist = self._get_abstract_dist_for(req_to_install) File "c:\users\XXX\appdata\local\programs\python\python37\lib\site-packages\pip\_internal\legacy_resolve.py", line 313, in _get_abstract_dist_for req, self.session, self.finder, self.require_hashes File "c:\users\XXX\appdata\local\programs\python\python37\lib\site-packages\pip\_internal\operations\prepare.py", line 194, in prepare_linked_requirement progress_bar=self.progress_bar File "c:\users\XXX\appdata\local\programs\python\python37\lib\site-packages\pip\_internal\download.py", line 465, in unpack_url progress_bar=progress_bar File "c:\users\XXX\appdata\local\programs\python\python37\lib\site-packages\pip\_internal\download.py", line 316, in unpack_http_url progress_bar) File "c:\users\XXX\appdata\local\programs\python\python37\lib\site-packages\pip\_internal\download.py", line 551, in _download_http_url _download_url(resp, link, content_file, hashes, progress_bar) File "c:\users\XXX\appdata\local\programs\python\python37\lib\site-packages\pip\_internal\download.py", line 253, in _download_url hashes.check_against_chunks(downloaded_chunks) File "c:\users\XXX\appdata\local\programs\python\python37\lib\site-packages\pip\_internal\utils\hashes.py", line 80, in check_against_chunks for chunk in chunks: File "c:\users\XXX\appdata\local\programs\python\python37\lib\site-packages\pip\_internal\download.py", line 223, in written_chunks for chunk in chunks: File "c:\users\XXX\appdata\local\programs\python\python37\lib\site-packages\pip\_internal\utils\ui.py", line 160, in iter for x in it: File "c:\users\XXX\appdata\local\programs\python\python37\lib\site-packages\pip\_internal\download.py", line 212, in resp_read decode_content=False): File "c:\users\XXX\appdata\local\programs\python\python37\lib\site-packages\pip\_vendor\urllib3\response.py", line 564, in stream data = self.read(amt=amt, decode_content=decode_content) File "c:\users\XXX\appdata\local\programs\python\python37\lib\site-packages\pip\_vendor\urllib3\response.py", line 529, in read raise IncompleteRead(self._fp_bytes_read, self.length_remaining) File "c:\users\XXX\appdata\local\programs\python\python37\lib\contextlib.py", line 130, in __exit__ self.gen.throw(type, value, traceback) File "c:\users\XXX\appdata\local\programs\python\python37\lib\site-packages\pip\_vendor\urllib3\response.py", line 430, in _error_catcher raise ReadTimeoutError(self._pool, None, "Read timed out.") pip._vendor.urllib3.exceptions.ReadTimeoutError: HTTPSConnectionPool(host='pypi.tuna.tsinghua.edu.cn', port=443): Read timed out. ``` 也下载了 wordcloud-1.6.0-cp37-cp37m-win_amd64.whl python版本是3.7 64位
pip / conda install 报 SSLError
# 我想安装 pycurl 库一直报ssl的错 **安装其他库也报这个错 我python 和 anacoda 卸载重装还是这样** ![图片说明](https://img-ask.csdn.net/upload/201912/29/1577603682_113807.png) ![图片说明](https://img-ask.csdn.net/upload/201912/29/1577603787_388466.png) **网上查到说添加环境变量 添加了但还是不行** anacoda 安装文件夹是anacode (新建文件夹的时候打错了) Python 3.7.6 windows 10 系统 大佬们知道什么原因吗? ``` 错误文本: pip install pycurl WARNING: pip is configured with locations that require TLS/SSL, however the ssl module in Python is not available. Requirement already satisfied: pycurl in d:\anacode\lib\site-packages (7.43.0.3) WARNING: pip is configured with locations that require TLS/SSL, however the ssl module in Python is not available. Could not fetch URL https://pypi.org/simple/pip/: There was a problem confirming the ssl certificate: HTTPSConnectionPool(host='pypi.org', port=443): Max retries exceeded with url: /simple/pip/ (Caused by SSLError("Can't connect to HTTPS URL because the SSL module is not available.")) - skipping C:\Users\Enz>conda install scrapy Collecting package metadata (current_repodata.json): failed CondaHTTPError: HTTP 000 CONNECTION FAILED for url <https://repo.anaconda.com/pkgs/main/win-64/current_repodata.json> Elapsed: - An HTTP error occurred when trying to retrieve this URL. HTTP errors are often intermittent, and a simple retry will get you on your way. If your current network has https://www.anaconda.com blocked, please file a support request with your network engineering team. SSLError(MaxRetryError('HTTPSConnectionPool(host=\'repo.anaconda.com\', port=443): Max retries exceeded with url: /pkgs/main/win-64/current_repodata.json (Caused by SSLError("Can\'t connect to HTTPS URL because the SSL module is not available."))')) ```
u盘里的python用不了pip?
我照网上的步骤把它安装在u盘里,测试过了,用得了。 但pip用不了。怎办? 报错为: ``` ModuleNotFoundError: No module named 'pip' H:\learn\python_01001》pip install Traceback (most recent call last): File "runpy.py", line 192, in _run_module_as_main File "runpy.py", line 85, in _run_code File "H:\learn\python_01001\Scripts\pip.exe\__main__.py", line 4, in <module> ModuleNotFoundError: No module named 'pip' ```
问,u盘里的python用不了pip?
我照网上的步骤把它安装在u盘里,测试过了,用得了。 但pip用不了。怎办? 报错为: ``` H:\learn\python》pip install Traceback (most recent call last): File "runpy.py", line 192, in _run_module_as_main File "runpy.py", line 85, in _run_code File "H:\learn\python_01001\Scripts\pip.exe\__main__.py", line 4, in <module> ModuleNotFoundError: No module named 'pip' ```
请问大佬们,我用python编写了一个id3算法,如何让让用户自己输入数据来验证这些数据对应的结果?
#--coding:GBK # -*- coding: utf-8 -*- #pip install matplotlib from math import log ##创建数据集 def createDataSet(): """ 创建数据集 """ dataSet = [['青年', '否', '否', '一般', '拒绝'], ['青年', '否', '否', '好', '拒绝'], ['青年', '是', '否', '好', '同意'], ['青年', '是', '是', '一般', '同意'], ['青年', '否', '否', '一般', '拒绝'], ['中年', '否', '否', '一般', '拒绝'], ['中年', '否', '否', '好', '拒绝'], ['中年', '是', '是', '好', '同意'], ['中年', '否', '是', '非常好', '同意'], ['中年', '否', '是', '非常好', '同意'], ['老年', '否', '是', '非常好', '同意'], ['老年', '否', '是', '好', '同意'], ['老年', '是', '否', '好', '同意'], ['老年', '是', '否', '非常好', '同意'], ['老年', '否', '否', '一般', '拒绝'], ] featureName = ['年龄', '有工作', '有房子', '信贷情况'] # 返回数据集和每个维度的名称 return dataSet, featureName ##分割数据集 def splitDataSet(dataSet,axis,value): """ 按照给定特征划分数据集 :param axis:划分数据集的特征的维度 :param value:特征的值 :return: 符合该特征的所有实例(并且自动移除掉这维特征) """ # 循环遍历dataSet中的每一行数据 retDataSet = [] for featVec in dataSet: if featVec[axis] == value: reduceFeatVec = featVec[:axis] # 删除这一维特征,切片不包括axis reduceFeatVec.extend(featVec[axis+1:]) #把aixs去掉之后的列表前后拼在一起 retDataSet.append(reduceFeatVec) return retDataSet#把去掉axis之后的列表返回 ##计算信息熵 # 计算的始终是类别标签的不确定度 def calcShannonEnt(dataSet): """ 计算训练数据集中的Y随机变量的香农熵 :param dataSet: :return: """ numEntries = len(dataSet) # 实例的个数 labelCounts = {} for featVec in dataSet: # 遍历每个实例,统计标签的频次 currentLabel = featVec[-1] # 表示最后一列,,为什么要等与最后一列 # 当前标签不在labelCounts map中,就让labelCounts加入该标签 if currentLabel not in labelCounts.keys(): labelCounts[currentLabel] =0 labelCounts[currentLabel] +=1 shannonEnt = 0.0#初始化香农熵,香农熵越小纯度越高 for key in labelCounts: prob = float(labelCounts[key]) / numEntries shannonEnt -= prob * log(prob,2) # log base 2, return shannonEnt#返回列表的总香农熵 ## 计算条件熵 def calcConditionalEntropy(dataSet,i,featList,uniqueVals): """ 计算x_i给定的条件下,Y的条件熵 :param dataSet: 数据集 :param i: 维度i :param featList: 数据集特征列表 :param unqiueVals: 数据集特征集合 :return: 条件熵 """ ce = 0.0 for value in uniqueVals: subDataSet = splitDataSet(dataSet,i,value) prob = len(subDataSet) / float(len(dataSet)) # 极大似然估计概率 ce += prob * calcShannonEnt(subDataSet) #∑pH(Y|X=xi) 条件熵的计算 return ce ##计算信息增益 def calcInformationGain(dataSet,baseEntropy,i): """ 计算信息增益 :param dataSet: 数据集 :param baseEntropy: 数据集中Y的信息熵 :param i: 特征维度i :return: 特征i对数据集的信息增益g(dataSet | X_i) """ featList = [example[i] for example in dataSet] # 第i维特征列表 uniqueVals = set(featList) # 换成集合 - 集合中的每个元素不重复 newEntropy = calcConditionalEntropy(dataSet,i,featList,uniqueVals)#计算条件熵, infoGain = baseEntropy - newEntropy # 信息增益 = 信息熵 - 条件熵 return infoGain ## 算法框架 def chooseBestFeatureToSplitByID3(dataSet): """ 选择最好的数据集划分 :param dataSet: :return: """ numFeatures = len(dataSet[0]) -1 # 最后一列是分类 baseEntropy = calcShannonEnt(dataSet) #返回整个数据集的信息熵 bestInfoGain = 0.0 bestFeature = -1 for i in range(numFeatures): # 遍历所有维度特征 infoGain = calcInformationGain(dataSet,baseEntropy,i) #返回具体特征的信息增益 if(infoGain > bestInfoGain): bestInfoGain = infoGain bestFeature = i return bestFeature # 返回最佳特征对应的维度 def createTree(dataSet,featureName,chooseBestFeatureToSplitFunc = chooseBestFeatureToSplitByID3): """ 创建决策树 :param dataSet: 数据集 :param featureName: 数据集每一维的名称 :return: 决策树 """ classList = [example[-1] for example in dataSet] # 类别列表 if classList.count(classList[0]) == len(classList): # 统计属于列别classList[0]的个数 return classList[0] # 当类别完全相同则停止继续划分 if len(dataSet[0]) ==1: # 当只有一个特征的时候,遍历所有实例返回出现次数最多的类别 return majorityCnt(classList) # 返回类别标签 bestFeat = chooseBestFeatureToSplitFunc(dataSet)#最佳特征对应的索引 bestFeatLabel = featureName[bestFeat] #最佳特征 myTree ={bestFeatLabel:{}} # map 结构,且key为featureLabel del (featureName[bestFeat]) # 找到需要分类的特征子集 featValues = [example[bestFeat] for example in dataSet] uniqueVals = set(featValues) for value in uniqueVals: subLabels = featureName[:] # 复制操作 myTree[bestFeatLabel][value] = createTree(splitDataSet(dataSet,bestFeat,value),subLabels) return myTree # 测试决策树的构建 dataSet,featureName = createDataSet() myTree = createTree(dataSet,featureName) print(myTree)
pip install ipython 时出现什么编码解码的问题导致无法安装
``` (django_st) pyvip@VIP:~/django_st$ pip install ipython Looking in indexes: https://pypi.douban.com/simple Collecting ipython Downloading https://pypi.doubanio.com/packages/05/d7/77b7a1988c99227f52402f93fb0f7e88c97239960516f53907ebbc44149c/ipython-7.11.0-py3-none-any.whl (777kB) |████████████████████████████████| 778kB 1.4MB/s ERROR: Could not install packages due to an EnvironmentError: ('Received response with content-encoding: gzip, but failed to decode it.', error('Error -3 while decompressing data: incorrect header check',)) (django_st) pyvip@VIP:~/django_st$ python manage.py shell Python 3.6.9 (default, Nov 7 2019, 10:44:02) [GCC 8.3.0] on linux Type "help", "copyright", "credits" or "license" for more information. (InteractiveConsole) >>> exit() (django_st) pyvip@VIP:~/django_st$ sudo pip install ipython [sudo] pyvip 的密码: The directory '/home/pyvip/.cache/pip/http' or its parent directory is not owned by the current user and the cache has been disabled. Please check the permissions and owner of that directory. If executing pip with sudo, you may want sudo's -H flag. The directory '/home/pyvip/.cache/pip' or its parent directory is not owned by the current user and caching wheels has been disabled. check the permissions and owner of that directory. If executing pip with sudo, you may want sudo's -H flag. Requirement already satisfied: ipython in /usr/local/lib/python3.6/dist-packages Requirement already satisfied: decorator in /usr/local/lib/python3.6/dist-packages (from ipython) Requirement already satisfied: pickleshare in /usr/local/lib/python3.6/dist-packages (from ipython) Requirement already satisfied: traitlets>=4.2 in /usr/local/lib/python3.6/dist-packages (from ipython) Requirement already satisfied: prompt-toolkit!=3.0.0,!=3.0.1,<3.1.0,>=2.0.0 in /usr/local/lib/python3.6/dist-packages (from ipython) Requirement already satisfied: pexpect; sys_platform != "win32" in /usr/lib/python3/dist-packages (from ipython) Requirement already satisfied: backcall in /usr/local/lib/python3.6/dist-packages (from ipython) Requirement already satisfied: pygments in /usr/local/lib/python3.6/dist-packages (from ipython) Requirement already satisfied: jedi>=0.10 in /usr/local/lib/python3.6/dist-packages (from ipython) Requirement already satisfied: setuptools>=18.5 in /usr/lib/python3/dist-packages (from ipython) Requirement already satisfied: six in /usr/lib/python3/dist-packages (from traitlets>=4.2->ipython) Requirement already satisfied: ipython-genutils in /usr/local/lib/python3.6/dist-packages (from traitlets>=4.2->ipython) Requirement already satisfied: wcwidth in /usr/local/lib/python3.6/dist-packages (from prompt-toolkit!=3.0.0,!=3.0.1,<3.1.0,>=2.0.0->ipython) Requirement already satisfied: parso>=0.5.2 in /usr/local/lib/python3.6/dist-packages (from jedi>=0.10->ipython) (django_st) pyvip@VIP:~/django_st$ ipython --version 7.11.0 (django_st) pyvip@VIP:~/django_st$ python manage.py shell Python 3.6.9 (default, Nov 7 2019, 10:44:02) [GCC 8.3.0] on linux Type "help", "copyright", "credits" or "license" for more information. (InteractiveConsole) >>> exit() ```
Python docx用cmd安装成功,但是用Jupyter notebook或者vs code都无法找到模块
以下是用cmd成功安装的信息,在py3环境下打开jupyter Notebook,提示错误ModuleNotFoundError: No module named 'docx' 请问是什么原因呢? ``` Building wheels for collected packages: python-docx Building wheel for python-docx (setup.py) ... done Created wheel for python-docx: filename=python_docx-0.8.10-cp37-none-any.whl size=184496 sha256=ec002f7487a8f06268a573bf1623f77a22a000884057bca273252c991c8d4135 Stored in directory: C:\Users\niko\AppData\Local\pip\Cache\wheels\18\0b\a0\1dd62ff812c857c9e487f27d80d53d2b40531bec1acecfa47b Successfully built python-docx Installing collected packages: lxml, python-docx Successfully installed lxml-4.4.1 python-docx-0.8.10 (py3) my_PC C:\Users\niko $ pip freeze certifi==2019.9.11 lxml==4.4.1 python-docx==0.8.10 wincertstore==0.2 (py3) my_PC C:\Users\niko $ jupyter notebook ```
爬虫福利二 之 妹子图网MM批量下载
爬虫福利一:27报网MM批量下载    点击 看了本文,相信大家对爬虫一定会产生强烈的兴趣,激励自己去学习爬虫,在这里提前祝:大家学有所成! 目标网站:妹子图网 环境:Python3.x 相关第三方模块:requests、beautifulsoup4 Re:各位在测试时只需要将代码里的变量 path 指定为你当前系统要保存的路径,使用 python xxx.py 或IDE运行即可。
Java学习的正确打开方式
在博主认为,对于入门级学习java的最佳学习方法莫过于视频+博客+书籍+总结,前三者博主将淋漓尽致地挥毫于这篇博客文章中,至于总结在于个人,实际上越到后面你会发现学习的最好方式就是阅读参考官方文档其次就是国内的书籍,博客次之,这又是一个层次了,这里暂时不提后面再谈。博主将为各位入门java保驾护航,各位只管冲鸭!!!上天是公平的,只要不辜负时间,时间自然不会辜负你。 何谓学习?博主所理解的学习,它
程序员必须掌握的核心算法有哪些?
由于我之前一直强调数据结构以及算法学习的重要性,所以就有一些读者经常问我,数据结构与算法应该要学习到哪个程度呢?,说实话,这个问题我不知道要怎么回答你,主要取决于你想学习到哪些程度,不过针对这个问题,我稍微总结一下我学过的算法知识点,以及我觉得值得学习的算法。这些算法与数据结构的学习大多数是零散的,并没有一本把他们全部覆盖的书籍。下面是我觉得值得学习的一些算法以及数据结构,当然,我也会整理一些看过
大学四年自学走来,这些私藏的实用工具/学习网站我贡献出来了
大学四年,看课本是不可能一直看课本的了,对于学习,特别是自学,善于搜索网上的一些资源来辅助,还是非常有必要的,下面我就把这几年私藏的各种资源,网站贡献出来给你们。主要有:电子书搜索、实用工具、在线视频学习网站、非视频学习网站、软件下载、面试/求职必备网站。 注意:文中提到的所有资源,文末我都给你整理好了,你们只管拿去,如果觉得不错,转发、分享就是最大的支持了。 一、PDF搜索网站推荐 对于大部
linux系列之常用运维命令整理笔录
本博客记录工作中需要的linux运维命令,大学时候开始接触linux,会一些基本操作,可是都没有整理起来,加上是做开发,不做运维,有些命令忘记了,所以现在整理成博客,当然vi,文件操作等就不介绍了,慢慢积累一些其它拓展的命令,博客不定时更新 顺便拉下票,我在参加csdn博客之星竞选,欢迎投票支持,每个QQ或者微信每天都可以投5票,扫二维码即可,http://m234140.nofollow.ax.
比特币原理详解
一、什么是比特币 比特币是一种电子货币,是一种基于密码学的货币,在2008年11月1日由中本聪发表比特币白皮书,文中提出了一种去中心化的电子记账系统,我们平时的电子现金是银行来记账,因为银行的背后是国家信用。去中心化电子记账系统是参与者共同记账。比特币可以防止主权危机、信用风险。其好处不多做赘述,这一层面介绍的文章很多,本文主要从更深层的技术原理角度进行介绍。 二、问题引入  假设现有4个人
程序员接私活怎样防止做完了不给钱?
首先跟大家说明一点,我们做 IT 类的外包开发,是非标品开发,所以很有可能在开发过程中会有这样那样的需求修改,而这种需求修改很容易造成扯皮,进而影响到费用支付,甚至出现做完了项目收不到钱的情况。 那么,怎么保证自己的薪酬安全呢? 我们在开工前,一定要做好一些证据方面的准备(也就是“讨薪”的理论依据),这其中最重要的就是需求文档和验收标准。一定要让需求方提供这两个文档资料作为开发的基础。之后开发
网页实现一个简单的音乐播放器(大佬别看。(⊙﹏⊙))
今天闲着无事,就想写点东西。然后听了下歌,就打算写个播放器。 于是乎用h5 audio的加上js简单的播放器完工了。 欢迎 改进 留言。 演示地点跳到演示地点 html代码如下`&lt;!DOCTYPE html&gt; &lt;html&gt; &lt;head&gt; &lt;title&gt;music&lt;/title&gt; &lt;meta charset="utf-8"&gt
Python十大装B语法
Python 是一种代表简单思想的语言,其语法相对简单,很容易上手。不过,如果就此小视 Python 语法的精妙和深邃,那就大错特错了。本文精心筛选了最能展现 Python 语法之精妙的十个知识点,并附上详细的实例代码。如能在实战中融会贯通、灵活使用,必将使代码更为精炼、高效,同时也会极大提升代码B格,使之看上去更老练,读起来更优雅。 1. for - else 什么?不是 if 和 else 才
数据库优化 - SQL优化
前面一篇文章从实例的角度进行数据库优化,通过配置一些参数让数据库性能达到最优。但是一些“不好”的SQL也会导致数据库查询变慢,影响业务流程。本文从SQL角度进行数据库优化,提升SQL运行效率。 判断问题SQL 判断SQL是否有问题时可以通过两个表象进行判断: 系统级别表象 CPU消耗严重 IO等待严重 页面响应时间过长
2019年11月中国大陆编程语言排行榜
2019年11月2日,我统计了某招聘网站,获得有效程序员招聘数据9万条。针对招聘信息,提取编程语言关键字,并统计如下: 编程语言比例 rank pl_ percentage 1 java 33.62% 2 c/c++ 16.42% 3 c_sharp 12.82% 4 javascript 12.31% 5 python 7.93% 6 go 7.25% 7
通俗易懂地给女朋友讲:线程池的内部原理
餐厅的约会 餐盘在灯光的照耀下格外晶莹洁白,女朋友拿起红酒杯轻轻地抿了一小口,对我说:“经常听你说线程池,到底线程池到底是个什么原理?”我楞了一下,心里想女朋友今天是怎么了,怎么突然问出这么专业的问题,但做为一个专业人士在女朋友面前也不能露怯啊,想了一下便说:“我先给你讲讲我前同事老王的故事吧!” 大龄程序员老王 老王是一个已经北漂十多年的程序员,岁数大了,加班加不动了,升迁也无望,于是拿着手里
经典算法(5)杨辉三角
写在前面: 我是 扬帆向海,这个昵称来源于我的名字以及女朋友的名字。我热爱技术、热爱开源、热爱编程。技术是开源的、知识是共享的。 这博客是对自己学习的一点点总结及记录,如果您对 Java、算法 感兴趣,可以关注我的动态,我们一起学习。 用知识改变命运,让我们的家人过上更好的生活。 目录一、杨辉三角的介绍二、杨辉三角的算法思想三、代码实现1.第一种写法2.第二种写法 一、杨辉三角的介绍 百度
腾讯算法面试题:64匹马8个跑道需要多少轮才能选出最快的四匹?
昨天,有网友私信我,说去阿里面试,彻底的被打击到了。问了为什么网上大量使用ThreadLocal的源码都会加上private static?他被难住了,因为他从来都没有考虑过这个问题。无独有偶,今天笔者又发现有网友吐槽了一道腾讯的面试题,我们一起来看看。 腾讯算法面试题:64匹马8个跑道需要多少轮才能选出最快的四匹? 在互联网职场论坛,一名程序员发帖求助到。二面腾讯,其中一个算法题:64匹
面试官:你连RESTful都不知道我怎么敢要你?
面试官:了解RESTful吗? 我:听说过。 面试官:那什么是RESTful? 我:就是用起来很规范,挺好的 面试官:是RESTful挺好的,还是自我感觉挺好的 我:都挺好的。 面试官:… 把门关上。 我:… 要干嘛?先关上再说。 面试官:我说出去把门关上。 我:what ?,夺门而去 文章目录01 前言02 RESTful的来源03 RESTful6大原则1. C-S架构2. 无状态3.统一的接
为啥国人偏爱Mybatis,而老外喜欢Hibernate/JPA呢?
关于SQL和ORM的争论,永远都不会终止,我也一直在思考这个问题。昨天又跟群里的小伙伴进行了一番讨论,感触还是有一些,于是就有了今天这篇文。 声明:本文不会下关于Mybatis和JPA两个持久层框架哪个更好这样的结论。只是摆事实,讲道理,所以,请各位看官勿喷。 一、事件起因 关于Mybatis和JPA孰优孰劣的问题,争论已经很多年了。一直也没有结论,毕竟每个人的喜好和习惯是大不相同的。我也看
SQL-小白最佳入门sql查询一
一 说明 如果是初学者,建议去网上寻找安装Mysql的文章安装,以及使用navicat连接数据库,以后的示例基本是使用mysql数据库管理系统; 二 准备前提 需要建立一张学生表,列分别是id,名称,年龄,学生信息;本示例中文章篇幅原因SQL注释略; 建表语句: CREATE TABLE `student` ( `id` int(11) NOT NULL AUTO_INCREMENT, `
项目中的if else太多了,该怎么重构?
介绍 最近跟着公司的大佬开发了一款IM系统,类似QQ和微信哈,就是聊天软件。我们有一部分业务逻辑是这样的 if (msgType = "文本") { // dosomething } else if(msgType = "图片") { // doshomething } else if(msgType = "视频") { // doshomething } else { // dosho
【图解经典算法题】如何用一行代码解决约瑟夫环问题
约瑟夫环问题算是很经典的题了,估计大家都听说过,然后我就在一次笔试中遇到了,下面我就用 3 种方法来详细讲解一下这道题,最后一种方法学了之后保证让你可以让你装逼。 问题描述:编号为 1-N 的 N 个士兵围坐在一起形成一个圆圈,从编号为 1 的士兵开始依次报数(1,2,3…这样依次报),数到 m 的 士兵会被杀死出列,之后的士兵再从 1 开始报数。直到最后剩下一士兵,求这个士兵的编号。 1、方
致 Python 初学者
文章目录1. 前言2. 明确学习目标,不急于求成,不好高骛远3. 在开始学习 Python 之前,你需要做一些准备2.1 Python 的各种发行版2.2 安装 Python2.3 选择一款趁手的开发工具3. 习惯使用IDLE,这是学习python最好的方式4. 严格遵从编码规范5. 代码的运行、调试5. 模块管理5.1 同时安装了py2/py35.2 使用Anaconda,或者通过IDE来安装模
“狗屁不通文章生成器”登顶GitHub热榜,分分钟写出万字形式主义大作
一、垃圾文字生成器介绍 最近在浏览GitHub的时候,发现了这样一个骨骼清奇的雷人项目,而且热度还特别高。 项目中文名:狗屁不通文章生成器 项目英文名:BullshitGenerator 根据作者的介绍,他是偶尔需要一些中文文字用于GUI开发时测试文本渲染,因此开发了这个废话生成器。但由于生成的废话实在是太过富于哲理,所以最近已经被小伙伴们给玩坏了。 他的文风可能是这样的: 你发现,
程序员:我终于知道post和get的区别
IT界知名的程序员曾说:对于那些月薪三万以下,自称IT工程师的码农们,其实我们从来没有把他们归为我们IT工程师的队伍。他们虽然总是以IT工程师自居,但只是他们一厢情愿罢了。 此话一出,不知激起了多少(码农)程序员的愤怒,却又无可奈何,于是码农问程序员。 码农:你知道get和post请求到底有什么区别? 程序员:你看这篇就知道了。 码农:你月薪三万了? 程序员:嗯。 码农:你是怎么做到的? 程序员:
《程序人生》系列-这个程序员只用了20行代码就拿了冠军
你知道的越多,你不知道的越多 点赞再看,养成习惯GitHub上已经开源https://github.com/JavaFamily,有一线大厂面试点脑图,欢迎Star和完善 前言 这一期不算《吊打面试官》系列的,所有没前言我直接开始。 絮叨 本来应该是没有这期的,看过我上期的小伙伴应该是知道的嘛,双十一比较忙嘛,要值班又要去帮忙拍摄年会的视频素材,还得搞个程序员一天的Vlog,还要写BU
加快推动区块链技术和产业创新发展,2019可信区块链峰会在京召开
      11月8日,由中国信息通信研究院、中国通信标准化协会、中国互联网协会、可信区块链推进计划联合主办,科技行者协办的2019可信区块链峰会将在北京悠唐皇冠假日酒店开幕。   区块链技术被认为是继蒸汽机、电力、互联网之后,下一代颠覆性的核心技术。如果说蒸汽机释放了人类的生产力,电力解决了人类基本的生活需求,互联网彻底改变了信息传递的方式,区块链作为构造信任的技术有重要的价值。   1
程序员把地府后台管理系统做出来了,还有3.0版本!12月7号最新消息:已在开发中有github地址
第一幕:缘起 听说阎王爷要做个生死簿后台管理系统,我们派去了一个程序员…… 996程序员做的梦: 第一场:团队招募 为了应对地府管理危机,阎王打算找“人”开发一套地府后台管理系统,于是就在地府总经办群中发了项目需求。 话说还是中国电信的信号好,地府都是满格,哈哈!!! 经常会有外行朋友问:看某网站做的不错,功能也简单,你帮忙做一下? 而这次,面对这样的需求,这个程序员
网易云6亿用户音乐推荐算法
网易云音乐是音乐爱好者的集聚地,云音乐推荐系统致力于通过 AI 算法的落地,实现用户千人千面的个性化推荐,为用户带来不一样的听歌体验。 本次分享重点介绍 AI 算法在音乐推荐中的应用实践,以及在算法落地过程中遇到的挑战和解决方案。 将从如下两个部分展开: AI 算法在音乐推荐中的应用 音乐场景下的 AI 思考 从 2013 年 4 月正式上线至今,网易云音乐平台持续提供着:乐屏社区、UGC
【技巧总结】位运算装逼指南
位算法的效率有多快我就不说,不信你可以去用 10 亿个数据模拟一下,今天给大家讲一讲位运算的一些经典例子。不过,最重要的不是看懂了这些例子就好,而是要在以后多去运用位运算这些技巧,当然,采用位运算,也是可以装逼的,不信,你往下看。我会从最简单的讲起,一道比一道难度递增,不过居然是讲技巧,那么也不会太难,相信你分分钟看懂。 判断奇偶数 判断一个数是基于还是偶数,相信很多人都做过,一般的做法的代码如下
日均350000亿接入量,腾讯TubeMQ性能超过Kafka
整理 | 夕颜出品 | AI科技大本营(ID:rgznai100) 【导读】近日,腾讯开源动作不断,相继开源了分布式消息中间件TubeMQ,基于最主流的 OpenJDK8开发的
8年经验面试官详解 Java 面试秘诀
    作者 | 胡书敏 责编 | 刘静 出品 | CSDN(ID:CSDNnews) 本人目前在一家知名外企担任架构师,而且最近八年来,在多家外企和互联网公司担任Java技术面试官,前后累计面试了有两三百位候选人。在本文里,就将结合本人的面试经验,针对Java初学者、Java初级开发和Java开发,给出若干准备简历和准备面试的建议。   Java程序员准备和投递简历的实
面试官如何考察你的思维方式?
1.两种思维方式在求职面试中,经常会考察这种问题:北京有多少量特斯拉汽车? 某胡同口的煎饼摊一年能卖出多少个煎饼? 深圳有多少个产品经理? 一辆公交车里能装下多少个乒乓球? 一
相关热词 c#处理浮点数 c# 生成字母数字随机数 c# 动态曲线 控件 c# oracle 开发 c#选择字体大小的控件 c# usb 批量传输 c#10进制转8进制 c#转base64 c# 科学计算 c#下拉列表获取串口
立即提问

相似问题

1
virtualenv 环境切换无效
0
在anaconda中使用pip install tushare 安装tushare后,在pycharm中不能正常使用
7
关于Python3.7中安装pip install Scrapy出现的问题
2
python安装pyinstaller报错
1
python的pip工具安装第三方库,在不指定安装版本的情况自动安装兼容已有包的版本?
2
python 使用pip安装包时添加了镜像源还是出现了如图问题怎么办
1
pip3 install ERROR: Exception: Traceback (most recent call last)
3
python:我的pip无法安装库是什么情况?
4
pip升级怎么提示这个 怎么 解决 老版本也删除了 我的是python 3.7
1
为何Python不像JVM那样推出个“虚拟机版”(托管环境版)?
1
Python docx用cmd安装成功,但是用Jupyter notebook或者vs code都无法找到模块
1
如何创建一个带有指定版本Python和JupyterLab的环境?
1
python3.6安装pypsa包时报错,无法安装。
1
u盘里的python用不了pip?
2
问,u盘里的python用不了pip?
1
ubuntu下运行sudo apt install python-pip和pip --version时分别出现以下错误,求大神解答。
2
windows10系统下,Anaconda 3 (Python3.7),使用pip install方法安装第三方库 jieba以及nltk,出现WARNING: pip is configured with locations that require TLS/SSL, however ?
1
求大神帮忙:python pymssql模块安装成功,import pymssql 出错
1
python 用cmd下载 pyqt5-tools出现错误,安装其他模块也一样
0
用linux安装软件出现的问题 ERROR: Exception: Traceback (most recent call last)