关于error: expected ';', ',' or ')' before numeric constant如何解决?

图片说明
此码为数据结构中初始化顺序性线性表

2个回答

1. 先检查你的环境,是否搭建完整,从当前楼主给出的几行代码来看,是没有问题的。检查下环境。或是贴出完整代码,便于排查

typedef那里,不需要分号。否则Status InitList_Sq(SqList *l)
就相当于
int; InitList_Sq(SqList *l)
当然报错

Csdn user default icon
上传中...
上传图片
插入图片
抄袭、复制答案,以达到刷声望分或其他目的的行为,在CSDN问答是严格禁止的,一经发现立刻封号。是时候展现真正的技术了!
其他相关推荐
关于vue打包提示Error: Expected a pseudo-class or pseudo-element
![图片说明](https://img-ask.csdn.net/upload/201911/06/1573020553_450911.png) vue打包出错,提示Error: Expected a pseudo-class or pseudo-element错误打包不成功,请问该如何解决?
linux下编译C代码头文件问题
linux下编译C程序出现如下错误: /opt/mingw32/i686-w64-mingw32/include/ctype.h:153: error: expected initializer before 'iswspace' /opt/mingw32/i686-w64-mingw32/include/ctype.h:154: error: expected initializer before '_iswspace_l' /opt/mingw32/i686-w64-mingw32/include/ctype.h:155: error: expected initializer before 'iswpunct' /opt/mingw32/i686-w64-mingw32/include/ctype.h:156: error: expected initializer before '_iswpunct_l' /opt/mingw32/i686-w64-mingw32/include/ctype.h:157: error: expected initializer before 'iswalnum'/opt/mingw32/i686-w64-mingw32/include/ctype.h:158: error: expected initializer before '_iswalnum_l' /opt/mingw32/i686-w64-mingw32/include/ctype.h:159: error: expected initializer before 'iswprint' /opt/mingw32/i686-w64-mingw32/include/ctype.h:160: error: expected initializer before '_iswprint_l' /opt/mingw32/i686-w64-mingw32/include/ctype.h:161: error: expected initializer before 'iswgraph' /opt/mingw32/i686-w64-mingw32/include/ctype.h:162: error: expected initializer before '_iswgraph_l' /opt/mingw32/i686-w64-mingw32/include/ctype.h:163: error: expected initializer before 'iswcntrl' 这种情况是什么问题?
pycuda写核函数报错error: expected a ")"
核函数为利用模板更新像素点 通过pycuda写cuda核函数时报错:kernel.cu(3): error: expected a ")" kernel.cu(9): error: identifier "template_size" is undefined kernel.cu(13): warning: expression has no effect kernel.cu(13): warning: expression has no effect kernel.cu(13): error: expected an expression kernel.cu(18): error: expected a ")" kernel.cu(23): error: identifier "border" is undefined kernel.cu(24): error: identifier "rows" is undefined kernel.cu(26): error: identifier "cols" is undefined kernel.cu(33): error: expected an expression 8 errors detected in the compilation of "/tmp/tmpxft_00005035_00000000-7_kernel.cpp1.ii". ] ``` import os,math,cv2,numpy from PIL import Image import numpy as np import skimage import pycuda.autoinit import pycuda.driver as drv from pycuda.compiler import SourceModule from timeit import default_timer as timer mod = SourceModule(""" __global__ void Gauss_cuda(int ***img,int ***im,float **template,int template_size) { int x = blockIdx.x * blockDim.x + threadIdx.x; int y = blockIdx.y * blockDim.y + threadIdx.y; int z = threadIdx.z; int count = 0; for(int i=x;i<x+template_size;i++) { for(int j=y;j<y+template_size;j++) { count += im[i,j,z]*template[i,j,z]; } } img[x][y][z] = count; } __global__ void bilateral_cuda(float ***img,float ***orig,float **template,float border,float sigma1,float sigma2,int rows,int cols) { int x = blockIdx.x * blockDim.x + threadIdx.x; int y = blockIdx.y * blockDim.y + threadIdx.y; int z = threadIdx.z; int xmin = max(x-border,0); int xmax = min(x+border+1,rows); int ymin = max(y-border,0); int ymax = min(y+border+1,cols); int w = 0; int v = 0; for(int i=xmin;i<xmax;i++) { for(int j=ymin;j<ymax;j++) { w += w+template[xmin-x+border+i,ymin-y+border+i]*exp((orig[i,j,z]-orig[x,y,z])*(orig[i,j,z]-orig[x,y,z])/(2*sigma2*sigma2)); v += orig[x][y][z]*w; } } img[x][y][z] = v/w; } """) Gauss_cuda = mod.get_function("Gauss_cuda") bilateral_cuda = mod.get_function("bilateral_cuda") def generateGaussianTemplate(template_size,sigma): template = np.zeros((template_size,template_size)) mid = template_size/2 sum = 0 pi = 3.1415926 for i in range(template_size): x = pow(i-mid,2) for j in range(template_size): y = pow(j-mid,2) g = math.exp((x+y)/(-2*sigma*sigma))/(2*pi*sigma) template[i][j] = g sum+=g #归一化 template = template/sum return template def Gauss_filter(img,template_size,sigma): [rows,cols,channel] = img.shape border = int(template_size/2) template = generateGaussianTemplate(template_size,sigma) im = cv2.copyMakeBorder(img,border,border,border,border,cv2.BORDER_REPLICATE) Gauss_cuda( drv.InOut(img), drv.In(im), drv.In(template),template_size, block=(template_size,template_size,3),grid=(rows,cols)) return img def Bilateral_filter(img,template_size,sigma1,sigma2): img = img/255 border = int(template_size/2) [rows,cols,channel] = img.shape tmp = np.arange(-border,border+1) [x,y] = np.meshgrid(tmp,tmp) X = np.power(x,2) Y = np.power(y,2) d = np.exp(-(X+Y)/(2*sigma1*sigma1)) orig_img = img Gauss_cuda( drv.InOut(img), drv.In(orig_img), drv.In(d),border,sigma1,sigma2,rows,cols, block=(template_size,template_size,3),grid=(rows,cols)) return img*255 if __name__=='__main__': img = cv2.imread('demo2.jpg') #noise = skimage.util.random_noise(img,'gaussian')*255 #cv2.imwrite('noise.jpg',noise) template_size = 3 sigma_g = 0.8 sigma = [3,0.1] bilateral = Bilateral_filter(img,template_size,sigma[0],sigma[1]) Gauss = Gauss_filter(img,template_size,sigma_g) cv2.imwrite('bilateral_result_{}_{}_{}.jpg'.format(template_size,sigma[0],sigma[1]),bilateral) cv2.imwrite('Gauss_result_{}_{}.jpg'.format(template_size,sigma_g),Gauss) ```
unix网络编程卷2门代码编译中报错:error: ‘door_arg_t’ undeclared (first use in this function),环境是centos6
gcc client1.c -lunpipc -lrt -ldoor client1.c: In function ‘main’: client1.c:8: error: ‘door_arg_t’ undeclared (first use in this function) client1.c:8: error: (Each undeclared identifier is reported only once client1.c:8: error: for each function it appears in.) client1.c:8: error: expected ‘;’ before ‘arg’ client1.c:17: error: ‘arg’ undeclared (first use in this function)
77: error: expected unqualified-id before '^' token
#define TO_SIGNED(x) ((signed)(x)) class BigInteger{ protected: unsigned* array; BigInteger(unsigned*const theArray){ array = theArray; } inline unsigned* getArray(){ if(this == BigIntegerNull) #ifdef _EXCEPTION_H_ throw NullPointerException(); #else return NullArray; #endif return array; } BigInteger expand(unsigned newSize, bool extendSign){ if(getArray() == NullArray){ BigInteger n(NullArray); return n; } if(newSize <= array[0]) return *(new BigInteger(*this)); BigInteger nbi(new unsigned[newSize+1]); register unsigned i; for(i = 0; i <= array[0]; i++) nbi.array[i] = array[i]; if(extendSign && TO_SIGNED(array[array[0]]) < 0){ for(; i <= newSize; i++) nbi.array[i] = -1; }else{ for(; i <= newSize; i++) nbi.array[i] = 0; } return nbi; } public: static BigInteger*const BigIntegerNull; static unsigned*const NullArray; BigInteger(const BigInteger& origin){ #ifdef _EXCEPTION_H_ if(origin.getArray() == NullArray) throw NullPointerException(); #endif register unsigned size = origin.array[0]+1; array = new unsigned[size]; do{ --size; array[size] = origin.array[size]; }while(size > 0); } BigInteger _xor(BigInteger bi, bool extendSign){ if(getArray() == NullArray || bi.getArray() == NullArray){ BigInteger n(NullArray); return n; } register unsigned i; if(array[0] <= bi.array[0]){ for(i = array[0]; i > 0; i--) array[i] &= bi.array[i]; }else{ for(i = 1; i <= bi.array[0]; i++){ array[i] ^= bi.array[i]; } if(extendSign && TO_SIGNED(bi.array[bi.array[0]]) < 0){ for(; i <= array[0]; i++){ array[i] = -1; // or -1 } } } return *this; } BigInteger xor(BigInteger bi, bool extendSign){ // 编译器指示错误的行 BigInteger n(NullArray); if(getArray() == NullArray || bi.getArray() == NullArray){ return n; } register unsigned i; if(array[0] <= bi.array[0]){ n = this->expand(bi.array[0], extendSign); for(i = array[0]; i > 0; i--){ n.array[i] ^= bi.array[i]; } if(extendSign && TO_SIGNED(bi.array[bi.array[0]]) < 0){ for(; i <= bi.array[0]; i++){ n.array[i] = ~bi.array[i]; // xor -1 } }else{ for(; i <= bi.array[0]; i++){ n.array[i] = bi.array[i]; // xor 0 } } }else{ n = *(new BigInteger(*this)); for(i = 1; i <= bi.array[0]; i++){ n.array[i] ^= bi.array[i]; } if(extendSign && TO_SIGNED(bi.array[bi.array[0]]) < 0){ for(; i <= array[0]; i++){ n.array[i] = ~array[i]; // xor -1 } } } return n; } }; BigInteger*const BigInteger::BigIntegerNull = reinterpret_cast<BigInteger*>(0); unsigned*const BigInteger::NullArray = reinterpret_cast<unsigned*>(0);
请问:error: expected primary-expression before '[' token 该怎么解决?
程序及错误如图:![图片说明](https://img-ask.csdn.net/upload/201904/26/1556271507_407252.png)
in function 'xx'; error : expected';' before '}'
数据结构实验一 线性表的实现与多项式的加法 在codeblock下编译出错 in function 'Add': error : expected';' before '}' 代码如下: #include<stdlib.h> #include<stdio.h> #define ERROR 0 #define OK 1 #define Overflow 2 #define Underflow 3 #define Notpresent 4 #define Duplicate 5 typedef int Elemtype; typedef struct { int n; int maxLength; Elemtype *element; }SeqList; typedef int Status; typedef struct PNode { int coef; int exp; struct PNode* link; }PNode; typedef struct { struct PNode *head; }polynominal; Status Init(SeqList *L,int mSize) { L->maxLength=mSize; L->n=0; L->element=malloc(sizeof(Elemtype)*mSize); if(!L->element) return ERROR; return OK; } Status Find(SeqList L,int i,Elemtype *x) { if(i<0||i>L.n-1) return ERROR; *x=L.element[i]; return OK; } Status Insert(SeqList *L,int i,Elemtype x) { int j; if(i<-1||i>L->n-1) return ERROR; if(L->n==L->maxLength) return ERROR; for(j=L->n-1;j>i;j--) L->element[j+1]=L->element[j]; L->element[i+1]=x; L->n=L->n+1; return OK; } Status Delete(SeqList *L,int i) { int j; if(i<0||i>L->n-1) return ERROR; if(!L->n) return ERROR; for(j=i+1;j<L->n;j++) L->element[j-1]=L->element[j]; L->n --; return OK; } void Output(SeqList L) { int i; //if(!L.n) //return ERROR; for(i=0;i<L.n;i++) printf("%d ",L.element[i]); //return OK; } void Destroy(SeqList *L) { (*L).n=0; (*L).maxLength=0; free((*L).element); } void Create(polynominal *p) { PNode *pn,*pre,*q; p->head=malloc(sizeof(PNode)); p->head->exp=-1; p->head->link=NULL; for(;;) { pn=malloc(sizeof(PNode)); printf("coef:\n"); scanf("%d",&pn->coef); printf("exp:\n"); scanf("%d",&pn->exp); if(pn->exp<0) break; pre=p->head; q=p->head->link; while(q&&q->exp>pn->exp) { pre=q; q=q->link; } pn->link=q; pre->link=pn; } } void Add(polynominal *px,polynominal *qx) { PNode *q,*q1=qx->head,*p,*temp; p=px->head->link; q=q1->link; while(p&&q) { while(p->exp<q->exp) { q1=q; q=q->link; } if(p->exp==q->exp) { q->coef=q->coef+p->coef; if(q->coef==0) { q1->link=q->link; free(q); q=q1->link; p=p->link; } else { q1=q; q=q->link; p=p->link; } } else { temp=malloc(sizeof(PNode)); temp->coef=p->coef; temp->exp=p->exp; temp->link=q1->link; q1->link=temp; p=p->link; } } 1 } void main() { int i,j,k,m,num,x,y; SeqList list; printf("请输入元素的最大空间:"); scanf("%d",&m); Init(&list,m); printf("请输入元素的个数:"); scanf("%d",&num); list.n=num; printf("请输入各个元素:"); printf("\n"); for(i=0;i<num;i++) scanf("%d",&list.element[i]); Output(list); printf("请输入要插入元素的位置:"); scanf("%d",&i); printf("请输入要插入的元素:"); scanf("%d",&k); Insert(&list,i,k); Output(list); printf("请输入要查找的位置:"); scanf("%d",&j); Find(list,j,&x); printf("%d",x); printf("请输入要删除的元素下标:"); scanf("%d",&y); Delete(&list,y); Output(list); Destroy(&list); polynominal px; Create(&px); polynominal qx; Create (&qx); Add(&px,&qx); }
|error: expected type-specifier before '(' token|
初学者的问题,在看视频的时候老师是可以运行的,但我用vs和codeblock都不能运行,代码我是照着打下来的,应该没错,那么这个是编译器问题还是我真的打错了....#include<iostream> using namespace std; #include"string" #include<vector> #include<list> #include"set" #include<algorithm> #include"functional" //函数对象 template<typename T> class show { public: void operator(T &t) { cout << t << " "; } private: }; void main() { cout << "hello wordl" << endl; system("pause"); return 0; }
错误:expected initializer before '.' token
在头文件中定义一个 全局变量static QMap<int,QString>pool 在源文件函数中初始化pool QMap<int,QString> address_pool::pool.insert(i,IP); 然后就报错,大神们求解决,困恼了2天了
如何解决TypeError: expected string or buffer?
求助代码 import urllib2 import re import os headers = {"User-Agent": "Mozilla/5.0 (Windows NT 10.0; Win64; x64; rv:67.0) Gecko/20100101 Firefox/67.0", } urlcontent = urllib2.urlopen('http://news.qq.com/a/20120506/index.htm') #print urlcontent rege = re.compile(r"/a/\d{8}/\d{6}.htm") get_url = re.findall(rege,urlcontent) print get_url exit() 会报错 C:\Users\Min\PycharmProjects\untitled\venv\Scripts\python.exe C:/Users/Min/PycharmProjects/untitled/tcpy2.py Traceback (most recent call last): File "C:/Users/Min/PycharmProjects/untitled/tcpy2.py", line 8, in <module> get_url = re.findall(rege,urlcontent) File "C:\Users\Min\PycharmProjects\untitled\venv\lib\re.py", line 181, in findall return _compile(pattern, flags).findall(string) TypeError: expected string or buffer Process finished with exit code 1
python问题:TypeError: expected string or buffer
``` import requests import re #这是用requests进行的数据爬取 url = 'https://car.autohome.com.cn/photo/series/26709/1/3793691.html' html = requests.get(url) # print (html.text) img_url = re.findall(r'<img id="img" src="(.*?)"',html)[0] img_url = 'http:' + img_url print(img_url) img_response = requests.get(img_url) img_data = img_response.content f = open('2.jpg','wb') f.write(img_data) f.close() 报错: Traceback (most recent call last): File "D:/Java/Python/src/hao/__init__.py", line 9, in <module> img_url = re.findall(r'<img id="img" src="(.*?)"',html)[0] File "C:\Python27\lib\re.py", line 181, in findall return _compile(pattern, flags).findall(string) TypeError: expected string or buffer ```
Error[Pe065]: expected a ";"
我将gcc工程,移植到IAR Embedded Workbench中遇到一系列的错误提示,其中一个是Error[Pe065]: expected a ";" 提示错误的位置为如下语句,请问我应该怎么修改? typedef int ERROR_CantUseEvilMethod[sizeof(GenericClass *)==sizeof(function_to_bind) ? 1 : -1] __attribute((unused));
error RC2108: expected numerical dialog constant
error RC2111: invalid control type error RC2113: END expected in dialog 三个错误都指向Static EDITTEXT IDC_EDIT1, 54, 9, 28, 31, ES_AUTOHSCROLL 在vs2013上添加了个对话框,然后出现这个问题
vs2010错误机器人足球
最近在学习机器人足球 用的是vs2010运行代码 老是出现错误 3> ------ Building libbhuman (Release) ------ 3> bhuman.cpp 1> Enum.cpp 1> Global.cpp 1> Geometry.cpp 1> Pose2D.cpp 1> OutStreams.cpp 3> ..\..\Src\libbhuman\bhuman.cpp(14) :28: warning: alcore\altypes.h: No such file or directory 3> ..\..\Src\libbhuman\bhuman.cpp(15) :28: warning: alcore\alerror.h: No such file or directory 3> ..\..\Src\libbhuman\bhuman.cpp(16) :31: warning: alcommon\albroker.h: No such file or directory 3> ..\..\Src\libbhuman\bhuman.cpp(17) :30: warning: alcommon\alproxy.h: No such file or directory 3> ..\..\Src\libbhuman\bhuman.cpp(18) :32: warning: alproxies\dcmproxy.h: No such file or directory 3> ..\..\Src\libbhuman\bhuman.cpp(19) :37: warning: alproxies\almemoryproxy.h: No such file or directory 3>..\..\Src\libbhuman\bhuman.cpp(29): error : 'AL' has not been declared 3>..\..\Src\libbhuman\bhuman.cpp(29): error : expected constructor, destructor, or type conversion before '*' token 3>..\..\Src\libbhuman\bhuman.cpp(30): error : 'AL' has not been declared 3>..\..\Src\libbhuman\bhuman.cpp(30): error : expected constructor, destructor, or type conversion before '*' token 3>..\..\Src\libbhuman\bhuman.cpp(31): error : 'AL' has not been declared 3>..\..\Src\libbhuman\bhuman.cpp(31): error : expected constructor, destructor, or type conversion before '*' token 3>..\..\Src\libbhuman\bhuman.cpp(32): error : 'AL' has not been declared 3>..\..\Src\libbhuman\bhuman.cpp(32): error : expected constructor, destructor, or type conversion before '*' token 3>..\..\Src\libbhuman\bhuman.cpp(33): error : 'AL' has not been declared 3>..\..\Src\libbhuman\bhuman.cpp(33): error : expected constructor, destructor, or type conversion before '*' token 3>..\..\Src\libbhuman\bhuman.cpp(34): error : 'AL' has not been declared 3>..\..\Src\libbhuman\bhuman.cpp(34): error : expected constructor, destructor, or type conversion before '*' token 3> ..\..\Src\libbhuman\bhuman.cpp: In function 'void sitDown(float, float*)': 3>..\..\Src\libbhuman\bhuman.cpp(424): error : 'positionRequest' was not declared in this scope 3>..\..\Src\libbhuman\bhuman.cpp(425): error : 'hardnessRequest' was not declared in this scope 3> ..\..\Src\libbhuman\bhuman.cpp: In function 'void standUp(float, float*, float*)': 3>..\..\Src\libbhuman\bhuman.cpp(455): error : 'positionRequest' was not declared in this scope 3> ..\..\Src\libbhuman\bhuman.cpp: In function 'void onPreProcess()': 3>..\..\Src\libbhuman\bhuman.cpp(475): error : 'proxy' was not declared in this scope 3>..\..\Src\libbhuman\bhuman.cpp(475): error : 'positionRequest' was not declared in this scope 3>..\..\Src\libbhuman\bhuman.cpp(475): error : 'hardnessRequest' was not declared in this scope 3>..\..\Src\libbhuman\bhuman.cpp(486): error : 'stderr' was not declared in this scope 3>..\..\Src\libbhuman\bhuman.cpp(486): error : 'fprintf' was not declared in this scope 3>..\..\Src\libbhuman\bhuman.cpp(563): error : 'usRequest' was not declared in this scope 3>..\..\Src\libbhuman\bhuman.cpp(575): error : 'ledRequest' was not declared in this scope 3>..\..\Src\libbhuman\bhuman.cpp(575): error : 'string' is not a member of 'std' 3>..\..\Src\libbhuman\bhuman.cpp(582): error : expected type-specifier before 'AL' 3>..\..\Src\libbhuman\bhuman.cpp(582): error : expected `)' before '::' token 3>..\..\Src\libbhuman\bhuman.cpp(582): error : expected `{' before '::' token 3>..\..\Src\libbhuman\bhuman.cpp(582): error : '::ALError' has not been declared 3>..\..\Src\libbhuman\bhuman.cpp(582): error : 'e' was not declared in this scope 3>..\..\Src\libbhuman\bhuman.cpp(582): error : expected `;' before ')' token 3> ..\..\Src\libbhuman\bhuman.cpp: In function 'void onPostProcess()': 3>..\..\Src\libbhuman\bhuman.cpp(591): error : 'memory' was not declared in this scope 3>..\..\Src\libbhuman\bhuman.cpp(591): error : 'proxy' was not declared in this scope 3>..\..\Src\libbhuman\bhuman.cpp(601): error : 'assert' was not declared in this scope 3>..\..\Src\libbhuman\bhuman.cpp(616): error : 'system' was not declared in this scope 3>..\..\Src\libbhuman\bhuman.cpp(618): error : 'system' was not declared in this scope 3>..\..\Src\libbhuman\bhuman.cpp(622): error : expected type-specifier before 'AL' 3>..\..\Src\libbhuman\bhuman.cpp(622): error : expected `)' before '::' token 3>..\..\Src\libbhuman\bhuman.cpp(622): error : expected `{' before '::' token 3>..\..\Src\libbhuman\bhuman.cpp(622): error : '::ALError' has not been declared 3>..\..\Src\libbhuman\bhuman.cpp(622): error : 'e' was not declared in this scope 3>..\..\Src\libbhuman\bhuman.cpp(622): error : expected `;' before ')' token 3>..\..\Src\libbhuman\bhuman.cpp(641): error : 'stderr' was not declared in this scope 3>..\..\Src\libbhuman\bhuman.cpp(641): error : 'fprintf' was not declared in this scope 3> ..\..\Src\libbhuman\bhuman.cpp: In function 'void close()': 3>..\..\Src\libbhuman\bhuman.cpp(650): error : 'stderr' was not declared in this scope 3>..\..\Src\libbhuman\bhuman.cpp(650): error : 'fprintf' was not declared in this scope 3>..\..\Src\libbhuman\bhuman.cpp(648): error : too many arguments to function 'void close()' 3>..\..\Src\libbhuman\bhuman.cpp(662): error : at this point in file 3>..\..\Src\libbhuman\bhuman.cpp(674): error : 'proxy' was not declared in this scope 3>..\..\Src\libbhuman\bhuman.cpp(676): error : type '<type error>' argument given to 'delete', expected pointer 3>..\..\Src\libbhuman\bhuman.cpp(679): error : 'positionRequest' was not declared in this scope 3>..\..\Src\libbhuman\bhuman.cpp(681): error : type '<type error>' argument given to 'delete', expected pointer 3>..\..\Src\libbhuman\bhuman.cpp(684): error : 'hardnessRequest' was not declared in this scope 3>..\..\Src\libbhuman\bhuman.cpp(686): error : type '<type error>' argument given to 'delete', expected pointer 3>..\..\Src\libbhuman\bhuman.cpp(689): error : 'usRequest' was not declared in this scope 3>..\..\Src\libbhuman\bhuman.cpp(691): error : type '<type error>' argument given to 'delete', expected pointer 3>..\..\Src\libbhuman\bhuman.cpp(694): error : 'ledRequest' was not declared in this scope 3>..\..\Src\libbhuman\bhuman.cpp(696): error : type '<type error>' argument given to 'delete', expected pointer 3>..\..\Src\libbhuman\bhuman.cpp(699): error : 'memory' was not declared in this scope 3>..\..\Src\libbhuman\bhuman.cpp(701): error : type '<type error>' argument given to 'delete', expected pointer 3> ..\..\Src\libbhuman\bhuman.cpp: At global scope: 3>..\..\Src\libbhuman\bhuman.cpp(708): error : 'AL' has not been declared 3>..\..\Src\libbhuman\bhuman.cpp(708): error : 'AL' has not been declared 3>..\..\Src\libbhuman\bhuman.cpp(708): error : 'pBroker' was not declared in this scope 3>..\..\Src\libbhuman\bhuman.cpp(709): error : expected ',' or ';' before '{' token 3> make: *** [../../Build/libbhuman/Linux/Release/bhuman.o] Error 1 3>C:\Program Files\MSBuild\Microsoft.Cpp\v4.0\Microsoft.MakeFile.Targets(43,5): error MSB3073: 命令“bash -c "../../Util/zbuildgen/Win32/bin/zbuildgen.exe ../Linux/libbhuman.make.zbuild && make -f ../Linux/libbhuman.make clean CONFIG=Release SHELLOPTS=igncr && make -j 2 -f ../Linux/libbhuman.make CONFIG=Release SHELLOPTS=igncr"”已退出,代码为 2。 3> 3>生成失败。
linux安装opencv是make出错
[ 7%] Built target libwebp [ 7%] Built target opencv_test_core_pch_dephelp [ 7%] Built target opencv_core_pch_dephelp [ 7%] Built target opencv_ts_pch_dephelp [ 7%] Built target pch_Generate_opencv_ts [ 7%] Built target pch_Generate_opencv_core [ 7%] Building CXX object modules/core/CMakeFiles/opencv_core.dir/src/hal_internal.cpp.o /home/w/opencv-3.2.0/modules/core/src/hal_internal.cpp: In function ‘int lapack_gemm_c(const fptype*, size_t, const fptype*, size_t, fptype, const fptype*, size_t, fptype, fptype*, size_t, int, int, int, int)’: /home/w/opencv-3.2.0/modules/core/src/hal_internal.cpp:437: error: expected unqualified-id before ‘__complex__’ /home/w/opencv-3.2.0/modules/core/src/hal_internal.cpp:437: error: expected ‘)’ before ‘__complex__’ /home/w/opencv-3.2.0/modules/core/src/hal_internal.cpp:438: error: expected unqualified-id before ‘__complex__’ /home/w/opencv-3.2.0/modules/core/src/hal_internal.cpp:438: error: expected ‘)’ before ‘__complex__’ /home/w/opencv-3.2.0/modules/core/src/hal_internal.cpp:439: error: expected unqualified-id before ‘__complex__’ /home/w/opencv-3.2.0/modules/core/src/hal_internal.cpp:439: error: expected ‘)’ before ‘__complex__’ /home/w/opencv-3.2.0/modules/core/src/hal_internal.cpp:440: error: expected unqualified-id before ‘__complex__’ /home/w/opencv-3.2.0/modules/core/src/hal_internal.cpp:440: error: expected ‘)’ before ‘__complex__’ /home/w/opencv-3.2.0/modules/core/src/hal_internal.cpp:443: error: expected unqualified-id before ‘__complex__’ /home/w/opencv-3.2.0/modules/core/src/hal_internal.cpp:443: error: expected ‘;’ before ‘__complex__’ /home/w/opencv-3.2.0/modules/core/src/hal_internal.cpp:444: error: expected unqualified-id before ‘__complex__’ /home/w/opencv-3.2.0/modules/core/src/hal_internal.cpp:444: error: expected ‘;’ before ‘__complex__’ /home/w/opencv-3.2.0/modules/core/src/hal_internal.cpp:494: error: expected unqualified-id before ‘__complex__’ /home/w/opencv-3.2.0/modules/core/src/hal_internal.cpp:494: error: expected ‘)’ before ‘__complex__’ /home/w/opencv-3.2.0/modules/core/src/hal_internal.cpp:496: error: expected unqualified-id before ‘__complex__’ /home/w/opencv-3.2.0/modules/core/src/hal_internal.cpp:496: error: expected ‘)’ before ‘__complex__’ /home/w/opencv-3.2.0/modules/core/src/hal_internal.cpp:501: error: expected unqualified-id before ‘__complex__’ /home/w/opencv-3.2.0/modules/core/src/hal_internal.cpp:501: error: expected ‘)’ before ‘__complex__’ /home/w/opencv-3.2.0/modules/core/src/hal_internal.cpp:504: error: ‘cAlpha’ was not declared in this scope /home/w/opencv-3.2.0/modules/core/src/hal_internal.cpp:504: error: ‘cBeta’ was not declared in this scope /home/w/opencv-3.2.0/modules/core/src/hal_internal.cpp:506: error: ‘cAlpha’ was not declared in this scope /home/w/opencv-3.2.0/modules/core/src/hal_internal.cpp:506: error: ‘cBeta’ was not declared in this scope /home/w/opencv-3.2.0/modules/core/src/hal_internal.cpp: In function ‘int lapack_gemm_c(const fptype*, size_t, const fptype*, size_t, fptype, const fptype*, size_t, fptype, fptype*, size_t, int, int, int, int) [with fptype = float]’: /home/w/opencv-3.2.0/modules/core/src/hal_internal.cpp:591: instantiated from here /home/w/opencv-3.2.0/modules/core/src/hal_internal.cpp:439: warning: unused variable ‘ldsrc3’ [-Wunused-variable] /home/w/opencv-3.2.0/modules/core/src/hal_internal.cpp: At global scope: /home/w/opencv-3.2.0/modules/core/src/hal_internal.cpp:434: warning: unused parameter ‘alpha’ [-Wunused-parameter] /home/w/opencv-3.2.0/modules/core/src/hal_internal.cpp: In function ‘int lapack_gemm_c(const fptype*, size_t, const fptype*, size_t, fptype, const fptype*, size_t, fptype, fptype*, size_t, int, int, int, int) [with fptype = double]’: /home/w/opencv-3.2.0/modules/core/src/hal_internal.cpp:598: instantiated from here /home/w/opencv-3.2.0/modules/core/src/hal_internal.cpp:439: warning: unused variable ‘ldsrc3’ [-Wunused-variable] /home/w/opencv-3.2.0/modules/core/src/hal_internal.cpp: At global scope: /home/w/opencv-3.2.0/modules/core/src/hal_internal.cpp:434: warning: unused parameter ‘alpha’ [-Wunused-parameter] modules/core/CMakeFiles/opencv_core.dir/build.make:930: recipe for target 'modules/core/CMakeFiles/opencv_core.dir/src/hal_internal.cpp.o' failed make[2]: *** [modules/core/CMakeFiles/opencv_core.dir/src/hal_internal.cpp.o] Error 1 CMakeFiles/Makefile2:1289: recipe for target 'modules/core/CMakeFiles/opencv_core.dir/all' failed make[1]: *** [modules/core/CMakeFiles/opencv_core.dir/all] Error 2 Makefile:160: recipe for target 'all' failed make: *** [all] Error 2
ubuntu16 64位安装maxent 编译出现问题
sudo apt-get install jam libboost-all-dev zlib1g-dev gfortran 没问题 ./configure 没问题 make 没问题 make unittest 没问题 cd test python runall.py 没问题 sudo make install 没问题 sudo apt-get install python-dev 没问题 cd python 进行编译: python setup.py build 崩溃 ![图片说明](https://img-ask.csdn.net/upload/201905/09/1557402251_273040.png) /usr/include/c++/5/exception:35:37: error: expected ‘}’ before end of line /usr/include/c++/5/exception:35:37: error: expected declaration before end of line 各位有遇到过吗????
error : missing ')' before ';'
#include<iostream> #include<malloc.h> using namespace std; #define listinitsize 10; #define listincrement 10; #define error 0; #define ok 1; #define overflow -1; typedef int status; 前面这段代码我可能会有影响所以我就把它粘上了 typedef struct{ int *elem; int length; int listsize; } sqlist;//创建结构体 status initlistsq(sqlist &l)//用c++初始话线性表 { l.elem =(int *)malloc(listinitsize*sizeof(int));//问题行 if(!l.elem)return -1;。。。。。 error: expected primary-expression before "int"(此为c free编译错误报告) 老师说是有什么标识打错,但跟书上对了没错。初学者谢谢了
linux下安装node.js使用make命令的时候报错请大神帮忙看下什么原因。
mutex.h:210: 错误:expected ‘)’ before ‘const’ ../deps/v8/src/base/platform/mutex.h:210: 错误:‘void operator=(const LockGuard&)’必须是一个非静态的成员函数 ../deps/v8/src/base/platform/mutex.h:211: 错误:expected declaration before ‘}’ token make[1]: *** [/usr/src/node-v6.2.0/out/Release/obj.target/v8_base/deps/v8/src/accessors.o] 错误 1 make[1]: Leaving directory `/usr/src/node-v6.2.0/out' ../deps/v8/src/base/platform/mutex.h:69: 错误:expected unqualified-id before ‘private’ ../deps/v8/src/base/platform/mutex.h:89: 错误:‘friend’用在类外 ../deps/v8/src/base/platform/mutex.h:91: 错误:expected unqualified-id before ‘const’ ../deps/v8/src/base/platform/mutex.h:91: 错误:expected ‘)’ before ‘const’ ../deps/v8/src/base/platform/mutex.h:91: 错误:‘void v8::base::operator=(const v8::base::Mutex&)’必须是一个非静态的成员函数 ../deps/v8/src/base/platform/mutex.h:104: 错误:expected initializer before ‘<’ token ../deps/v8/src/base/platform/mutex.h:130: 错误:变量‘v8::RecursiveMutex v8::final’有初始值设定,但是类型不完全 ../deps/v8/src/base/platform/mutex.h:131: 错误:expected primary-expression before ‘public’ ../deps/v8/src/base/platform/mutex.h:131: 错误:expected ‘}’ before ‘public’ ../deps/v8/src/base/platform/mutex.h:131: 错误:expected ‘,’ or ‘;’ before ‘public’ ../deps/v8/src/base/platform/mutex.h:133: 错误:expected constructor, destructor, or type conversion before ‘;’ token ../deps/v8/src/base/platform/mutex.h:155: 错误:‘Mutex’未声明 ../deps/v8/src/base/platform/mutex.h:155: 错误:expected initializer before ‘NativeHandle’ ../deps/v8/src/base/platform/mutex.h:157: 错误:expected constructor, destructor, or type conversion before ‘&’ token ../deps/v8/src/base/platform/mutex.h:160: 错误:expected initializer before ‘&’ token ../deps/v8/src/base/platform/mutex.h:164: 错误:expected unqualified-id before ‘private’ ../deps/v8/src/base/platform/mutex.h:170: 错误:expected unqualified-id before ‘const’ ../deps/v8/src/base/platform/mutex.h:170: 错误:expected ‘)’ before ‘const’ ../deps/v8/src/base/platform/mutex.h:170: 错误:‘void v8::operator=(const v8::RecursiveMutex&)’必须是一个非静态的成员函数 ../deps/v8/src/base/platform/mutex.h:184: 错误:expected initializer before ‘<’ token ../deps/v8/src/base/platform/mutex.h:202: 错误:‘LockGuard final’声明为模板 ../deps/v8/src/base/platform/mutex.h:203: 错误:expected primary-expression before ‘public’ ../deps/v8/src/base/platform/mutex.h:203: 错误:expected ‘}’ before ‘public’ ../deps/v8/src/base/platform/mutex.h:205: 错误:‘~LockGuard’未声明为成员 ../deps/v8/src/base/platform/mutex.h:207: 错误:expected unqualified-id before ‘private’ ../deps/v8/src/base/platform/mutex.h:210: 错误:expected unqualified-id before ‘const’ ../deps/v8/src/base/platform/mutex.h:210: 错误:expected ‘)’ before ‘const’ ../deps/v8/src/base/platform/mutex.h:210: 错误:‘void operator=(const LockGuard&)’必须是一个非静态的成员函数 ../deps/v8/src/base/platform/mutex.h:211: 错误:expected declaration before ‘}’ token make[1]: *** [/usr/src/node-v6.2.0/out/Release/obj.target/v8_base/deps/v8/src/accessors.o] 错误 1 make[1]: Leaving directory `/usr/src/node-v6.2.0/out' make: *** [node] 错误 2
新手求教改语法错误C?
不太清楚语法哪里错了? ``` #include <stdio.h> #include <string.h> int n = 1000000; int mark[1000001]; int N, M; int c, i; scanf("%d,%d", &N,&M); int main() { int c; memset(mark, 0, sizeof(mark)); mark[0] = 1; mark[1] = 1; for (c = 2; c * c <= n; c++) { if (mark[c] != 1) /*是待筛选的数*/ { for (i = M; i <= n / c; M++) { mark[c * i] = 1; } } } if (mark[c] != 1) { printf("%d\n", c); } return 0; } ``` Line 8: error: expected declaration specifiers or '...' before string constant Line 8: error: expected declaration specifiers or '...' before '&' token Line 8: error: expected declaration specifiers or '...' before '&' token Line 8: warning: data definition has no type or storage class Line 8: error: conflicting types for 'scanf'
终于明白阿里百度这样的大公司,为什么面试经常拿ThreadLocal考验求职者了
点击上面↑「爱开发」关注我们每晚10点,捕获技术思考和创业资源洞察什么是ThreadLocalThreadLocal是一个本地线程副本变量工具类,各个线程都拥有一份线程私...
《奇巧淫技》系列-python!!每天早上八点自动发送天气预报邮件到QQ邮箱
将代码部署服务器,每日早上定时获取到天气数据,并发送到邮箱。 也可以说是一个小人工智障。 思路可以运用在不同地方,主要介绍的是思路。
面试官问我:什么是消息队列?什么场景需要他?用了会出现什么问题?
你知道的越多,你不知道的越多 点赞再看,养成习惯 GitHub上已经开源 https://github.com/JavaFamily 有一线大厂面试点脑图、个人联系方式和人才交流群,欢迎Star和完善 前言 消息队列在互联网技术存储方面使用如此广泛,几乎所有的后端技术面试官都要在消息队列的使用和原理方面对小伙伴们进行360°的刁难。 作为一个在互联网公司面一次拿一次Offer的面霸...
8年经验面试官详解 Java 面试秘诀
作者 |胡书敏 责编 | 刘静 出品 | CSDN(ID:CSDNnews) 本人目前在一家知名外企担任架构师,而且最近八年来,在多家外企和互联网公司担任Java技术面试官,前后累计面试了有两三百位候选人。在本文里,就将结合本人的面试经验,针对Java初学者、Java初级开发和Java开发,给出若干准备简历和准备面试的建议。 Java程序员准备和投递简历的实...
究竟你适不适合买Mac?
我清晰的记得,刚买的macbook pro回到家,开机后第一件事情,就是上了淘宝网,花了500元钱,找了一个上门维修电脑的师傅,上门给我装了一个windows系统。。。。。。 表砍我。。。 当时买mac的初衷,只是想要个固态硬盘的笔记本,用来运行一些复杂的扑克软件。而看了当时所有的SSD笔记本后,最终决定,还是买个好(xiong)看(da)的。 已经有好几个朋友问我mba怎么样了,所以今天尽量客观...
MyBatis研习录(01)——MyBatis概述与入门
MyBatis 是一款优秀的持久层框架,它支持定制化 SQL、存储过程以及高级映射。MyBatis原本是apache的一个开源项目iBatis, 2010年该项目由apache software foundation 迁移到了google code并改名为MyBatis 。2013年11月MyBatis又迁移到Github。
程序员一般通过什么途径接私活?
二哥,你好,我想知道一般程序猿都如何接私活,我也想接,能告诉我一些方法吗? 上面是一个读者“烦不烦”问我的一个问题。其实不止是“烦不烦”,还有很多读者问过我类似这样的问题。 我接的私活不算多,挣到的钱也没有多少,加起来不到 20W。说实话,这个数目说出来我是有点心虚的,毕竟太少了,大家轻喷。但我想,恰好配得上“一般程序员”这个称号啊。毕竟苍蝇再小也是肉,我也算是有经验的人了。 唾弃接私活、做外...
Python爬虫爬取淘宝,京东商品信息
小编是一个理科生,不善长说一些废话。简单介绍下原理然后直接上代码。 使用的工具(Python+pycharm2019.3+selenium+xpath+chromedriver)其中要使用pycharm也可以私聊我selenium是一个框架可以通过pip下载 pip installselenium -ihttps://pypi.tuna.tsinghua.edu.cn/simple/ ...
阿里程序员写了一个新手都写不出的低级bug,被骂惨了。
这种新手都不会范的错,居然被一个工作好几年的小伙子写出来,差点被当场开除了。
Java工作4年来应聘要16K最后没要,细节如下。。。
前奏: 今天2B哥和大家分享一位前几天面试的一位应聘者,工作4年26岁,统招本科。 以下就是他的简历和面试情况。 基本情况: 专业技能: 1、&nbsp;熟悉Sping了解SpringMVC、SpringBoot、Mybatis等框架、了解SpringCloud微服务 2、&nbsp;熟悉常用项目管理工具:SVN、GIT、MAVEN、Jenkins 3、&nbsp;熟悉Nginx、tomca...
Python爬虫精简步骤1 获取数据
爬虫,从本质上来说,就是利用程序在网上拿到对我们有价值的数据。 爬虫能做很多事,能做商业分析,也能做生活助手,比如:分析北京近两年二手房成交均价是多少?广州的Python工程师平均薪资是多少?北京哪家餐厅粤菜最好吃?等等。 这是个人利用爬虫所做到的事情,而公司,同样可以利用爬虫来实现巨大的商业价值。比如你所熟悉的搜索引擎——百度和谷歌,它们的核心技术之一也是爬虫,而且是超级爬虫。 从搜索巨头到人工...
Python绘图,圣诞树,花,爱心 | Turtle篇
每周每日,分享Python实战代码,入门资料,进阶资料,基础语法,爬虫,数据分析,web网站,机器学习,深度学习等等。 公众号回复【进群】沟通交流吧,QQ扫码进群学习吧 微信群 QQ群 1.画圣诞树 import turtle screen = turtle.Screen() screen.setup(800,600) circle = turtle.Turtle()...
作为一个程序员,CPU的这些硬核知识你必须会!
CPU对每个程序员来说,是个既熟悉又陌生的东西? 如果你只知道CPU是中央处理器的话,那可能对你并没有什么用,那么作为程序员的我们,必须要搞懂的就是CPU这家伙是如何运行的,尤其要搞懂它里面的寄存器是怎么一回事,因为这将让你从底层明白程序的运行机制。 随我一起,来好好认识下CPU这货吧 把CPU掰开来看 对于CPU来说,我们首先就要搞明白它是怎么回事,也就是它的内部构造,当然,CPU那么牛的一个东...
破14亿,Python分析我国存在哪些人口危机!
一、背景 二、爬取数据 三、数据分析 1、总人口 2、男女人口比例 3、人口城镇化 4、人口增长率 5、人口老化(抚养比) 6、各省人口 7、世界人口 四、遇到的问题 遇到的问题 1、数据分页,需要获取从1949-2018年数据,观察到有近20年参数:LAST20,由此推测获取近70年的参数可设置为:LAST70 2、2019年数据没有放上去,可以手动添加上去 3、将数据进行 行列转换 4、列名...
web前端javascript+jquery知识点总结
1.Javascript 语法.用途 javascript 在前端网页中占有非常重要的地位,可以用于验证表单,制作特效等功能,它是一种描述语言,也是一种基于对象(Object)和事件驱动并具有安全性的脚本语言 ...
Python实战:抓肺炎疫情实时数据,画2019-nCoV疫情地图
今天,群里白垩老师问如何用python画武汉肺炎疫情地图。白垩老师是研究海洋生态与地球生物的学者,国家重点实验室成员,于不惑之年学习python,实为我等学习楷模。先前我并没有关注武汉肺炎的具体数据,也没有画过类似的数据分布图。于是就拿了两个小时,专门研究了一下,遂成此文。
听说想当黑客的都玩过这个Monyer游戏(1~14攻略)
第零关 进入传送门开始第0关(游戏链接) 请点击链接进入第1关: 连接在左边→ ←连接在右边 看不到啊。。。。(只能看到一堆大佬做完的留名,也能看到菜鸡的我,在后面~~) 直接fn+f12吧 &lt;span&gt;连接在左边→&lt;/span&gt; &lt;a href="first.php"&gt;&lt;/a&gt; &lt;span&gt;←连接在右边&lt;/span&gt; o...
在家远程办公效率低?那你一定要收好这个「在家办公」神器!
相信大家都已经收到国务院延长春节假期的消息,接下来,在家远程办公可能将会持续一段时间。 但是问题来了。远程办公不是人在电脑前就当坐班了,相反,对于沟通效率,文件协作,以及信息安全都有着极高的要求。有着非常多的挑战,比如: 1在异地互相不见面的会议上,如何提高沟通效率? 2文件之间的来往反馈如何做到及时性?如何保证信息安全? 3如何规划安排每天工作,以及如何进行成果验收? ...... ...
作为一个程序员,内存和磁盘的这些事情,你不得不知道啊!!!
截止目前,我已经分享了如下几篇文章: 一个程序在计算机中是如何运行的?超级干货!!! 作为一个程序员,CPU的这些硬核知识你必须会! 作为一个程序员,内存的这些硬核知识你必须懂! 这些知识可以说是我们之前都不太重视的基础知识,可能大家在上大学的时候都学习过了,但是嘞,当时由于老师讲解的没那么有趣,又加上这些知识本身就比较枯燥,所以嘞,大家当初几乎等于没学。 再说啦,学习这些,也看不出来有什么用啊!...
渗透测试-灰鸽子远控木马
木马概述 灰鸽子( Huigezi),原本该软件适用于公司和家庭管理,其功能十分强大,不但能监视摄像头、键盘记录、监控桌面、文件操作等。还提供了黑客专用功能,如:伪装系统图标、随意更换启动项名称和表述、随意更换端口、运行后自删除、毫无提示安装等,并采用反弹链接这种缺陷设计,使得使用者拥有最高权限,一经破解即无法控制。最终导致被黑客恶意使用。原作者的灰鸽子被定义为是一款集多种控制方式于一体的木马程序...
Python:爬取疫情每日数据
前言 目前每天各大平台,如腾讯、今日头条都会更新疫情每日数据,他们的数据源都是一样的,主要都是通过各地的卫健委官网通报。 以全国、湖北和上海为例,分别为以下三个网站: 国家卫健委官网:http://www.nhc.gov.cn/xcs/yqtb/list_gzbd.shtml 湖北卫健委官网:http://wjw.hubei.gov.cn/bmdt/ztzl/fkxxgzbdgrfyyq/xxfb...
这个世界上人真的分三六九等,你信吗?
偶然间,在知乎上看到一个问题 一时间,勾起了我深深的回忆。 以前在厂里打过两次工,做过家教,干过辅导班,做过中介。零下几度的晚上,贴过广告,满脸、满手地长冻疮。 再回首那段岁月,虽然苦,但让我学会了坚持和忍耐。让我明白了,在这个世界上,无论环境多么的恶劣,只要心存希望,星星之火,亦可燎原。 下文是原回答,希望能对你能有所启发。 如果我说,这个世界上人真的分三六九等,...
B 站上有哪些很好的学习资源?
哇说起B站,在小九眼里就是宝藏般的存在,放年假宅在家时一天刷6、7个小时不在话下,更别提今年的跨年晚会,我简直是跪着看完的!! 最早大家聚在在B站是为了追番,再后来我在上面刷欧美新歌和漂亮小姐姐的舞蹈视频,最近两年我和周围的朋友们已经把B站当作学习教室了,而且学习成本还免费,真是个励志的好平台ヽ(.◕ฺˇд ˇ◕ฺ;)ノ 下面我们就来盘点一下B站上优质的学习资源: 综合类 Oeasy: 综合...
雷火神山直播超两亿,Web播放器事件监听是怎么实现的?
Web播放器解决了在手机浏览器和PC浏览器上播放音视频数据的问题,让视音频内容可以不依赖用户安装App,就能进行播放以及在社交平台进行传播。在视频业务大数据平台中,播放数据的统计分析非常重要,所以Web播放器在使用过程中,需要对其内部的数据进行收集并上报至服务端,此时,就需要对发生在其内部的一些播放行为进行事件监听。 那么Web播放器事件监听是怎么实现的呢? 01 监听事件明细表 名...
3万字总结,Mysql优化之精髓
本文知识点较多,篇幅较长,请耐心学习 MySQL已经成为时下关系型数据库产品的中坚力量,备受互联网大厂的青睐,出门面试想进BAT,想拿高工资,不会点MySQL优化知识,拿offer的成功率会大大下降。 为什么要优化 系统的吞吐量瓶颈往往出现在数据库的访问速度上 随着应用程序的运行,数据库的中的数据会越来越多,处理时间会相应变慢 数据是存放在磁盘上的,读写速度无法和内存相比 如何优化 设计...
Python新型冠状病毒疫情数据自动爬取+统计+发送报告+数据屏幕(三)发送篇
今天介绍的项目是使用 Itchat 发送统计报告 项目功能设计: 定时爬取疫情数据存入Mysql 进行数据分析制作疫情报告 使用itchat给亲人朋友发送分析报告 基于Django做数据屏幕 使用Tableau做数据分析 来看看最终效果 目前已经完成,预计2月12日前更新 使用 itchat 发送数据统计报告 itchat 是一个基于 web微信的一个框架,但微信官方并不允许使用这...
作为程序员的我,大学四年一直自学,全靠这些实用工具和学习网站!
我本人因为高中沉迷于爱情,导致学业荒废,后来高考,毫无疑问进入了一所普普通通的大学,实在惭愧???? 我又是那么好强,现在学历不行,没办法改变的事情了,所以,进入大学开始,我就下定决心,一定要让自己掌握更多的技能,尤其选择了计算机这个行业,一定要多学习技术。 在进入大学学习不久后,我就认清了一个现实:我这个大学的整体教学质量和学习风气,真的一言难尽,懂的人自然知道怎么回事? 怎么办?我该如何更好的提升自...
粒子群算法求解物流配送路线问题(python)
1.Matlab实现粒子群算法的程序代码:https://www.cnblogs.com/kexinxin/p/9858664.html matlab代码求解函数最优值:https://blog.csdn.net/zyqblog/article/details/80829043 讲解通俗易懂,有数学实例的博文:https://blog.csdn.net/daaikuaichuan/article/...
教你如何编写第一个简单的爬虫
很多人知道爬虫,也很想利用爬虫去爬取自己想要的数据,那么爬虫到底怎么用呢?今天就教大家编写一个简单的爬虫。 下面以爬取笔者的个人博客网站为例获取第一篇文章的标题名称,教大家学会一个简单的爬虫。 第一步:获取页面 #!/usr/bin/python # coding: utf-8 import requests #引入包requests link = "http://www.santostang....
前端JS初级面试题二 (。•ˇ‸ˇ•。)老铁们!快来瞧瞧自己都会了么
1. 传统事件绑定和符合W3C标准的事件绑定有什么区别? 传统事件绑定 &lt;div onclick=""&gt;123&lt;/div&gt; div1.onclick = function(){}; &lt;button onmouseover=""&gt;&lt;/button&gt; 注意: 如果给同一个元素绑定了两次或多次相同类型的事件,那么后面的绑定会覆盖前面的绑定 (不支持DOM事...
相关热词 c# 压缩图片好麻烦 c#计算数组中的平均值 c#获取路由参数 c#日期精确到分钟 c#自定义异常必须继承 c#查表并返回值 c# 动态 表达式树 c# 监控方法耗时 c# listbox c#chart显示滚动条
立即提问