android studio 可以build但run会报错

android studio 可以build但run会报错 并且已经参考网上把gradle对应版本对应了
(想运行个hello world都这么难。。。。)
图片说明

图片说明

3个回答

原因是代理设置错误。

qq_40942328
qq_40942328 build failed 里面是 Connection timed out: connect 另外event log里面有报错是:18:43 Emulator: emulator: WARNING: Could not connect to proxy at 192.168.1.108:80: Unknown error ! 18:46 Gradle build failed in 2 m 26 s 117 ms 18:48 Emulator: emulator: WARNING: UpdateCheck: Failure: Error
4 个月之前 回复

网络不需要代理就把代理去掉,需要代理手动改下Ip
图片说明

1、换个网络好一点的wifi;或者2、直接翻墙;

Csdn user default icon
上传中...
上传图片
插入图片
抄袭、复制答案,以达到刷声望分或其他目的的行为,在CSDN问答是严格禁止的,一经发现立刻封号。是时候展现真正的技术了!
其他相关推荐
Android studio build时候报错
FAILURE: Build failed with an exception. * What went wrong: A problem occurred configuring root project 'MyApplication'. > Could not resolve all dependencies for configuration ':classpath'. > Could not resolve com.android.tools.build:gradle:1.5.0. Required by: :MyApplication:unspecified > Could not resolve com.android.tools.build:gradle:1.5.0. > Could not get resource 'https://jcenter.bintray.com/com/android/tools/build/gradle/1.5.0/gradle-1.5.0.pom'. > Could not GET 'https://jcenter.bintray.com/com/android/tools/build/gradle/1.5.0/gradle-1.5.0.pom'. > Connection to https://jcenter.bintray.com refused * Try: Run with --stacktrace option to get the stack trace. Run with --info or --debug option to get more log output. BUILD FAILED Total time: 45.925 secs Process finished with exit code 1 本地是有gradle的,但是好像build的时候还需要去下载似的 这个是运行出来的gradlew compileDebug --stacktrace 出来的Log信息,求指教 D:\work\Androidstudio\project\MyApplication>gradlew compileDebug --stacktrace Downloading https://services.gradle.org/distributions/gradle-2.8-all.zip Exception in thread "main" java.net.UnknownHostException: services.gradle.org at java.net.AbstractPlainSocketImpl.connect(AbstractPlainSocketImpl.java:184) at java.net.PlainSocketImpl.connect(PlainSocketImpl.java:172) at java.net.SocksSocketImpl.connect(SocksSocketImpl.java:392) at java.net.Socket.connect(Socket.java:589) at sun.security.ssl.SSLSocketImpl.connect(SSLSocketImpl.java:649) at sun.security.ssl.BaseSSLSocketImpl.connect(BaseSSLSocketImpl.java:173) at sun.net.NetworkClient.doConnect(NetworkClient.java:180) at sun.net.www.http.HttpClient.openServer(HttpClient.java:432) at sun.net.www.http.HttpClient.openServer(HttpClient.java:527) at sun.net.www.protocol.https.HttpsClient.(HttpsClient.java:275) at sun.net.www.protocol.https.HttpsClient.New(HttpsClient.java:371) at sun.net.www.protocol.https.AbstractDelegateHttpsURLConnection.getNewHttpClient(AbstractDelegateHttpsURLConnection.java:191) at sun.net.www.protocol.http.HttpURLConnection.plainConnect0(HttpURLConnection.java:1103) at sun.net.www.protocol.http.HttpURLConnection.plainConnect(HttpURLConnection.java:997) at sun.net.www.protocol.https.AbstractDelegateHttpsURLConnection.connect(AbstractDelegateHttpsURLConnection.java:177) at sun.net.www.protocol.http.HttpURLConnection.getInputStream0(HttpURLConnection.java:1511) at sun.net.www.protocol.http.HttpURLConnection.getInputStream(HttpURLConnection.java:1439) at sun.net.www.protocol.https.HttpsURLConnectionImpl.getInputStream(HttpsURLConnectionImpl.java:254) at org.gradle.wrapper.Download.downloadInternal(Download.java:58) at org.gradle.wrapper.Download.download(Download.java:44) at org.gradle.wrapper.Install$1.call(Install.java:61) at org.gradle.wrapper.Install$1.call(Install.java:48) at org.gradle.wrapper.ExclusiveFileAccessManager.access(ExclusiveFileAccessManager.java:65) at org.gradle.wrapper.Install.createDist(Install.java:48) at org.gradle.wrapper.WrapperExecutor.execute(WrapperExecutor.java:128) at org.gradle.wrapper.GradleWrapperMain.main(GradleWrapperMain.java:61)
Android studio编程这个报错怎么解决
Error:Could not run build action using Gradle installation 'D:\Program Files\Android\Android Studio\gradle\gradle-2.4'. 这个报错怎么解决?
android studio 混淆后,打包报错!!!
`` > Exception while processing task java.io.IOException: The same input jar [E:\Work\gv\app\libs\open_sdk_r5509.jar] is specified twice. > at proguard.ConfigurationChecker.checkConflicts(ConfigurationChecker.java:216) > at proguard.ConfigurationChecker.check(ConfigurationChecker.java:83) > at proguard.ProGuard.execute(ProGuard.java:73) > at proguard.gradle.ProGuardTask.proguard(ProGuardTask.java:1074) > at com.android.build.gradle.tasks.AndroidProGuardTask.doMinification(AndroidProGuardTask.java:139) at com.android.build.gradle.tasks.AndroidProGuardTask$1.run(AndroidProGuardTask.java:115) > at com.android.builder.tasks.Job.runTask(Job.java:48) > at com.android.build.gradle.tasks.SimpleWorkQueue$EmptyThreadContext.runTask(SimpleWorkQueue.java:41) > at com.android.builder.tasks.WorkQueue.run(WorkQueue.java:227) > at java.lang.Thread.run(Thread.java:745) > :app:dexAnzhiRelease UP-TO-DATE > :app:validateReleaseSigning > :app:packageAnzhiRelease FAILED > FAILURE: Build failed with an exception. > * What went wrong: > Execution failed for task ':app:packageAnzhiRelease'. > Unable to compute hash of E:\Work\gv\app\build\intermediates\classes-proguard\anzhi\release\classes.jar * Try: > Run with --stacktrace option to get the stack trace. Run with --info or --debug > option to get more log output. > BUILD FAILED > Total time: 18.962 secs ` > ``` 请大神指导,小弟在线求。刚才在网上学习了混淆技巧,把混淆模板复制过去,然后打包报错。
android studio里配置C++报错?
org.gradle.api.tasks.TaskExecutionException: Execution failed for task ':app:transformNativeLibsWithMergeJniLibsForDebug'. at org.gradle.api.internal.tasks.execution.ExecuteActionsTaskExecuter.executeActions(ExecuteActionsTaskExecuter.java:103) at org.gradle.api.internal.tasks.execution.ExecuteActionsTaskExecuter.execute(ExecuteActionsTaskExecuter.java:73) at org.gradle.api.internal.tasks.execution.OutputDirectoryCreatingTaskExecuter.execute(OutputDirectoryCreatingTaskExecuter.java:51) at org.gradle.api.internal.tasks.execution.SkipUpToDateTaskExecuter.execute(SkipUpToDateTaskExecuter.java:59) at org.gradle.api.internal.tasks.execution.ResolveTaskOutputCachingStateExecuter.execute(ResolveTaskOutputCachingStateExecuter.java:54) at org.gradle.api.internal.tasks.execution.ValidatingTaskExecuter.execute(ValidatingTaskExecuter.java:59) at org.gradle.api.internal.tasks.execution.SkipEmptySourceFilesTaskExecuter.execute(SkipEmptySourceFilesTaskExecuter.java:101) at org.gradle.api.internal.tasks.execution.FinalizeInputFilePropertiesTaskExecuter.execute(FinalizeInputFilePropertiesTaskExecuter.java:44) at org.gradle.api.internal.tasks.execution.CleanupStaleOutputsExecuter.execute(CleanupStaleOutputsExecuter.java:91) at org.gradle.api.internal.tasks.execution.ResolveTaskArtifactStateTaskExecuter.execute(ResolveTaskArtifactStateTaskExecuter.java:62) at org.gradle.api.internal.tasks.execution.SkipTaskWithNoActionsExecuter.execute(SkipTaskWithNoActionsExecuter.java:59) at org.gradle.api.internal.tasks.execution.SkipOnlyIfTaskExecuter.execute(SkipOnlyIfTaskExecuter.java:54) at org.gradle.api.internal.tasks.execution.ExecuteAtMostOnceTaskExecuter.execute(ExecuteAtMostOnceTaskExecuter.java:43) at org.gradle.api.internal.tasks.execution.CatchExceptionTaskExecuter.execute(CatchExceptionTaskExecuter.java:34) at org.gradle.execution.taskgraph.DefaultTaskGraphExecuter$EventFiringTaskWorker$1.run(DefaultTaskGraphExecuter.java:256) at org.gradle.internal.progress.DefaultBuildOperationExecutor$RunnableBuildOperationWorker.execute(DefaultBuildOperationExecutor.java:336) at org.gradle.internal.progress.DefaultBuildOperationExecutor$RunnableBuildOperationWorker.execute(DefaultBuildOperationExecutor.java:328) at org.gradle.internal.progress.DefaultBuildOperationExecutor.execute(DefaultBuildOperationExecutor.java:199) at org.gradle.internal.progress.DefaultBuildOperationExecutor.run(DefaultBuildOperationExecutor.java:110) at org.gradle.execution.taskgraph.DefaultTaskGraphExecuter$EventFiringTaskWorker.execute(DefaultTaskGraphExecuter.java:249) at org.gradle.execution.taskgraph.DefaultTaskGraphExecuter$EventFiringTaskWorker.execute(DefaultTaskGraphExecuter.java:238) at org.gradle.execution.taskgraph.DefaultTaskPlanExecutor$TaskExecutorWorker.processTask(DefaultTaskPlanExecutor.java:123) at org.gradle.execution.taskgraph.DefaultTaskPlanExecutor$TaskExecutorWorker.access$200(DefaultTaskPlanExecutor.java:79) at org.gradle.execution.taskgraph.DefaultTaskPlanExecutor$TaskExecutorWorker$1.execute(DefaultTaskPlanExecutor.java:104) at org.gradle.execution.taskgraph.DefaultTaskPlanExecutor$TaskExecutorWorker$1.execute(DefaultTaskPlanExecutor.java:98) at org.gradle.execution.taskgraph.DefaultTaskExecutionPlan.execute(DefaultTaskExecutionPlan.java:663) at org.gradle.execution.taskgraph.DefaultTaskExecutionPlan.executeWithTask(DefaultTaskExecutionPlan.java:597) at org.gradle.execution.taskgraph.DefaultTaskPlanExecutor$TaskExecutorWorker.run(DefaultTaskPlanExecutor.java:98) at org.gradle.internal.concurrent.ExecutorPolicy$CatchAndRecordFailures.onExecute(ExecutorPolicy.java:63) at org.gradle.internal.concurrent.ManagedExecutorImpl$1.run(ManagedExecutorImpl.java:46) at java.util.concurrent.ThreadPoolExecutor.runWorker(ThreadPoolExecutor.java:1142) at java.util.concurrent.ThreadPoolExecutor$Worker.run(ThreadPoolExecutor.java:617) at org.gradle.internal.concurrent.ThreadFactoryImpl$ManagedThreadRunnable.run(ThreadFactoryImpl.java:55) at java.lang.Thread.run(Thread.java:745) Caused by: java.io.UncheckedIOException: java.nio.file.AccessDeniedException: C:\WINDOWS\Temp at com.android.builder.merge.LazyIncrementalFileMergerInputs.load(LazyIncrementalFileMergerInputs.java:88) at com.android.builder.merge.LazyIncrementalFileMergerInputs.lambda$fromNew$0(LazyIncrementalFileMergerInputs.java:59) at com.android.tools.build.apkzlib.utils.CachedSupplier.get(CachedSupplier.java:72) at com.android.builder.merge.LazyIncrementalFileMergerInput.lambda$new$2(LazyIncrementalFileMergerInput.java:138) at com.android.tools.build.apkzlib.utils.CachedSupplier.get(CachedSupplier.java:72) at com.android.builder.merge.LazyIncrementalFileMergerInput.open(LazyIncrementalFileMergerInput.java:225) at com.android.builder.merge.DelegateIncrementalFileMergerInput.open(DelegateIncrementalFileMergerInput.java:49) at com.google.common.collect.ImmutableList.forEach(ImmutableList.java:406) at com.android.builder.merge.IncrementalFileMerger.merge(IncrementalFileMerger.java:73) at com.android.build.gradle.internal.transforms.MergeJavaResourcesTransform.transform(MergeJavaResourcesTransform.java:411) at com.android.build.gradle.internal.pipeline.TransformTask$2.call(TransformTask.java:239) at com.android.build.gradle.internal.pipeline.TransformTask$2.call(TransformTask.java:235) at com.android.builder.profile.ThreadRecorder.record(ThreadRecorder.java:102) at com.android.build.gradle.internal.pipeline.TransformTask.transform(TransformTask.java:230) at sun.reflect.NativeMethodAccessorImpl.invoke0(Native Method) at sun.reflect.NativeMethodAccessorImpl.invoke(NativeMethodAccessorImpl.java:62) at sun.reflect.DelegatingMethodAccessorImpl.invoke(DelegatingMethodAccessorImpl.java:43) at java.lang.reflect.Method.invoke(Method.java:498) at org.gradle.internal.reflect.JavaMethod.invoke(JavaMethod.java:73) at org.gradle.api.internal.project.taskfactory.IncrementalTaskAction.doExecute(IncrementalTaskAction.java:50) at org.gradle.api.internal.project.taskfactory.StandardTaskAction.execute(StandardTaskAction.java:39) at org.gradle.api.internal.project.taskfactory.StandardTaskAction.execute(StandardTaskAction.java:26) at org.gradle.api.internal.tasks.execution.ExecuteActionsTaskExecuter$1.run(ExecuteActionsTaskExecuter.java:124) at org.gradle.internal.progress.DefaultBuildOperationExecutor$RunnableBuildOperationWorker.execute(DefaultBuildOperationExecutor.java:336) at org.gradle.internal.progress.DefaultBuildOperationExecutor$RunnableBuildOperationWorker.execute(DefaultBuildOperationExecutor.java:328) at org.gradle.internal.progress.DefaultBuildOperationExecutor.execute(DefaultBuildOperationExecutor.java:199) at org.gradle.internal.progress.DefaultBuildOperationExecutor.run(DefaultBuildOperationExecutor.java:110) at org.gradle.api.internal.tasks.execution.ExecuteActionsTaskExecuter.executeAction(ExecuteActionsTaskExecuter.java:113) at org.gradle.api.internal.tasks.execution.ExecuteActionsTaskExecuter.executeActions(ExecuteActionsTaskExecuter.java:95) ... 33 more Caused by: java.nio.file.AccessDeniedException: C:\WINDOWS\Temp at sun.nio.fs.WindowsException.translateToIOException(WindowsException.java:83) at sun.nio.fs.WindowsException.rethrowAsIOException(WindowsException.java:97) at sun.nio.fs.WindowsException.rethrowAsIOException(WindowsException.java:102) at sun.nio.fs.WindowsDirectoryStream.<init>(WindowsDirectoryStream.java:86) at sun.nio.fs.WindowsFileSystemProvider.newDirectoryStream(WindowsFileSystemProvider.java:518) at java.nio.file.Files.newDirectoryStream(Files.java:457) at com.google.common.io.MoreFiles.deleteRecursively(MoreFiles.java:516) at com.android.tools.build.apkzlib.bytestorage.TemporaryFile.deleteFile(TemporaryFile.java:57) at com.android.tools.build.apkzlib.bytestorage.TemporaryFile.close(TemporaryFile.java:48) at com.android.tools.build.apkzlib.bytestorage.TemporaryDirectory$1.close(TemporaryDirectory.java:50) at com.android.tools.build.apkzlib.bytestorage.TemporaryDirectoryStorage.close(TemporaryDirectoryStorage.java:101) at com.android.tools.build.apkzlib.bytestorage.OverflowToDiskByteStorage.close(OverflowToDiskByteStorage.java:167) at com.android.tools.build.apkzlib.bytestorage.ChunkBasedByteStorage.close(ChunkBasedByteStorage.java:142) at com.android.tools.build.apkzlib.zip.ZFile.close(ZFile.java:1210) at com.android.builder.files.RelativeFiles.fromZip(RelativeFiles.java:125) at com.android.builder.merge.LazyIncrementalFileMergerInputs.load(LazyIncrementalFileMergerInputs.java:86) ... 61 more
刚安装好android studio 后新建第一个项目报错 Gradle sync failed
android studio 新建项目 Gradle sync failed: The first result from the daemon was empty. Most likely the process died immediately after connection. ![图片说明](https://img-ask.csdn.net/upload/201701/24/1485259415_875463.png) 关闭了杀毒软件,但还是报错; File->Invalidate Caches/Restart仍然出现这样的错误 ![图片说明](https://img-ask.csdn.net/upload/201701/24/1485259599_139647.png) 电脑没有连接任何其他设备 关于gradle的设置和文件是这样的:![图片说明](https://img-ask.csdn.net/upload/201701/24/1485259902_92537.png) ![图片说明](https://img-ask.csdn.net/upload/201701/24/1485259913_196525.png) ![图片说明](https://img-ask.csdn.net/upload/201701/24/1485261039_326185.png) 打开后看到: Caused by: org.gradle.launcher.daemon.client.NoUsableDaemonFoundException: Unable to find a usable idle daemon. I have connected to 100 different daemons but I could not use any of them to run the build. BuildActionParameters were DefaultBuildActionParameters {, currentDir=F:\Android_studio_projects\MyApplication, systemProperties size=91, envVariables size=43, logLevel=LIFECYCLE, daemonUsage=IMPLICITLY_DISABLED, continuous=false, interactive=false, injectedPluginClasspath=[]}.
android studio 编译问题
最近用android studio2.3 run一个项目发现报错,android studio2.3,gradle 2.3.1, gradle wrapper 是3.3-all, 报错如下,怎么破? Error:Execution failed for task ':app:packageXxxxDebug'. > java.io.IOException: Failed to read zip file 'D:\xxx\app\build\intermediates\transforms\mergeJavaRes\xxx\debug\jars\2\1f\main.jar'.
Android studio 混淆打包报错了
先运行gradlew clean,没有问题。 再运行gradlew assembleRelease 就报了下面的错: Warning: D:\deve\Adrich\AndroidManifest.xml:23:5 Warning: application@android:icon was tagged at AndroidManifest.xml:23 to replace other declarations but no other declaration present Warning: D:\deve\Adrich\AndroidManifest.xml:23:5 Warning: application@android:theme was tagged at AndroidManifest.xml:23 to replace other declarations but no other declaration present D:\deve\Adrich\AndroidManifest.xml:23:5 Warning: application@android:icon was tagged at AndroidManifest.xml:23 to replace other declarations but no other declaration present D:\deve\Adrich\AndroidManifest.xml:23:5 Warning: application@android:theme was tagged at AndroidManifest.xml:23 to replace other declarations but no other declaration present :Adrich:processReleaseResources D:\deve\Adrich\build\intermediates\res\release\layout\recharge1_activity.xml:100: error: Error: No resource found that matches the given name (at 'background' with value '@color/white'). D:\deve\Adrich\build\intermediates\res\release\layout\recharge2_activity.xml:52: error: Error: No resource found that matches the given name (at 'background' with value '@color/white'). D:\deve\Adrich\build\intermediates\res\release\layout\recharge2_activity.xml:74: error: Error: No resource found that matches the given name (at 'background' with value '@color/white'). :Adrich:processReleaseResources FAILED FAILURE: Build failed with an exception. * What went wrong: Execution failed for task ':Adrich:processReleaseResources'. > com.android.ide.common.internal.LoggedErrorException: Failed to run command: D:\android\adt-bundle-windows-x86_64-20140702\sdk\build-tools\android-4.4W\aapt.exe package -f --no-crunch -I D:\android\adt-bundle-windows-x86_64-20140702\sdk\platforms\android-19\android.jar -M D:\deve\Adrich\build\intermediates\manifests\full\release\AndroidManifest.xml -S D:\deve\Adrich\build\intermediates\res\release -A D:\deve\Adrich\build\intermediates\assets\release -m -J D:\deve\Adrich\build\generated\source\r\release -F D:\deve\Adrich\build\intermediates\res\resources-release.ap_ -G D:\deve\Adrich\build\intermediates\proguard-rules\release\aapt_rules.txt --custom-package com.adrich.adrich -0 apk --output-text-symbols D:\deve\Adrich\build\intermediates\symbols\release Error Code: 1 Output: D:\deve\Adrich\build\intermediates\res\release\layout\recharge1_activity.xml:100: error: Error: No resource found that matches the given name (at 'background' with value '@color/white'). D:\deve\Adrich\build\intermediates\res\release\layout\recharge2_activity.xml:52: error: Error: No resource found that matches the given name (at 'background' with value '@color/white'). D:\deve\Adrich\build\intermediates\res\release\layout\recharge2_activity.xml:74: error: Error: No resource found that matches the given name (at 'background' with value '@color/white'). * Try: Run with --stacktrace option to get the stack trace. Run with --info or --debug option to get more log output. BUILD FAILED Total time: 2 mins 3.648 secs
android studio连接mysql数据库报错,请问这是那里的问题?
我用android studio 连接mysql数据库,用的是从maven上下载的JDBC包。但是点击运行后它提示: AGPBI: {"kind":"error","text":"Default interface methods are only supported starting with Android N (--min-api 24): com.mysql.cj.protocol.Message com.mysql.cj.interceptors.QueryInterceptor.postProcess(com.mysql.cj.protocol.Message, com.mysql.cj.protocol.Message)","sources":[{}],"tool":"D8"} FAILURE: Build failed with an exception. * What went wrong: Execution failed for task ':app:mergeExtDexDebug'. > Could not resolve all files for configuration ':app:debugRuntimeClasspath'. > Failed to transform file 'mysql-connector-java-8.0.11.jar' to match attributes {artifactType=android-dex, dexing-is-debuggable=true, dexing-min-sdk=15, org.gradle.usage=java-runtime-jars} > Execution failed for DexingTransform: D:\Anzhuo-SDK\android project\app\libs\mysql-connector-java-8.0.11.jar. > Error while dexing. > Failed to transform file 'mysql-connector-java-8.0.11.jar' to match attributes {artifactType=android-dex, dexing-is-debuggable=true, dexing-min-sdk=15, org.gradle.usage=java-runtime-jars} > Execution failed for DexingTransform: D:\Anzhuo-SDK\android project\app\libs\mysql-connector-java-8.0.11.jar. > Error while dexing. * Try: Run with --stacktrace option to get the stack trace. Run with --info or --debug option to get more log output. Run with --scan to get full insights. * Get more help at https://help.gradle.org Deprecated Gradle features were used in this build, making it incompatible with Gradle 6.0. Use '--warning-mode all' to show the individual deprecation warnings. See https://docs.gradle.org/5.1.1/userguide/command_line_interface.html#sec:command_line_warnings BUILD FAILED in 19s 我想问一下,这是为什么?是因为JAR的版本问题吗?
android studio 导入报错
开始可以运行 然后我拷贝到另外一台电脑上就无法运行 先是报错 Installation failed with message Invalid File: K:\project\app\build\intermediates\split-apk\with_ImageProcessor\debug\slices\slice_0.apk. It is possible that this issue is resolved by uninstalling an existing version of the apk if it is present, and then re-installing. WARNING: Uninstalling will remove the application data! Do you want to uninstall the existing application? 然后我按照stackoverflow上的方法 Click Build tab ---> Clean Project Click Build tab ---> Build APK Run. 走了一遍 但是程序打不开 点击debug 然后 debug界面显示 $ adb install-multiple -r /Users/user/Desktop/x1/Xd/app/build/outputs/apk/app-debug.apk Split APKs installed $ adb shell am start -n "com.example.user.xd/com.example.user.xd.FirstActivity" -a android.intent.action.MAIN -c android.intent.category.LAUNCHER -D Connecting to com.example.user.xd Connected to the target VM, address: 'localhost:8600', transport: 'socket' Disconnected from the target VM, address: 'localhost:8600', transport: 'socket' Android Monitor 提示 09-21 21:59:40.061 22694-22694/? I/art: Late-enabling -Xcheck:jni 09-21 21:59:40.114 22694-22694/com.example.user.xd W/ActivityThread: Application com.example.user.xd is waiting for the debugger on port 8100... 09-21 21:59:40.114 22694-22694/com.example.user.xd I/System.out: Sending WAIT chunk 09-21 21:59:40.315 22694-22700/com.example.user.xd I/art: Debugger is active 09-21 21:59:40.515 22694-22694/com.example.user.xd I/System.out: Debugger has connected 09-21 21:59:40.515 22694-22694/com.example.user.xd I/System.out: waiting for debugger to settle... 09-21 21:59:40.715 22694-22694/com.example.user.xd I/System.out: waiting for debugger to settle... 09-21 21:59:40.915 22694-22694/com.example.user.xd I/System.out: waiting for debugger to settle... 09-21 21:59:41.115 22694-22694/com.example.user.xd I/System.out: waiting for debugger to settle... 09-21 21:59:41.316 22694-22694/com.example.user.xd I/System.out: waiting for debugger to settle... 09-21 21:59:41.516 22694-22694/com.example.user.xd I/System.out: waiting for debugger to settle... 09-21 21:59:41.716 22694-22694/com.example.user.xd I/System.out: waiting for debugger to settle... 09-21 21:59:41.917 22694-22694/com.example.user.xd I/System.out: debugger has settled (1396) 09-21 21:59:42.009 22694-22694/com.example.user.xd W/art: Failed execv(/system/bin/dex2oat --runtime-arg -classpath --runtime-arg --debuggable --instruction-set=arm --instruction-set-features=smp,div,atomic_ldrd_strd --runtime-arg -Xrelocate --boot-image=/system/framework/boot.art --non-interactive --runtime-arg -Xms64m --runtime-arg -Xmx512m --instruction-set-variant=krait --instruction-set-features=default --dex-file=/data/app/com.example.user.xd-2/split_lib_slice_0_apk.apk --oat-file=/data/dalvik-cache/arm/data@app@com.example.user.xd-2@split_lib_slice_0_apk.apk@classes.dex) because non-0 exit status 09-21 21:59:42.020 22694-22694/com.example.user.xd W/art: Fallback to original dex file with interpret-mode for /data/app/com.example.user.xd-2/split_lib_slice_0_apk.apk 09-21 21:59:42.021 22694-22694/com.example.user.xd W/System: ClassLoader referenced unknown path: /data/app/com.example.user.xd-2/lib/arm 09-21 21:59:42.025 22694-22694/com.example.user.xd I/InstantRun: starting instant run server: is main process 09-21 21:59:42.031 22694-22694/com.example.user.xd I/art: Rejecting re-init on previously-failed class java.lang.Class<com.example.user.xd.FirstActivity> 09-21 21:59:42.031 22694-22694/com.example.user.xd D/AndroidRuntime: Shutting down VM 09-21 21:59:42.035 22694-22694/com.example.user.xd E/AndroidRuntime: FATAL EXCEPTION: main Process: com.example.user.xd, PID: 22694 java.lang.RuntimeException: Unable to instantiate activity ComponentInfo{com.example.user.xd/com.example.user.xd.FirstActivity}: java.lang.ClassNotFoundException: Didn't find class "com.example.user.xd.FirstActivity" on path: DexPathList[[zip file "/data/app/com.example.user.xd-2/base.apk", zip file "/data/app/com.example.user.xd-2/split_lib_slice_0_apk.apk"],nativeLibraryDirectories=[/data/app/com.example.user.xd-2/lib/arm, /vendor/lib, /system/lib]] at android.app.ActivityThread.performLaunchActivity(ActivityThread.java:2360) at android.app.ActivityThread.handleLaunchActivity(ActivityThread.java:2509) at android.app.ActivityThread.access$1000(ActivityThread.java:153) at android.app.ActivityThread$H.handleMessage(ActivityThread.java:1373) at android.os.Handler.dispatchMessage(Handler.java:102) at android.os.Looper.loop(Looper.java:154) at android.app.ActivityThread.main(ActivityThread.java:5528) at java.lang.reflect.Method.invoke(Native Method) at com.android.internal.os.ZygoteInit$MethodAndArgsCaller.run(ZygoteInit.java:740) at com.android.internal.os.ZygoteInit.main(ZygoteInit.java:630) Caused by: java.lang.ClassNotFoundException: Didn't find class "com.example.user.xd.FirstActivity" on path: DexPathList[[zip file "/data/app/com.example.user.xd-2/base.apk", zip file "/data/app/com.example.user.xd-2/split_lib_slice_0_apk.apk"],nativeLibraryDirectories=[/data/app/com.example.user.xd-2/lib/arm, /vendor/lib, /system/lib]] at dalvik.system.BaseDexClassLoader.findClass(BaseDexClassLoader.java:56) at java.lang.ClassLoader.loadClass(ClassLoader.java:511) at java.lang.ClassLoader.loadClass(ClassLoader.java:469) at android.app.Instrumentation.newActivity(Instrumentation.java:1068) at android.app.ActivityThread.performLaunchActivity(ActivityThread.java:2350) at android.app.ActivityThread.handleLaunchActivity(ActivityThread.java:2509)  at android.app.ActivityThread.access$1000(ActivityThread.java:153)  at android.app.ActivityThread$H.handleMessage(ActivityThread.java:1373)  at android.os.Handler.dispatchMessage(Handler.java:102)  at android.os.Looper.loop(Looper.java:154)  at android.app.ActivityThread.main(ActivityThread.java:5528)  at java.lang.reflect.Method.invoke(Native Method)  at com.android.internal.os.ZygoteInit$MethodAndArgsCaller.run(ZygoteInit.java:740)  at com.android.internal.os.ZygoteInit.main(ZygoteInit.java:630)  Suppressed: java.lang.NoClassDefFoundError: com.example.user.xd.FirstActivity at dalvik.system.DexFile.defineClassNative(Native Method) at dalvik.system.DexFile.defineClass(DexFile.java:226) at dalvik.system.DexFile.loadClassBinaryName(DexFile.java:219) at dalvik.system.DexPathList.findClass(DexPathList.java:338) at dalvik.system.BaseDexClassLoader.findClass(BaseDexClassLoader.java:54) ... 13 more Suppressed: java.lang.ClassNotFoundException: com.example.user.xd.FirstActivity at java.lang.Class.classForName(Native Method) at java.lang.BootClassLoader.findClass(ClassLoader.java:781) at java.lang.BootClassLoader.loadClass(ClassLoader.java:841) at java.lang.ClassLoader.loadClass(ClassLoader.java:504) ... 12 more Caused by: java.lang.NoClassDefFoundError: Class not found using the boot class loader; no stack trace available
android studio 新建项目运行报错
Logcat 报错如下: **09-08 10:11:56.694 6639-6639/? E/AndroidRuntime: FATAL EXCEPTION: main Process: com.max.myapplication, PID: 6639 java.lang.RuntimeException: Unable to start activity ComponentInfo{com.max.myapplication/com.max.myapplication.MainActivity}: java.lang.IllegalStateException: This app has been built with an incorrect configuration. Please configure your build for VectorDrawableCompat. at android.app.ActivityThread.performLaunchActivity(ActivityThread.java:2219) at android.app.ActivityThread.handleLaunchActivity(ActivityThread.java:2269) at android.app.ActivityThread.access$800(ActivityThread.java:135) at android.app.ActivityThread$H.handleMessage(ActivityThread.java:1196) at android.os.Handler.dispatchMessage(Handler.java:102) at android.os.Looper.loop(Looper.java:136) at android.app.ActivityThread.main(ActivityThread.java:5045) at java.lang.reflect.Method.invokeNative(Native Method) at java.lang.reflect.Method.invoke(Method.java:515) at com.android.internal.os.ZygoteInit$MethodAndArgsCaller.run(ZygoteInit.java:779) at com.android.internal.os.ZygoteInit.main(ZygoteInit.java:595) at dalvik.system.NativeStart.main(Native Method) Caused by: java.lang.IllegalStateException: This app has been built with an incorrect configuration. Please configure your build for VectorDrawableCompat. at android.support.v7.widget.AppCompatDrawableManager.checkVectorDrawableSetup(AppCompatDrawableManager.java:692) at android.support.v7.widget.AppCompatDrawableManager.getDrawable(AppCompatDrawableManager.java:186) at android.support.v7.widget.TintTypedArray.getDrawableIfKnown(TintTypedArray.java:77) at android.support.v7.app.AppCompatDelegateImplBase.<init>(AppCompatDelegateImplBase.java:83) at android.support.v7.app.AppCompatDelegateImplV7.<init>(AppCompatDelegateImplV7.java:146) at android.support.v7.app.AppCompatDelegateImplV11.<init>(AppCompatDelegateImplV11.java:28) at android.support.v7.app.AppCompatDelegateImplV14.<init>(AppCompatDelegateImplV14.java:41) at android.support.v7.app.AppCompatDelegate.create(AppCompatDelegate.java:193) at android.support.v7.app.AppCompatDelegate.create(AppCompatDelegate.java:173) at android.support.v7.app.AppCompatActivity.getDelegate(AppCompatActivity.java:511) at android.support.v7.app.AppCompatActivity.onCreate(AppCompatActivity.java:71) at com.max.myapplication.MainActivity.onCreate(MainActivity.java:10) at android.app.Activity.performCreate(Activity.java:5231) at android.app.Instrumentation.callActivityOnCreate(Instrumentation.java:1104) at android.app.ActivityThread.performLaunchActivity(ActivityThread.java:2163) at android.app.ActivityThread.handleLaunchActivity(ActivityThread.java:2269)  at android.app.ActivityThread.access$800(ActivityThread.java:135)  at android.app.ActivityThread$H.handleMessage(ActivityThread.java:1196)  at android.os.Handler.dispatchMessage(Handler.java:102)  at android.os.Looper.loop(Looper.java:136)  at android.app.ActivityThread.main(ActivityThread.java:5045)  at java.lang.reflect.Method.invokeNative(Native Method)  at java.lang.reflect.Method.invoke(Method.java:515)  at com.android.internal.os.ZygoteInit$MethodAndArgsCaller.run(ZygoteInit.java:779)  at com.android.internal.os.ZygoteInit.main(ZygoteInit.java:595)  at dalvik.system.NativeStart.main(Native Method)  09-08 10:11:58.562 6639-6639/? I/Process: Sending signal. PID: 6639 SIG: 9****
Android Studio导入第三方库AndroidSwipeLayout 运行时报错
本人刚开始学习android,小白水平。在导入第三方库AndroidSwipeLayout的时候遇到错误:每次运行的时候都会报错Error: Program type already present: android.support.v4.os.ResultReceiver。 因为刚开始学习,对gradle还不是很了解,到网上查询之后说是可能我有两个包版本不同但同时导入才导致的,但是我实在找不到报错中的信息对应在构建文件中的什么部分,在网上找了几个办法也都没有管用,求大神指点! 导入时用的是import Module,然后在project structure里添加依赖。 本人对gradle正在努力学习,还不是很懂,,附上配置文件的部分: **项目的build.gradle** ``` buildscript { repositories { google() jcenter() } dependencies { classpath 'com.android.tools.build:gradle:3.2.0-beta04' } } allprojects { repositories { google() jcenter() } } task clean(type: Delete) { delete rootProject.buildDir } ``` ## **app的build.gradle** ``` apply plugin: 'com.android.application' android { compileSdkVersion 28 defaultConfig { applicationId "com.zhang.hp.myapplication" minSdkVersion 15 targetSdkVersion 28 versionCode 1 versionName "1.0" testInstrumentationRunner "androidx.test.runner.AndroidJUnitRunner" } buildTypes { release { minifyEnabled false proguardFiles getDefaultProguardFile('proguard-android.txt'), 'proguard-rules.pro' } } } dependencies { implementation fileTree(include: ['*.jar'], dir: 'libs') implementation 'androidx.appcompat:appcompat:1.0.0-alpha1' implementation 'androidx.constraintlayout:constraintlayout:1.1.2' testImplementation 'junit:junit:4.12' androidTestImplementation 'androidx.test:runner:1.1.0-alpha3' androidTestImplementation 'androidx.test.espresso:espresso-core:3.1.0-alpha3' implementation project(':library') } ``` ## 导入的library的build.gradle ``` apply plugin: 'com.android.library' android { compileSdkVersion Integer.parseInt(project.ANDROID_BUILD_SDK_VERSION) buildToolsVersion project.ANDROID_BUILD_TOOLS_VERSION defaultConfig { minSdkVersion 9 targetSdkVersion Integer.parseInt(project.ANDROID_BUILD_TARGET_SDK_VERSION) } } dependencies { compile 'com.android.support:recyclerview-v7:25.2.0' compile 'com.android.support:support-v4:25.2.0' } // build a jar with source files task sourcesJar(type: Jar) { from android.sourceSets.main.java.srcDirs classifier = 'sources' } artifacts { archives sourcesJar } ``` ## **gradle.properties** ``` # Project-wide Gradle settings. # IDE (e.g. Android Studio) users: # Gradle settings configured through the IDE *will override* # any settings specified in this file. # For more details on how to configure your build environment visit # http://www.gradle.org/docs/current/userguide/build_environment.html # Specifies the JVM arguments used for the daemon process. # The setting is particularly useful for tweaking memory settings. org.gradle.jvmargs=-Xmx1536m # When configured, Gradle will run in incubating parallel mode. # This option should only be used with decoupled projects. More details, visit # http://www.gradle.org/docs/current/userguide/multi_project_builds.html#sec:decoupled_projects # org.gradle.parallel=true ANDROID_BUILD_TARGET_SDK_VERSION=25 ANDROID_BUILD_TOOLS_VERSION=25.0.0 ANDROID_BUILD_SDK_VERSION=25 ANDROID_BUILD_MIN_SDK_VERSION=14 ``` 最好能说明一下导包的版本问题,希望大神们能指点一下,谢谢!
react-native run-android报错
之前项目在VScode里运行时没有任何问题,但是隔天再次打开时候报错了,报错如下 ``` > Task :app:processDebugResources FAILED FAILURE: Build failed with an exception. * What went wrong: Failed to capture snapshot of output files for task ':app:processDebugResources' property 'sourceOutputDir' during up-to-date check. > Could not read path 'D:\ReactNativeProject\MyApp\android\app\build\generated\not_namespaced_r_class_sources\debug\processDebugResources\r\com\facebook\imagepipeline\backends'. * Try: Run with --stacktrace option to get the stack trace. Run with --info or --debug option to get more log output. Run with --scan to get full insights. * Get more help at https://help.gradle.org ``` 经过查询后知道如何解决,按照下面的方法就可解决 ``` //在项目的路径下输入 PS D:\ReactNativeProject\MyApp> cd android PS D:\ReactNativeProject\MyApp\android> ./gradlew clean //等待加载完后,回到上一层目录,执行react-native run-android。 PS D:\ReactNativeProject\MyApp\android> cd .. PS D:\ReactNativeProject\MyApp> react-native run-android ``` 问题解决
Android Studio如何配置环境变量
想请教一下,用Android Studio开发时,需要配置ANDROID_SDK_HOME环境变量吗?我设置的是sdk文件夹所在的路径: ``` C:\Users\acer\AppData\Local\Android\sdk ``` 有没有错呢?或者说是否需要配置呢?因为当我启动模拟器或者启动手机编译的时候,会有提示信息: ``` Waiting for device. C:\Users\acer\AppData\Local\Android\sdk\tools\emulator.exe -avd Nexus_5_API_21_x86 -netspeed full -netdelay none ``` 以及gradle console的报错信息: ``` FAILURE: Build failed with an exception. * What went wrong: Execution failed for task ':app:preDexDebug'. > com.android.ide.common.internal.LoggedErrorException: Failed to run command: C:\Users\acer\AppData\Local\Android\sdk\build-tools\21.1.1\dx.bat --dex --output C:\Users\acer\AndroidStudioProjects\AndroidTutorial\app\build\intermediates\pre-dexed\debug\classes-88c274548bdbb2cca7c59c342ef8955f7e09092a.jar C:\Users\acer\AndroidStudioProjects\AndroidTutorial\app\build\intermediates\exploded-aar\com.android.support\support-v4\21.0.3\classes.jar Error Code: 255 Output: 'reg' 不是内部或外部命令,也不是可运行的程序 或批处理文件。 ```
android studio报错 看不太懂 新手
请各位帮我看看是什么问题 谢谢 * Try: Run gradle tasks to get a list of available tasks. Run with --info or --debug op tion to get more log output. * Exception is: org.gradle.execution.TaskSelectionException: Task 'compileDebug' not found in ro ot project 'fao167'. at org.gradle.execution.TaskSelector.getSelection(TaskSelector.java:100) at org.gradle.execution.TaskSelector.getSelection(TaskSelector.java:75) at org.gradle.execution.commandline.CommandLineTaskParser.parseTasks(Com mandLineTaskParser.java:42) at org.gradle.execution.TaskNameResolvingBuildConfigurationAction.config ure(TaskNameResolvingBuildConfigurationAction.java:44) at org.gradle.execution.DefaultBuildConfigurationActionExecuter.configur e(DefaultBuildConfigurationActionExecuter.java:48) at org.gradle.execution.DefaultBuildConfigurationActionExecuter.access$0 00(DefaultBuildConfigurationActionExecuter.java:25) at org.gradle.execution.DefaultBuildConfigurationActionExecuter$1.procee d(DefaultBuildConfigurationActionExecuter.java:54) at org.gradle.execution.DefaultTasksBuildExecutionAction.configure(Defau ltTasksBuildExecutionAction.java:44) at org.gradle.execution.DefaultBuildConfigurationActionExecuter.configur e(DefaultBuildConfigurationActionExecuter.java:48) at org.gradle.execution.DefaultBuildConfigurationActionExecuter.access$0 00(DefaultBuildConfigurationActionExecuter.java:25) at org.gradle.execution.DefaultBuildConfigurationActionExecuter$1.procee d(DefaultBuildConfigurationActionExecuter.java:54) at org.gradle.execution.ExcludedTaskFilteringBuildConfigurationAction.co nfigure(ExcludedTaskFilteringBuildConfigurationAction.java:47) at org.gradle.execution.DefaultBuildConfigurationActionExecuter.configur e(DefaultBuildConfigurationActionExecuter.java:48) at org.gradle.execution.DefaultBuildConfigurationActionExecuter.select(D efaultBuildConfigurationActionExecuter.java:36) at org.gradle.initialization.DefaultGradleLauncher$3.run(DefaultGradleLa uncher.java:142) at org.gradle.internal.Factories$1.create(Factories.java:22) at org.gradle.internal.progress.DefaultBuildOperationExecutor.run(Defaul tBuildOperationExecutor.java:91) at org.gradle.internal.progress.DefaultBuildOperationExecutor.run(Defaul tBuildOperationExecutor.java:53) at org.gradle.initialization.DefaultGradleLauncher.doBuildStages(Default GradleLauncher.java:139) at org.gradle.initialization.DefaultGradleLauncher.access$200(DefaultGra dleLauncher.java:32) at org.gradle.initialization.DefaultGradleLauncher$1.create(DefaultGradl eLauncher.java:98) at org.gradle.initialization.DefaultGradleLauncher$1.create(DefaultGradl eLauncher.java:92) at org.gradle.internal.progress.DefaultBuildOperationExecutor.run(Defaul tBuildOperationExecutor.java:91) at org.gradle.internal.progress.DefaultBuildOperationExecutor.run(Defaul tBuildOperationExecutor.java:63) at org.gradle.initialization.DefaultGradleLauncher.doBuild(DefaultGradle Launcher.java:92) at org.gradle.initialization.DefaultGradleLauncher.run(DefaultGradleLaun cher.java:83) at org.gradle.launcher.exec.InProcessBuildActionExecuter$DefaultBuildCon troller.run(InProcessBuildActionExecuter.java:99) at org.gradle.tooling.internal.provider.ExecuteBuildActionRunner.run(Exe cuteBuildActionRunner.java:28) at org.gradle.launcher.exec.ChainingBuildActionRunner.run(ChainingBuildA ctionRunner.java:35) at org.gradle.launcher.exec.InProcessBuildActionExecuter.execute(InProce ssBuildActionExecuter.java:48) at org.gradle.launcher.exec.InProcessBuildActionExecuter.execute(InProce ssBuildActionExecuter.java:30) at org.gradle.launcher.exec.ContinuousBuildActionExecuter.execute(Contin uousBuildActionExecuter.java:81) at org.gradle.launcher.exec.ContinuousBuildActionExecuter.execute(Contin uousBuildActionExecuter.java:46) at org.gradle.launcher.exec.DaemonUsageSuggestingBuildActionExecuter.exe cute(DaemonUsageSuggestingBuildActionExecuter.java:51) at org.gradle.launcher.exec.DaemonUsageSuggestingBuildActionExecuter.exe cute(DaemonUsageSuggestingBuildActionExecuter.java:28) at org.gradle.launcher.cli.RunBuildAction.run(RunBuildAction.java:43) at org.gradle.internal.Actions$RunnableActionAdapter.execute(Actions.jav a:173) at org.gradle.launcher.cli.CommandLineActionFactory$ParseAndBuildAction. execute(CommandLineActionFactory.java:239) at org.gradle.launcher.cli.CommandLineActionFactory$ParseAndBuildAction. execute(CommandLineActionFactory.java:212) at org.gradle.launcher.cli.JavaRuntimeValidationAction.execute(JavaRunti meValidationAction.java:35) at org.gradle.launcher.cli.JavaRuntimeValidationAction.execute(JavaRunti meValidationAction.java:24) at org.gradle.launcher.cli.ExceptionReportingAction.execute(ExceptionRep ortingAction.java:33) at org.gradle.launcher.cli.ExceptionReportingAction.execute(ExceptionRep ortingAction.java:22) at org.gradle.launcher.cli.CommandLineActionFactory$WithLogging.execute( CommandLineActionFactory.java:205) at org.gradle.launcher.cli.CommandLineActionFactory$WithLogging.execute( CommandLineActionFactory.java:169) at org.gradle.launcher.Main.doAction(Main.java:33) at org.gradle.launcher.bootstrap.EntryPoint.run(EntryPoint.java:45) at org.gradle.launcher.bootstrap.ProcessBootstrap.runNoExit(ProcessBoots trap.java:55) at org.gradle.launcher.bootstrap.ProcessBootstrap.run(ProcessBootstrap.j ava:36) at org.gradle.launcher.GradleMain.main(GradleMain.java:23) BUILD FAILED Total time: 2.465 secs
android studio 多渠道打包报错
* What went wrong: Execution failed for task ':项目名:shrinkGuanwangReleaseMultiDexComponents'. > java.io.IOException: Can't read [D:\wanxiaoStudio\-2.5\build\intermediates\classes-proguard\guanwang\release\classes.jar] (Unexpected end of ZLIB input stream) * Try: Run with --stacktrace option to get the stack trace. Run with --info or --debug option to get more log output. BUILD FAILED
android studio 3.0 preview 创建添加C支持的项目时报错
错误如下: Build command failed. Error while executing process D:\Android\AndroidSDK\cmake\3.6.4111459\bin\cmake.exe with arguments {-HD:\Android\MyProject\TestC\app -BD:\Android\MyProject\TestC\app\.externalNativeBuild\cmake\release\armeabi -GAndroid Gradle - Ninja -DANDROID_ABI=armeabi -DANDROID_NDK=D:\Android\AndroidSDK\ndk-bundle -DCMAKE_LIBRARY_OUTPUT_DIRECTORY=D:\Android\MyProject\TestC\app\build\intermediates\cmake\release\obj\armeabi -DCMAKE_BUILD_TYPE=Release -DCMAKE_MAKE_PROGRAM=D:\Android\AndroidSDK\cmake\3.6.4111459\bin\ninja.exe -DCMAKE_TOOLCHAIN_FILE=D:\Android\AndroidSDK\ndk-bundle\build\cmake\android.toolchain.cmake -DANDROID_PLATFORM=android-15 -DCMAKE_CXX_FLAGS=-std=c++11 -frtti -fexceptions} -- Check for working C compiler: D:/Android/AndroidSDK/ndk-bundle/toolchains/llvm/prebuilt/windows-x86_64/bin/clang.exe -- Check for working C compiler: D:/Android/AndroidSDK/ndk-bundle/toolchains/llvm/prebuilt/windows-x86_64/bin/clang.exe -- broken CMake Error at D:/Android/AndroidSDK/cmake/3.6.4111459/share/cmake-3.6/Modules/CMakeTestCCompiler.cmake:61 (message): The C compiler "D:/Android/AndroidSDK/ndk-bundle/toolchains/llvm/prebuilt/windows-x86_64/bin/clang.exe" is not able to compile a simple test program. It fails with the following output: Change Dir: D:/Android/MyProject/TestC/app/.externalNativeBuild/cmake/release/armeabi/CMakeFiles/CMakeTmp Run Build Command:"D:\Android\AndroidSDK\cmake\3.6.4111459\bin\ninja.exe" "cmTC_80963" [1/2] Building C object CMakeFiles/cmTC_80963.dir/testCCompiler.c.o [2/2] Linking C executable cmTC_80963 ninja: fatal: CreateProcess: ����IJ�����Ҫ������ CMake will not be able to correctly generate this project. Call Stack (most recent call first): CMakeLists.txt -- Configuring incomplete, errors occurred! See also "D:/Android/MyProject/TestC/app/.externalNativeBuild/cmake/release/armeabi/CMakeFiles/CMakeOutput.log". See also "D:/Android/MyProject/TestC/app/.externalNativeBuild/cmake/release/armeabi/CMakeFiles/CMakeError.log".那些乱码是“请求的操作需要提升”有谁知道这是这么回事么?
android studio 发布ap失败 求大神!
报错如下: Error:Failed to run command: D:\Program Files\Android\android-sdk\build-tools\20.0.0\aapt.exe s -i C:\Users\Administrator\AndroidstudioProjects\EBook21\app\src\main\res\drawable-hdpi\start.png -o C:\Users\Administrator\AndroidstudioProjects\EBook21\app\build\intermediates\res\release\drawable-hdpi-v4\start.png Error Code: 42 Output: libpng error: Not a PNG file :app:mergeReleaseResources FAILED Error:Execution failed for task ':app:mergeReleaseResources'. > Error: Failed to run command: D:\Program Files\Android\android-sdk\build-tools\20.0.0\aapt.exe s -i C:\Users\Administrator\AndroidstudioProjects\EBook21\app\src\main\res\drawable-hdpi\start.png -o C:\Users\Administrator\AndroidstudioProjects\EBook21\app\build\intermediates\res\release\drawable-hdpi-v4\start.png Error Code: 42 Output: libpng error: Not a PNG file 是什么意思?我删掉build文件夹,重新发布,依旧报这个错 哪位大神好心指导一下。。。
Android Studio debug cocos2d-x工程,成功编译后,报错无法进虚拟机
``` ……以上编译内容省略 :AnimalPlanet:assembleDebug Skipping task ':AnimalPlanet:assembleDebug' as it has no actions. :AnimalPlanet:assembleDebug UP-TO-DATE :AnimalPlanet:assembleDebug (Thread[Task worker for ':' Thread 3,5,main]) completed. Took 0.001 secs. BUILD SUCCESSFUL in 1s 51 actionable tasks: 1 executed, 50 up-to-date Traceback (most recent call last): File "D:\environment\cocos2d-x-3.13.1\tools\cocos2d-console\bin\/cocos.py", line 998, in <module> run_plugin(command, argv, plugins) File "D:\environment\cocos2d-x-3.13.1\tools\cocos2d-console\bin\/cocos.py", line 916, in run_plugin plugin.run(argv, dependencies_objects) File "D:\environment\cocos2d-x-3.13.1\tools\cocos2d-console\plugins\plugin_compile\project_compile.py", line 1546, in run self.build_android() File "D:\environment\cocos2d-x-3.13.1\tools\cocos2d-console\plugins\plugin_compile\project_compile.py", line 527, in build_android self.apk_path = builder.do_build_apk(build_mode, self._no_apk, output_dir, self._custom_step_args, self) File "D:\environment\cocos2d-x-3.13.1\tools\cocos2d-console\plugins\plugin_compile\build_android.py", line 462, in do_build_apk shutil.copy(gen_apk_path, output_dir) File "C:\Python27\lib\shutil.py", line 119, in copy copyfile(src, dst) File "C:\Python27\lib\shutil.py", line 82, in copyfile with open(src, 'rb') as fsrc: IOError: [Errno 2] No such file or directory: 'D:\\work\\AnimalPlanet-_Iran\\proj.android-studio\\app/build/outputs/apk\\AnimalPlanet-debug.apk' Process finished with exit code 1 ``` 如果单处APK没问题,但这样没法调试Java部分(sdk接入),着急啊,感谢有经营的大神指点。
react-native run-android报错ould not resolve all artifacts for configuration ':classpath'.
首次使用react native出现以下错误,但是 com.android.tools.build:gradle:3.3.0在我其他项目上是可以使用的
在中国程序员是青春饭吗?
今年,我也32了 ,为了不给大家误导,咨询了猎头、圈内好友,以及年过35岁的几位老程序员……舍了老脸去揭人家伤疤……希望能给大家以帮助,记得帮我点赞哦。 目录: 你以为的人生 一次又一次的伤害 猎头界的真相 如何应对互联网行业的「中年危机」 一、你以为的人生 刚入行时,拿着傲人的工资,想着好好干,以为我们的人生是这样的: 等真到了那一天,你会发现,你的人生很可能是这样的: ...
【JSON解析】浅谈JSONObject的使用
简介 在程序开发过程中,在参数传递,函数返回值等方面,越来越多的使用JSON。JSON(JavaScript Object Notation)是一种轻量级的数据交换格式,同时也易于机器解析和生成、易于理解、阅读和撰写,而且Json采用完全独立于语言的文本格式,这使得Json成为理想的数据交换语言。 JSON建构于两种结构: “名称/值”对的集合(A Collection of name/va...
《MySQL 性能优化》之理解 MySQL 体系结构
本文介绍 MySQL 的体系结构,包括物理结构、逻辑结构以及插件式存储引擎。
程序员请照顾好自己,周末病魔差点一套带走我。
程序员在一个周末的时间,得了重病,差点当场去世,还好及时挽救回来了。
一名大专同学的四个问题
【前言】   收到一封来信,赶上各种事情拖了几日,利用今天要放下工作的时机,做个回复。   2020年到了,就以这一封信,作为开年标志吧。 【正文】   您好,我是一名现在有很多困惑的大二学生。有一些问题想要向您请教。   先说一下我的基本情况,高考失利,不想复读,来到广州一所大专读计算机应用技术专业。学校是偏艺术类的,计算机专业没有实验室更不用说工作室了。而且学校的学风也不好。但我很想在计算机领...
复习一周,京东+百度一面,不小心都拿了Offer
京东和百度一面都问了啥,面试官百般刁难,可惜我全会。
Java 14 都快来了,为什么还有这么多人固守Java 8?
从Java 9开始,Java版本的发布就让人眼花缭乱了。每隔6个月,都会冒出一个新版本出来,Java 10 , Java 11, Java 12, Java 13, 到2020年3月份,...
达摩院十大科技趋势发布:2020 非同小可!
【CSDN编者按】1月2日,阿里巴巴发布《达摩院2020十大科技趋势》,十大科技趋势分别是:人工智能从感知智能向认知智能演进;计算存储一体化突破AI算力瓶颈;工业互联网的超融合;机器间大规模协作成为可能;模块化降低芯片设计门槛;规模化生产级区块链应用将走入大众;量子计算进入攻坚期;新材料推动半导体器件革新;保护数据隐私的AI技术将加速落地;云成为IT技术创新的中心 。 新的画卷,正在徐徐展开。...
轻松搭建基于 SpringBoot + Vue 的 Web 商城应用
首先介绍下在本文出现的几个比较重要的概念: 函数计算(Function Compute): 函数计算是一个事件驱动的服务,通过函数计算,用户无需管理服务器等运行情况,只需编写代码并上传。函数计算准备计算资源,并以弹性伸缩的方式运行用户代码,而用户只需根据实际代码运行所消耗的资源进行付费。Fun: Fun 是一个用于支持 Serverless 应用部署的工具,能帮助您便捷地管理函数计算、API ...
讲真,这两个IDE插件,可以让你写出质量杠杠的代码
周末躺在床上看《拯救大兵瑞恩》 周末在闲逛的时候,发现了两个优秀的 IDE 插件,据说可以提高代码的质量,我就安装了一下,试了试以后发现,确实很不错,就推荐给大家。 01、Alibaba Java 代码规范插件 《阿里巴巴 Java 开发手册》,相信大家都不会感到陌生,其 IDEA 插件的下载次数据说达到了 80 万次,我今天又贡献了一次。嘿嘿。 该项目的插件地址: https://github....
Python+OpenCV实时图像处理
目录 1、导入库文件 2、设计GUI 3、调用摄像头 4、实时图像处理 4.1、阈值二值化 4.2、边缘检测 4.3、轮廓检测 4.4、高斯滤波 4.5、色彩转换 4.6、调节对比度 5、退出系统 初学OpenCV图像处理的小伙伴肯定对什么高斯函数、滤波处理、阈值二值化等特性非常头疼,这里给各位分享一个小项目,可通过摄像头实时动态查看各类图像处理的特点,也可对各位调参、测试...
2020年一线城市程序员工资大调查
人才需求 一线城市共发布岗位38115个,招聘120827人。 其中 beijing 22805 guangzhou 25081 shanghai 39614 shenzhen 33327 工资分布 2020年中国一线城市程序员的平均工资为16285元,工资中位数为14583元,其中95%的人的工资位于5000到20000元之间。 和往年数据比较: yea...
为什么猝死的都是程序员,基本上不见产品经理猝死呢?
相信大家时不时听到程序员猝死的消息,但是基本上听不到产品经理猝死的消息,这是为什么呢? 我们先百度搜一下:程序员猝死,出现将近700多万条搜索结果: 搜索一下:产品经理猝死,只有400万条的搜索结果,从搜索结果数量上来看,程序员猝死的搜索结果就比产品经理猝死的搜索结果高了一倍,而且从下图可以看到,首页里面的五条搜索结果,其实只有两条才是符合条件。 所以程序员猝死的概率真的比产品经理大,并不是错...
害怕面试被问HashMap?这一篇就搞定了!
声明:本文以jdk1.8为主! 搞定HashMap 作为一个Java从业者,面试的时候肯定会被问到过HashMap,因为对于HashMap来说,可以说是Java集合中的精髓了,如果你觉得自己对它掌握的还不够好,我想今天这篇文章会非常适合你,至少,看了今天这篇文章,以后不怕面试被问HashMap了 其实在我学习HashMap的过程中,我个人觉得HashMap还是挺复杂的,如果真的想把它搞得明明白...
毕业5年,我问遍了身边的大佬,总结了他们的学习方法
我问了身边10个大佬,总结了他们的学习方法,原来成功都是有迹可循的。
python爬取百部电影数据,我分析出了一个残酷的真相
2019年就这么匆匆过去了,就在前几天国家电影局发布了2019年中国电影市场数据,数据显示去年总票房为642.66亿元,同比增长5.4%;国产电影总票房411.75亿元,同比增长8.65%,市场占比 64.07%;城市院线观影人次17.27亿,同比增长0.64%。 看上去似乎是一片大好对不对?不过作为一名严谨求实的数据分析师,我从官方数据中看出了一点端倪:国产票房增幅都已经高达8.65%了,为什...
推荐10个堪称神器的学习网站
每天都会收到很多读者的私信,问我:“二哥,有什么推荐的学习网站吗?最近很浮躁,手头的一些网站都看烦了,想看看二哥这里有什么新鲜货。” 今天一早做了个恶梦,梦到被老板辞退了。虽然说在我们公司,只有我辞退老板的份,没有老板辞退我这一说,但是还是被吓得 4 点多都起来了。(主要是因为我掌握着公司所有的核心源码,哈哈哈) 既然 4 点多起来,就得好好利用起来。于是我就挑选了 10 个堪称神器的学习网站,推...
这些软件太强了,Windows必装!尤其程序员!
Windows可谓是大多数人的生产力工具,集娱乐办公于一体,虽然在程序员这个群体中都说苹果是信仰,但是大部分不都是从Windows过来的,而且现在依然有很多的程序员用Windows。 所以,今天我就把我私藏的Windows必装的软件分享给大家,如果有一个你没有用过甚至没有听过,那你就赚了????,这可都是提升你幸福感的高效率生产力工具哦! 走起!???? NO、1 ScreenToGif 屏幕,摄像头和白板...
阿里面试,面试官没想到一个ArrayList,我都能跟他扯半小时
我是真的没想到,面试官会这样问我ArrayList。
曾经优秀的人,怎么就突然不优秀了。
职场上有很多辛酸事,很多合伙人出局的故事,很多技术骨干被裁员的故事。说来模板都类似,曾经是名校毕业,曾经是优秀员工,曾经被领导表扬,曾经业绩突出,然而突然有一天,因为种种原因,被裁员了,...
大学四年因为知道了这32个网站,我成了别人眼中的大神!
依稀记得,毕业那天,我们导员发给我毕业证的时候对我说“你可是咱们系的风云人物啊”,哎呀,别提当时多开心啦????,嗯,我们导员是所有导员中最帅的一个,真的???? 不过,导员说的是实话,很多人都叫我大神的,为啥,因为我知道这32个网站啊,你说强不强????,这次是绝对的干货,看好啦,走起来! PS:每个网站都是学计算机混互联网必须知道的,真的牛杯,我就不过多介绍了,大家自行探索,觉得没用的,尽管留言吐槽吧???? 社...
良心推荐,我珍藏的一些Chrome插件
上次搬家的时候,发了一个朋友圈,附带的照片中不小心暴露了自己的 Chrome 浏览器插件之多,于是就有小伙伴评论说分享一下我觉得还不错的浏览器插件。 我下面就把我日常工作和学习中经常用到的一些 Chrome 浏览器插件分享给大家,随便一个都能提高你的“生活品质”和工作效率。 Markdown Here Markdown Here 可以让你更愉快的写邮件,由于支持 Markdown 直接转电子邮...
看完这篇HTTP,跟面试官扯皮就没问题了
我是一名程序员,我的主要编程语言是 Java,我更是一名 Web 开发人员,所以我必须要了解 HTTP,所以本篇文章就来带你从 HTTP 入门到进阶,看完让你有一种恍然大悟、醍醐灌顶的感觉。 最初在有网络之前,我们的电脑都是单机的,单机系统是孤立的,我还记得 05 年前那会儿家里有个电脑,想打电脑游戏还得两个人在一个电脑上玩儿,及其不方便。我就想为什么家里人不让上网,我的同学 xxx 家里有网,每...
史上最全的IDEA快捷键总结
现在Idea成了主流开发工具,这篇博客对其使用的快捷键做了总结,希望对大家的开发工作有所帮助。
阿里程序员写了一个新手都写不出的低级bug,被骂惨了。
这种新手都不会范的错,居然被一个工作好几年的小伙子写出来,差点被当场开除了。
谁是华为扫地僧?
是的,华为也有扫地僧!2020年2月11-12日,“养在深闺人不知”的华为2012实验室扫地僧们,将在华为开发者大会2020(Cloud)上,和大家见面。到时,你可以和扫地僧们,吃一个洋...
AI 没让人类失业,搞 AI 的人先失业了
最近和几个 AI 领域的大佬闲聊 根据他们讲的消息和段子 改编出下面这个故事 如有雷同 都是巧合 1. 老王创业失败,被限制高消费 “这里写我跑路的消息实在太夸张了。” 王葱葱哼笑一下,把消息分享给群里。 阿杰也看了消息,笑了笑。在座几位也都笑了。 王葱葱是个有名的人物,21岁那年以全额奖学金进入 KMU 攻读人工智能博士,累计发表论文 40 余篇,个人技术博客更是成为深度学习领域内风向标。 ...
2020年,冯唐49岁:我给20、30岁IT职场年轻人的建议
点击“技术领导力”关注∆每天早上8:30推送 作者|Mr.K 编辑| Emma 来源|技术领导力(ID:jishulingdaoli) 前天的推文《冯唐:职场人35岁以后,方法论比经验重要》,收到了不少读者的反馈,觉得挺受启发。其实,冯唐写了不少关于职场方面的文章,都挺不错的。可惜大家只记住了“春风十里不如你”、“如何避免成为油腻腻的中年人”等不那么正经的文章。 本文整理了冯...
作为一名大学生,如何在B站上快乐的学习?
B站是个宝,谁用谁知道???? 作为一名大学生,你必须掌握的一项能力就是自学能力,很多看起来很牛X的人,你可以了解下,人家私底下一定是花大量的时间自学的,你可能会说,我也想学习啊,可是嘞,该学习啥嘞,不怕告诉你,互联网时代,最不缺的就是学习资源,最宝贵的是啥? 你可能会说是时间,不,不是时间,而是你的注意力,懂了吧! 那么,你说学习资源多,我咋不知道,那今天我就告诉你一个你必须知道的学习的地方,人称...
立即提问