fatal error: boost/python/numpy.hpp: No such file or directory

哪个大神能解决这个问题,感激不尽!!!

 fatal error: boost/python/numpy.hpp: No such file or directory
Csdn user default icon
上传中...
上传图片
插入图片
抄袭、复制答案,以达到刷声望分或其他目的的行为,在CSDN问答是严格禁止的,一经发现立刻封号。是时候展现真正的技术了!
其他相关推荐
fatal error: boost/python.hpp: No such file or directory
本来想将crf装到Python3版本下面,所以把之前的Python2.7给卸载了,但它只能在Python2上运行,之后又照网上的方法把它安装好了,但是又出现了下面的错误: ``` fatal error: boost/python.hpp: No such file or directory ``` 不知道如何解决,崩溃...... 求大神解答......
make编译报错:fatal error: gnu/stubs-64.h:
CentOS7安装编译unixbench工具,执行make编译时候报错: In file included from /usr/include/features.h:399:0, from /usr/include/string.h:27, from ./src/arith.c:32: /usr/include/gnu/stubs.h:10:27: fatal error: gnu/stubs-64.h: 麻烦各路大神帮忙解决下,谢谢!
fatal error C1083: 无法打开包括文件: “opencv2/nonfree/nonfree.hpp”: No such file or directory
fatal error C1083: 无法打开包括文件: “opencv2/nonfree/nonfree.hpp”: No such file or directory vs17 win64 opencv3.1.0 opencv_contrib3.1.0 ![图片说明](https://img-ask.csdn.net/upload/201905/19/1558262541_919613.png)
cocos2d-x移植到安卓 编译时error:sys/syslimits.h:No such file
cygwin下执行./build_native.sh后的错误代码: D:/android-ndk-r8b/platforms/android-8/arch-arm/usr/include/limits.h:89:27: fatal error: sys/syslimits.h: No such file or directory 我查找对应usr/include/sys/下确实没有syslimits.h文件,下了r8b,r8e,r9b版本的NDK对应目录都没有syslimits.h。 我的开发环境:cygwin,win7,ndk r8b,JDK 1.7 求助怎么回事?纠结好几天了 求大神解释下~~
VS2015下stlport编译时error:无法打开包括文件"../include/ctype.h"?
按照http://www.cnblogs.com/emyueguang/p/3881544.html 提供的方法进行了stlport的编译。 我的VS2015安装路径E:\Program Files (x86)\Microsoft Visual Studio 14.0 stlport解压后的路径D:\STLport 之后进行编译时,编译停止 报错 D:\STLport\stlport\ctype.h(39): fatal error C1083: 无法打开包括文件: “../include/ctype.h”: No such file or directory NMAKE : fatal error U1077: “"E:\Program Files (x86)\Microsoft Visual Studio 14.0\VC\BIN\cl.EXE"”: 返回代码“0x2” Stop. ![图片说明](https://img-ask.csdn.net/upload/201903/15/1552580548_118998.png)
.\obj\test.axf: Fatal error: L6002U: Could not open file .\obj\test.o: No such file or directory改了环境变量,用的程序也没错的,求解!!
![图片说明](https://img-ask.csdn.net/upload/201912/22/1577003259_814467.png)
编译ndk-build.cmd生成.so文件中出现这样的问题,不知道哪的原因。
E:\project\CHENWEN\proj.android\jni>ndk-build [armeabi] Compile++ thumb: cocos2dcpp_shared <= main.cpp In file included from D:/android-ndk-r10/sources/cxx-stl/gnu-libstdc++/4.6/inclu de/thread:35:0, from E:/project/CHENWEN/proj.android//jni/../../cocos2d/cocos/3 d/../base/CCConsole.h:42, from E:/project/CHENWEN/proj.android//jni/../../cocos2d/cocos/3 d/../base/ccMacros.h:35, from E:/project/CHENWEN/proj.android//jni/../../cocos2d/cocos/3 d/../base/CCRefPtr.h:30, from E:/project/CHENWEN/proj.android//jni/../../cocos2d/cocos/3 d/../cocos2d.h:42, from E:/project/CHENWEN/proj.android//jni/../../Classes/AppDele gate.h:4, from E:/project/CHENWEN/proj.android//jni/hellocpp/main.cpp:1: D:/android-ndk-r10/sources/cxx-stl/gnu-libstdc++/4.6/include/bits/c++0x_warning. h:32:2: error: #error This file requires compiler and library support for the IS O C++ 2011 standard. This support is currently experimental, and must be enabled with the -std=c++11 or -std=gnu++11 compiler options. In file included from E:/project/CHENWEN/proj.android//jni/../../cocos2d/cocos/3 d/../platform/CCGL.h:36:0, from E:/project/CHENWEN/proj.android//jni/../../cocos2d/cocos/3 d/../base/ccTypes.h:36, from E:/project/CHENWEN/proj.android//jni/../../cocos2d/cocos/3 d/../cocos2d.h:51, from E:/project/CHENWEN/proj.android//jni/../../Classes/AppDele gate.h:4, from E:/project/CHENWEN/proj.android//jni/hellocpp/main.cpp:1: E:/project/CHENWEN/proj.android//jni/../../cocos2d/cocos/3d/../platform/android/ CCGL-android.h:44:31: fatal error: GLES2/gl2platform.h: No such file or director y compilation terminated. make.exe: *** [E:/project/CHENWEN/proj.android//obj/local/armeabi/objs/cocos2dcp p_shared/hellocpp/main.o] Error 1
fatal: open /dev/null or dup failed: No such file
fatal: open /dev/null or dup failed: No such file or directory sh.exe": /dev/null: No such file or directory 1.Win10系统,无法向网上普遍查的修改win7 点击非即插即用驱动程序 2.在C:\Windows\System32位置,找到cmd,以管理员运行cmd,粘贴输入sfc /scannow命令,进行修复操作。 3.下载相同系统的C:\Windows\System32\drivers\null.sys替换也不行。 是git导致出现的这个问题
配置Linux编译环境时出现arm-linux-gnueabihf-gcc: fatal error: no input files问题
按照步骤 下载好arm-linux-gnueabihf-gcc相关文件,改好环境变量 打开控制台输入 arm按tab也会弹出来了 ![图片说明](https://img-ask.csdn.net/upload/201905/25/1558773677_170541.jpg) 但是打开eclipse写一段代码编译时候又弹出错误 ![图片说明](https://img-ask.csdn.net/upload/201905/25/1558773773_740787.jpg) 然后我到控制台试一下 也是同样的问题 ![图片说明](https://img-ask.csdn.net/upload/201905/25/1558773922_399462.jpg)
VS2010 编译出错 无法打开包括文件:“stdio.h”: No such file or directory 1>,还有救吗
VS2010 卸载之后又手动卸载了一些相关组件,重新安装后编译时出错 fatal error C1083: 无法打开包括文件:“stdio.h”: No such file or directory 1>,还有救吗?(新手)是我动了一些不该动的文件夹吗?![图片说明](https://img-ask.csdn.net/upload/201903/09/1552134827_907154.jpg)![图片说明](https://img-ask.csdn.net/upload/201903/09/1552136350_656811.jpg)![图片说明](https://img-ask.csdn.net/upload/201903/09/1552136360_672611.jpg)
centos7.2, PHP安装 Tidy插件编译不成功! 求解决
centos7.2下面安装 Tidy插件编译不成功! 求解决 宝塔环境 报错信息: /libwkhtmltox/tidy-1.2/tidy.c:32:23: fatal error: safe_mode.h: No such file or directory #include "safe_mode.h" ^ compilation terminated. ..... 求大佬指点 在线等..... ![1](https://img-ask.csdn.net/upload/201808/24/1535074780_144639.png) ![2](https://img-ask.csdn.net/upload/201808/24/1535074798_75261.png) ![3](https://img-ask.csdn.net/upload/201808/24/1535074810_145161.png) ![4](https://img-ask.csdn.net/upload/201808/24/1535075089_304000.png) ![5](https://img-ask.csdn.net/upload/201808/24/1535074840_905597.png) ![6](https://img-ask.csdn.net/upload/201808/24/1535074852_718088.png) 到这第六步编辑 就玩不下去了, 也换了其他人的方法及安装包都不行
使用asio(non-boost)库编译出错:包含asio头文件后提示找不到config.hpp
拿到asio(non-boost)的源码后我按照网上查到的资料安装了一下 ``` ./configuer --prefix=/home/asiotest/ --without-boost make make install ``` 在asiotest目录下得到了include文件夹,之后在asiotest目录下创建了一个test.cpp想简单测试一下,test.cpp中只简单的#include了include文件夹下的asio.hpp头文件,然后编译: ``` g++ -std=c++11 -DASIO_STANDALONE -pthread -o main test.cpp ``` 然后编译器报了这个错误 ``` In file included from /usr/src/asio-1.10.8/include/asio.hpp:18:0, from asio_bind.cpp:2: /usr/src/asio-1.10.8/include/asio/async_result.hpp:18:34: fatal error: asio/detail/config.hpp: No such file or directory compilation terminated. ``` 提示找不到asio/detail/config.hpp,但是文件确实在哪个文件夹里 网上说asio只要简单的包含头文件就可以使用,想请教大佬们是我在配置或者编译时哪里弄错了么? 想接触一下这个库 不知道该怎么开始
OpenGL,vs2015运行时,LINK : fatal error LNK1104: 无法打开文件“glfw32.lib”?
网上的好多解决方案都试过了 1、已经在project->linker->input的附加库中添加了 opengl.lib glfw32.lib(然后不行) 2、也试过微软官网的解决方案,OPT(也不行) 大神过来帮帮忙啊,在使用的code链接:https://learnopengl.com/Getting-started/Textures,最后一个code source,中间用到stb_image.h,和Shader_s.h,下面是具体.cpp和.h的链接: https://learnopengl.com/code_viewer_gh.php?code=includes/learnopengl/shader_s.h https://github.com/nothings/stb/blob/master/stb_image.h https://learnopengl.com/code_viewer_gh.php?code=src/1.getting_started/4.1.textures/textures.cpp
求教:vs2017 Cordova打包报错 Could not resolve com.android.to
![图片说明](https://img-ask.csdn.net/upload/201907/14/1563068812_838786.png) **具体错误内容如下:** 1>MSBUILD : cordova-build error : * What went wrong: 1>MSBUILD : cordova-build error : A problem occurred configuring root project 'android'. 1>MSBUILD : cordova-build error : > Could not resolve all dependencies for configuration ':classpath'. 1>MSBUILD : cordova-build error : > Could not resolve com.android.tools.build:gradle:2.1.0. 1>MSBUILD : cordova-build error : Required by: 1>MSBUILD : cordova-build error : :android:unspecified 1>MSBUILD : cordova-build error : > Could not resolve com.android.tools.build:gradle:2.1.0. 1>MSBUILD : cordova-build error : > Could not get resource 'https://repo1.maven.org/maven2/com/android/tools/build/gradle/2.1.0/gradle-2.1.0.pom'. 1>MSBUILD : cordova-build error : > Could not GET 'https://repo1.maven.org/maven2/com/android/tools/build/gradle/2.1.0/gradle-2.1.0.pom'. 1>MSBUILD : cordova-build error : > Received fatal alert: protocol_version 1>MSBUILD : cordova-build error : > Could not resolve com.android.tools.build:gradle:2.1.0. 1>MSBUILD : cordova-build error : > Could not get resource 'https://jcenter.bintray.com/com/android/tools/build/gradle/2.1.0/gradle-2.1.0.pom'. 1>MSBUILD : cordova-build error : > Could not GET 'https://jcenter.bintray.com/com/android/tools/build/gradle/2.1.0/gradle-2.1.0.pom'. 1>MSBUILD : cordova-build error : > Remote host closed connection during handshake 1>MSBUILD : cordova-build error : * Try: 1>MSBUILD : cordova-build error : Run with --stacktrace option to get the stack trace. Run with --info or --debug option to get more log output. Command finished with error code 1: cmd /s /c ""D:\VSCODE\Long.Learun.Framework.7.0.2\Code\Learun.Framework V7.01 pro\Learun.Application.Mobile\platforms\android\gradlew.bat" cdvBuildDebug -b "D:\VSCODE\Long.Learun.Framework.7.0.2\Code\Learun.Framework V7.01 pro\Learun.Application.Mobile\platforms\android\build.gradle" -Dorg.gradle.daemon=true -Pandroid.useDeprecatedNdk=true" 1>MSBUILD : cordova-build error : Error: cmd: Command failed with exit code 1 Error output:
Fatal error: Call to undefined function openssl_decrypt()
服务器的php版本是5.2的(懒得升级,要改太多东西了)* 当前要做小程序获取手机号,用 $result=openssl_decrypt( $aesCipher, "AES-128-CBC", $aesKey, 1, $aesIV); Fatal error: Call to undefined function openssl_decrypt() 就报以上错误。 后来我把openssl扩展也打开了,phpinfo中也能看到。 但仍报这个错,有遇到的朋友不? 难不成要我升级php 版本? 谢谢!! 图: https://img-ask.csdn.net/upload/201810/31/1540916874_664444.png https://img-ask.csdn.net/upload/201810/31/1540916862_214520.png ****
FATAL EXCEPTION: main
01-23 18:51:50.071: E/AndroidRuntime(10954): FATAL EXCEPTION: main 01-23 18:51:50.071: E/AndroidRuntime(10954): Process: com.example.gps1, PID: 10954 01-23 18:51:50.071: E/AndroidRuntime(10954): java.lang.RuntimeException: Unable to start activity ComponentInfo{com.example.gps1/com.example.gps1.MainActivity}: android.content.res.Resources$NotFoundException: Resource ID #0x7f070000 type #0x12 is not valid 01-23 18:51:50.071: E/AndroidRuntime(10954): at android.app.ActivityThread.performLaunchActivity(ActivityThread.java:2187) 01-23 18:51:50.071: E/AndroidRuntime(10954): at android.app.ActivityThread.handleLaunchActivity(ActivityThread.java:2236) 01-23 18:51:50.071: E/AndroidRuntime(10954): at android.app.ActivityThread.access$800(ActivityThread.java:138) 01-23 18:51:50.071: E/AndroidRuntime(10954): at android.app.ActivityThread$H.handleMessage(ActivityThread.java:1199) 01-23 18:51:50.071: E/AndroidRuntime(10954): at android.os.Handler.dispatchMessage(Handler.java:102) 01-23 18:51:50.071: E/AndroidRuntime(10954): at android.os.Looper.loop(Looper.java:136) 01-23 18:51:50.071: E/AndroidRuntime(10954): at android.app.ActivityThread.main(ActivityThread.java:5095) 01-23 18:51:50.071: E/AndroidRuntime(10954): at java.lang.reflect.Method.invokeNative(Native Method) 01-23 18:51:50.071: E/AndroidRuntime(10954): at java.lang.reflect.Method.invoke(Method.java:515) 01-23 18:51:50.071: E/AndroidRuntime(10954): at com.android.internal.os.ZygoteInit$MethodAndArgsCaller.run(ZygoteInit.java:786) 01-23 18:51:50.071: E/AndroidRuntime(10954): at com.android.internal.os.ZygoteInit.main(ZygoteInit.java:602) 01-23 18:51:50.071: E/AndroidRuntime(10954): at dalvik.system.NativeStart.main(Native Method) 01-23 18:51:50.071: E/AndroidRuntime(10954): Caused by: android.content.res.Resources$NotFoundException: Resource ID #0x7f070000 type #0x12 is not valid 01-23 18:51:50.071: E/AndroidRuntime(10954): at android.content.res.Resources.loadXmlResourceParser(Resources.java:2314) 01-23 18:51:50.071: E/AndroidRuntime(10954): at android.content.res.Resources.getLayout(Resources.java:939) 01-23 18:51:50.071: E/AndroidRuntime(10954): at android.view.LayoutInflater.inflate(LayoutInflater.java:395) FATAL EXCEPTION: mainPava.lang.RuntimeException: Unable to start activity ComponentInfo{com.example.gps1/com.example.gps1.MainActivity}: android.content.res.Resources$NotFoundException: Resource ID #0x7f070000
坐等,调用别人写好的JNI报错
错误如下: [armeabi-v7a] Compile++ thumb: hue_core <= NativeServer.cpp In file included from F:/GuohuaLight_JNI//jni/NativeServer.cpp:10:0: F:/GuohuaLight_JNI//jni/event_server.h:13:28: fatal error: android/looper.h: No such file or directory compilation terminated. make.exe: *** [F:/GuohuaLight_JNI//obj/local/armeabi-v7a/objs-debug/hue_core/NativeServer.o] Error 1 导致cpp代码一片红,各种报错;坐等各路大神回答
hexo d部署报错fatal: unable to access... OpenSSL SSL_connect: SSL_ERROR_SYSCALL in connection to github.com:443. Error: Spawn failed
![图片说明](https://img-ask.csdn.net/upload/201911/05/1572956033_106060.png) 问题在弄网页写latex时就出现过,以为是找了个错误教程导致,今天重新把之前的被封复制粘贴过来还是报错,不懂问题出在哪,网上找了一些方法,或者是与自己不同,或者尝试了没用。求大佬出手相救,感激不尽。
fatal exception:main 这个问题出在哪里
![图片说明](https://img-ask.csdn.net/upload/201612/02/1480678244_817374.png) ![图片说明](https://img-ask.csdn.net/upload/201612/02/1480678483_206184.png) ![图片说明](https://img-ask.csdn.net/upload/201612/02/1480678357_690167.png) ![图片说明](https://img-ask.csdn.net/upload/201612/02/1480678584_485157.png) 这个问题出现在哪,代码我是按照书上打一遍的,自己也检查不出错在哪,希望有人解答,谢谢了。
相见恨晚的超实用网站
搞学习 知乎:www.zhihu.com 简答题:http://www.jiandati.com/ 网易公开课:https://open.163.com/ted/ 网易云课堂:https://study.163.com/ 中国大学MOOC:www.icourse163.org 网易云课堂:study.163.com 哔哩哔哩弹幕网:www.bilibili.com 我要自学网:www.51zxw
花了20分钟,给女朋友们写了一个web版群聊程序
参考博客 [1]https://www.byteslounge.com/tutorials/java-ee-html5-websocket-example
爬虫福利二 之 妹子图网MM批量下载
爬虫福利一:27报网MM批量下载    点击 看了本文,相信大家对爬虫一定会产生强烈的兴趣,激励自己去学习爬虫,在这里提前祝:大家学有所成! 目标网站:妹子图网 环境:Python3.x 相关第三方模块:requests、beautifulsoup4 Re:各位在测试时只需要将代码里的变量 path 指定为你当前系统要保存的路径,使用 python xxx.py 或IDE运行即可。
字节跳动视频编解码面经
引言 本文主要是记录一下面试字节跳动的经历。 三四月份投了字节跳动的实习(图形图像岗位),然后hr打电话过来问了一下会不会opengl,c++,shador,当时只会一点c++,其他两个都不会,也就直接被拒了。 七月初内推了字节跳动的提前批,因为内推没有具体的岗位,hr又打电话问要不要考虑一下图形图像岗,我说实习投过这个岗位不合适,不会opengl和shador,然后hr就说秋招更看重基础。我当时
开源一个功能完整的SpringBoot项目框架
福利来了,给大家带来一个福利。 最近想了解一下有关Spring Boot的开源项目,看了很多开源的框架,大多是一些demo或者是一个未成形的项目,基本功能都不完整,尤其是用户权限和菜单方面几乎没有完整的。 想到我之前做的框架,里面通用模块有:用户模块,权限模块,菜单模块,功能模块也齐全了,每一个功能都是完整的。 打算把这个框架分享出来,供大家使用和学习。 为什么用框架? 框架可以学习整体
Java学习的正确打开方式
在博主认为,对于入门级学习java的最佳学习方法莫过于视频+博客+书籍+总结,前三者博主将淋漓尽致地挥毫于这篇博客文章中,至于总结在于个人,实际上越到后面你会发现学习的最好方式就是阅读参考官方文档其次就是国内的书籍,博客次之,这又是一个层次了,这里暂时不提后面再谈。博主将为各位入门java保驾护航,各位只管冲鸭!!!上天是公平的,只要不辜负时间,时间自然不会辜负你。 何谓学习?博主所理解的学习,它
程序员必须掌握的核心算法有哪些?
由于我之前一直强调数据结构以及算法学习的重要性,所以就有一些读者经常问我,数据结构与算法应该要学习到哪个程度呢?,说实话,这个问题我不知道要怎么回答你,主要取决于你想学习到哪些程度,不过针对这个问题,我稍微总结一下我学过的算法知识点,以及我觉得值得学习的算法。这些算法与数据结构的学习大多数是零散的,并没有一本把他们全部覆盖的书籍。下面是我觉得值得学习的一些算法以及数据结构,当然,我也会整理一些看过
Python——画一棵漂亮的樱花树(不同种樱花+玫瑰+圣诞树喔)
最近翻到一篇知乎,上面有不少用Python(大多是turtle库)绘制的树图,感觉很漂亮,我整理了一下,挑了一些我觉得不错的代码分享给大家(这些我都测试过,确实可以生成喔~) one 樱花树 动态生成樱花 效果图(这个是动态的): 实现代码 import turtle as T import random import time # 画樱花的躯干(60,t) def Tree(branch
深深的码丨Java HashMap 透析
HashMap 相关概念 HashTab、HashMap、TreeMap 均以键值对像是存储或操作数据元素。HashTab继承自Dictionary,HashMap、TreeMap继承自AbstractMap,三者均实现Map接口 **HashTab:**同步哈希表,不支持null键或值,因为同步导致性能影响,很少被使用 **HashMap:**应用较多的非同步哈希表,支持null键或值,是键值对...
大学四年自学走来,这些私藏的实用工具/学习网站我贡献出来了
大学四年,看课本是不可能一直看课本的了,对于学习,特别是自学,善于搜索网上的一些资源来辅助,还是非常有必要的,下面我就把这几年私藏的各种资源,网站贡献出来给你们。主要有:电子书搜索、实用工具、在线视频学习网站、非视频学习网站、软件下载、面试/求职必备网站。 注意:文中提到的所有资源,文末我都给你整理好了,你们只管拿去,如果觉得不错,转发、分享就是最大的支持了。 一、电子书搜索 对于大部分程序员...
linux系列之常用运维命令整理笔录
本博客记录工作中需要的linux运维命令,大学时候开始接触linux,会一些基本操作,可是都没有整理起来,加上是做开发,不做运维,有些命令忘记了,所以现在整理成博客,当然vi,文件操作等就不介绍了,慢慢积累一些其它拓展的命令,博客不定时更新 顺便拉下票,我在参加csdn博客之星竞选,欢迎投票支持,每个QQ或者微信每天都可以投5票,扫二维码即可,http://m234140.nofollow.ax.
Python 基础(一):入门必备知识
目录1 标识符2 关键字3 引号4 编码5 输入输出6 缩进7 多行8 注释9 数据类型10 运算符10.1 常用运算符10.2 运算符优先级 1 标识符 标识符是编程时使用的名字,用于给变量、函数、语句块等命名,Python 中标识符由字母、数字、下划线组成,不能以数字开头,区分大小写。 以下划线开头的标识符有特殊含义,单下划线开头的标识符,如:_xxx ,表示不能直接访问的类属性,需通过类提供
程序员接私活怎样防止做完了不给钱?
首先跟大家说明一点,我们做 IT 类的外包开发,是非标品开发,所以很有可能在开发过程中会有这样那样的需求修改,而这种需求修改很容易造成扯皮,进而影响到费用支付,甚至出现做完了项目收不到钱的情况。 那么,怎么保证自己的薪酬安全呢? 我们在开工前,一定要做好一些证据方面的准备(也就是“讨薪”的理论依据),这其中最重要的就是需求文档和验收标准。一定要让需求方提供这两个文档资料作为开发的基础。之后开发
网页实现一个简单的音乐播放器(大佬别看。(⊙﹏⊙))
今天闲着无事,就想写点东西。然后听了下歌,就打算写个播放器。 于是乎用h5 audio的加上js简单的播放器完工了。 欢迎 改进 留言。 演示地点跳到演示地点 html代码如下`&lt;!DOCTYPE html&gt; &lt;html&gt; &lt;head&gt; &lt;title&gt;music&lt;/title&gt; &lt;meta charset="utf-8"&gt
Python十大装B语法
Python 是一种代表简单思想的语言,其语法相对简单,很容易上手。不过,如果就此小视 Python 语法的精妙和深邃,那就大错特错了。本文精心筛选了最能展现 Python 语法之精妙的十个知识点,并附上详细的实例代码。如能在实战中融会贯通、灵活使用,必将使代码更为精炼、高效,同时也会极大提升代码B格,使之看上去更老练,读起来更优雅。 1. for - else 什么?不是 if 和 else 才
数据库优化 - SQL优化
前面一篇文章从实例的角度进行数据库优化,通过配置一些参数让数据库性能达到最优。但是一些“不好”的SQL也会导致数据库查询变慢,影响业务流程。本文从SQL角度进行数据库优化,提升SQL运行效率。 判断问题SQL 判断SQL是否有问题时可以通过两个表象进行判断: 系统级别表象 CPU消耗严重 IO等待严重 页面响应时间过长
2019年11月中国大陆编程语言排行榜
2019年11月2日,我统计了某招聘网站,获得有效程序员招聘数据9万条。针对招聘信息,提取编程语言关键字,并统计如下: 编程语言比例 rank pl_ percentage 1 java 33.62% 2 c/c++ 16.42% 3 c_sharp 12.82% 4 javascript 12.31% 5 python 7.93% 6 go 7.25% 7
通俗易懂地给女朋友讲:线程池的内部原理
餐厅的约会 餐盘在灯光的照耀下格外晶莹洁白,女朋友拿起红酒杯轻轻地抿了一小口,对我说:“经常听你说线程池,到底线程池到底是个什么原理?”我楞了一下,心里想女朋友今天是怎么了,怎么突然问出这么专业的问题,但做为一个专业人士在女朋友面前也不能露怯啊,想了一下便说:“我先给你讲讲我前同事老王的故事吧!” 大龄程序员老王 老王是一个已经北漂十多年的程序员,岁数大了,加班加不动了,升迁也无望,于是拿着手里
经典算法(5)杨辉三角
杨辉三角 是经典算法,这篇博客对它的算法思想进行了讲解,并有完整的代码实现。
腾讯算法面试题:64匹马8个跑道需要多少轮才能选出最快的四匹?
昨天,有网友私信我,说去阿里面试,彻底的被打击到了。问了为什么网上大量使用ThreadLocal的源码都会加上private static?他被难住了,因为他从来都没有考虑过这个问题。无独有偶,今天笔者又发现有网友吐槽了一道腾讯的面试题,我们一起来看看。 腾讯算法面试题:64匹马8个跑道需要多少轮才能选出最快的四匹? 在互联网职场论坛,一名程序员发帖求助到。二面腾讯,其中一个算法题:64匹
面试官:你连RESTful都不知道我怎么敢要你?
面试官:了解RESTful吗? 我:听说过。 面试官:那什么是RESTful? 我:就是用起来很规范,挺好的 面试官:是RESTful挺好的,还是自我感觉挺好的 我:都挺好的。 面试官:… 把门关上。 我:… 要干嘛?先关上再说。 面试官:我说出去把门关上。 我:what ?,夺门而去 文章目录01 前言02 RESTful的来源03 RESTful6大原则1. C-S架构2. 无状态3.统一的接
JDK12 Collectors.teeing 你真的需要了解一下
前言 在 Java 12 里面有个非常好用但在官方 JEP 没有公布的功能,因为它只是 Collector 中的一个小改动,它的作用是 merge 两个 collector 的结果,这句话显得很抽象,老规矩,我们先来看个图(这真是一个不和谐的图????): 管道改造经常会用这个小东西,通常我们叫它「三通」,它的主要作用就是将 downstream1 和 downstre...
为啥国人偏爱Mybatis,而老外喜欢Hibernate/JPA呢?
关于SQL和ORM的争论,永远都不会终止,我也一直在思考这个问题。昨天又跟群里的小伙伴进行了一番讨论,感触还是有一些,于是就有了今天这篇文。 声明:本文不会下关于Mybatis和JPA两个持久层框架哪个更好这样的结论。只是摆事实,讲道理,所以,请各位看官勿喷。 一、事件起因 关于Mybatis和JPA孰优孰劣的问题,争论已经很多年了。一直也没有结论,毕竟每个人的喜好和习惯是大不相同的。我也看
项目中的if else太多了,该怎么重构?
介绍 最近跟着公司的大佬开发了一款IM系统,类似QQ和微信哈,就是聊天软件。我们有一部分业务逻辑是这样的 if (msgType = "文本") { // dosomething } else if(msgType = "图片") { // doshomething } else if(msgType = "视频") { // doshomething } else { // doshom...
致 Python 初学者
欢迎来到“Python进阶”专栏!来到这里的每一位同学,应该大致上学习了很多 Python 的基础知识,正在努力成长的过程中。在此期间,一定遇到了很多的困惑,对未来的学习方向感到迷茫。我非常理解你们所面临的处境。我从2007年开始接触 python 这门编程语言,从2009年开始单一使用 python 应对所有的开发工作,直至今天。回顾自己的学习过程,也曾经遇到过无数的困难,也曾经迷茫过、困惑过。开办这个专栏,正是为了帮助像我当年一样困惑的 Python 初学者走出困境、快速成长。希望我的经验能真正帮到你
“狗屁不通文章生成器”登顶GitHub热榜,分分钟写出万字形式主义大作
一、垃圾文字生成器介绍 最近在浏览GitHub的时候,发现了这样一个骨骼清奇的雷人项目,而且热度还特别高。 项目中文名:狗屁不通文章生成器 项目英文名:BullshitGenerator 根据作者的介绍,他是偶尔需要一些中文文字用于GUI开发时测试文本渲染,因此开发了这个废话生成器。但由于生成的废话实在是太过富于哲理,所以最近已经被小伙伴们给玩坏了。 他的文风可能是这样的: 你发现,...
程序员:我终于知道post和get的区别
是一个老生常谈的话题,然而随着不断的学习,对于以前的认识有很多误区,所以还是需要不断地总结的,学而时习之,不亦说乎
《程序人生》系列-这个程序员只用了20行代码就拿了冠军
你知道的越多,你不知道的越多 点赞再看,养成习惯GitHub上已经开源https://github.com/JavaFamily,有一线大厂面试点脑图,欢迎Star和完善 前言 这一期不算《吊打面试官》系列的,所有没前言我直接开始。 絮叨 本来应该是没有这期的,看过我上期的小伙伴应该是知道的嘛,双十一比较忙嘛,要值班又要去帮忙拍摄年会的视频素材,还得搞个程序员一天的Vlog,还要写BU...
加快推动区块链技术和产业创新发展,2019可信区块链峰会在京召开
11月8日,由中国信息通信研究院、中国通信标准化协会、中国互联网协会、可信区块链推进计划联合主办,科技行者协办的2019可信区块链峰会将在北京悠唐皇冠假日酒店开幕。   区块链技术被认为是继蒸汽机、电力、互联网之后,下一代颠覆性的核心技术。如果说蒸汽机释放了人类的生产力,电力解决了人类基本的生活需求,互联网彻底改变了信息传递的方式,区块链作为构造信任的技术有重要的价值。   1...
程序员把地府后台管理系统做出来了,还有3.0版本!12月7号最新消息:已在开发中有github地址
第一幕:缘起 听说阎王爷要做个生死簿后台管理系统,我们派去了一个程序员…… 996程序员做的梦: 第一场:团队招募 为了应对地府管理危机,阎王打算找“人”开发一套地府后台管理系统,于是就在地府总经办群中发了项目需求。 话说还是中国电信的信号好,地府都是满格,哈哈!!! 经常会有外行朋友问:看某网站做的不错,功能也简单,你帮忙做一下? 而这次,面对这样的需求,这个程序员...
相关热词 如何提升c#开发能力 矩阵乘法c# c#调用谷歌浏览器 c# 去空格去转义符 c#用户登录窗体代码 c# 流 c# linux 可视化 c# mvc 返回图片 c# 像素空间 c# 日期 最后一天
立即提问

相似问题

1
使用git clone出现这个问题怎么解决
0
分布式项目maven bulid出错求大神解决???
3
VS2010 编译出错 无法打开包括文件:“stdio.h”: No such file or directory 1>,还有救吗
0
在VS2.17配置PCL1.9.0,出现 LINK : fatal error LNK1181: 无法打开输入文件“cmake.obj”
0
VS2015下stlport编译时error:无法打开包括文件"../include/ctype.h"?
2
git各种方式拉取gitlab中的项目都报错?
0
在Linux服务器上配置python(无root权限),make pycaffe出现问题。
1
flume开启报错java.lang.SecurityException: sealing violation: package org.apache.flume.conf is sealed
1
fatal error C1083: 无法打开包括文件: “opencv2/nonfree/nonfree.hpp”: No such file or directory
2
配置Linux编译环境时出现arm-linux-gnueabihf-gcc: fatal error: no input files问题
1
LINK : fatal error LNK1104: cannot open file "APS_168.lib"
0
linux环境下测试mysql.php文件报错:调用未定义的函数mysql_connect()。
2
求教:vs2017 Cordova打包报错 Could not resolve com.android.to
1
thinkPHP5.1 报错未找到控制器 ?
1
ubuntu16.04下载PX4出现问题如下:
1
java.lang。RuntimeException:无法启动活动.
1
这是一个关于C语言多文件的问题
1
hexo d部署报错fatal: unable to access... OpenSSL SSL_connect: SSL_ERROR_SYSCALL in connection to github.com:443. Error: Spawn failed
1
fatal error: boost/python.hpp: No such file or directory
1
wolfssl 移植到liteos下执行到wolfSSL_connect时报错:wolfSSL error occurred, error = 111 line:11221 file:src/ssl.c