ubuntu18.04 python3.6 pip安装mysqlclient报错

ubuntu18.04 python3.6 pip安装mysqlclient报错
求大佬解答

Building wheels for collected packages: mysqlclient
  Running setup.py bdist_wheel for mysqlclient ... error
  Complete output from command /usr/bin/python3 -u -c "import setuptools, tokenize;__file__='/tmp/pip-build-njxuuzpo/mysqlclient/setup.py';f=getattr(tokenize, 'open', open)(__file__);code=f.read().replace('\r\n', '\n');f.close();exec(compile(code, __file__, 'exec'))" bdist_wheel -d /tmp/tmpzs54ny_2pip-wheel- --python-tag cp36:
  running bdist_wheel
  running build
  running build_py
  creating build
  creating build/lib.linux-x86_64-3.6
  creating build/lib.linux-x86_64-3.6/MySQLdb
  copying MySQLdb/__init__.py -> build/lib.linux-x86_64-3.6/MySQLdb
  copying MySQLdb/_exceptions.py -> build/lib.linux-x86_64-3.6/MySQLdb
  copying MySQLdb/compat.py -> build/lib.linux-x86_64-3.6/MySQLdb
  copying MySQLdb/connections.py -> build/lib.linux-x86_64-3.6/MySQLdb
  copying MySQLdb/converters.py -> build/lib.linux-x86_64-3.6/MySQLdb
  copying MySQLdb/cursors.py -> build/lib.linux-x86_64-3.6/MySQLdb
  copying MySQLdb/release.py -> build/lib.linux-x86_64-3.6/MySQLdb
  copying MySQLdb/times.py -> build/lib.linux-x86_64-3.6/MySQLdb
  creating build/lib.linux-x86_64-3.6/MySQLdb/constants
  copying MySQLdb/constants/__init__.py -> build/lib.linux-x86_64-3.6/MySQLdb/constants
  copying MySQLdb/constants/CLIENT.py -> build/lib.linux-x86_64-3.6/MySQLdb/constants
  copying MySQLdb/constants/CR.py -> build/lib.linux-x86_64-3.6/MySQLdb/constants
  copying MySQLdb/constants/ER.py -> build/lib.linux-x86_64-3.6/MySQLdb/constants
  copying MySQLdb/constants/FIELD_TYPE.py -> build/lib.linux-x86_64-3.6/MySQLdb/constants
  copying MySQLdb/constants/FLAG.py -> build/lib.linux-x86_64-3.6/MySQLdb/constants
  running build_ext
  building 'MySQLdb._mysql' extension
  creating build/temp.linux-x86_64-3.6
  creating build/temp.linux-x86_64-3.6/MySQLdb
  x86_64-linux-gnu-gcc -pthread -DNDEBUG -g -fwrapv -O2 -Wall -g -fstack-protector-strong -Wformat -Werror=format-security -Wdate-time -D_FORTIFY_SOURCE=2 -fPIC -Dversion_info=(1,4,5,'final',0) -D__version__=1.4.5 -I/usr/include/mysql -I/usr/include/python3.6m -c MySQLdb/_mysql.c -o build/temp.linux-x86_64-3.6/MySQLdb/_mysql.o
  x86_64-linux-gnu-gcc -pthread -shared -Wl,-O1 -Wl,-Bsymbolic-functions -Wl,-Bsymbolic-functions -Wl,-z,relro -Wl,-Bsymbolic-functions -Wl,-z,relro -g -fstack-protector-strong -Wformat -Werror=format-security -Wdate-time -D_FORTIFY_SOURCE=2 build/temp.linux-x86_64-3.6/MySQLdb/_mysql.o -lmysqlclient -lpthread -lz -lm -lrt -latomic -lssl -lcrypto -ldl -o build/lib.linux-x86_64-3.6/MySQLdb/_mysql.cpython-36m-x86_64-linux-gnu.so
  /usr/bin/ld: cannot find -lssl
  /usr/bin/ld: cannot find -lcrypto
  collect2: error: ld returned 1 exit status
  error: command 'x86_64-linux-gnu-gcc' failed with exit status 1

  ----------------------------------------
  Failed building wheel for mysqlclient
  Running setup.py clean for mysqlclient
Failed to build mysqlclient
Installing collected packages: mysqlclient
  Running setup.py install for mysqlclient ... error
    Complete output from command /usr/bin/python3 -u -c "import setuptools, tokenize;__file__='/tmp/pip-build-njxuuzpo/mysqlclient/setup.py';f=getattr(tokenize, 'open', open)(__file__);code=f.read().replace('\r\n', '\n');f.close();exec(compile(code, __file__, 'exec'))" install --record /tmp/pip-ldoqhl56-record/install-record.txt --single-version-externally-managed --compile --user --prefix=:
    running install
    running build
    running build_py
    creating build
    creating build/lib.linux-x86_64-3.6
    creating build/lib.linux-x86_64-3.6/MySQLdb
    copying MySQLdb/__init__.py -> build/lib.linux-x86_64-3.6/MySQLdb
    copying MySQLdb/_exceptions.py -> build/lib.linux-x86_64-3.6/MySQLdb
    copying MySQLdb/compat.py -> build/lib.linux-x86_64-3.6/MySQLdb
    copying MySQLdb/connections.py -> build/lib.linux-x86_64-3.6/MySQLdb
    copying MySQLdb/converters.py -> build/lib.linux-x86_64-3.6/MySQLdb
    copying MySQLdb/cursors.py -> build/lib.linux-x86_64-3.6/MySQLdb
    copying MySQLdb/release.py -> build/lib.linux-x86_64-3.6/MySQLdb
    copying MySQLdb/times.py -> build/lib.linux-x86_64-3.6/MySQLdb
    creating build/lib.linux-x86_64-3.6/MySQLdb/constants
    copying MySQLdb/constants/__init__.py -> build/lib.linux-x86_64-3.6/MySQLdb/constants
    copying MySQLdb/constants/CLIENT.py -> build/lib.linux-x86_64-3.6/MySQLdb/constants
    copying MySQLdb/constants/CR.py -> build/lib.linux-x86_64-3.6/MySQLdb/constants
    copying MySQLdb/constants/ER.py -> build/lib.linux-x86_64-3.6/MySQLdb/constants
    copying MySQLdb/constants/FIELD_TYPE.py -> build/lib.linux-x86_64-3.6/MySQLdb/constants
    copying MySQLdb/constants/FLAG.py -> build/lib.linux-x86_64-3.6/MySQLdb/constants
    running build_ext
    building 'MySQLdb._mysql' extension
    creating build/temp.linux-x86_64-3.6
    creating build/temp.linux-x86_64-3.6/MySQLdb
    x86_64-linux-gnu-gcc -pthread -DNDEBUG -g -fwrapv -O2 -Wall -g -fstack-protector-strong -Wformat -Werror=format-security -Wdate-time -D_FORTIFY_SOURCE=2 -fPIC -Dversion_info=(1,4,5,'final',0) -D__version__=1.4.5 -I/usr/include/mysql -I/usr/include/python3.6m -c MySQLdb/_mysql.c -o build/temp.linux-x86_64-3.6/MySQLdb/_mysql.o
    x86_64-linux-gnu-gcc -pthread -shared -Wl,-O1 -Wl,-Bsymbolic-functions -Wl,-Bsymbolic-functions -Wl,-z,relro -Wl,-Bsymbolic-functions -Wl,-z,relro -g -fstack-protector-strong -Wformat -Werror=format-security -Wdate-time -D_FORTIFY_SOURCE=2 build/temp.linux-x86_64-3.6/MySQLdb/_mysql.o -lmysqlclient -lpthread -lz -lm -lrt -latomic -lssl -lcrypto -ldl -o build/lib.linux-x86_64-3.6/MySQLdb/_mysql.cpython-36m-x86_64-linux-gnu.so
    /usr/bin/ld: cannot find -lssl
    /usr/bin/ld: cannot find -lcrypto
    collect2: error: ld returned 1 exit status
    error: command 'x86_64-linux-gnu-gcc' failed with exit status 1

    ----------------------------------------
Command "/usr/bin/python3 -u -c "import setuptools, tokenize;__file__='/tmp/pip-build-njxuuzpo/mysqlclient/setup.py';f=getattr(tokenize, 'open', open)(__file__);code=f.read().replace('\r\n', '\n');f.close();exec(compile(code, __file__, 'exec'))" install --record /tmp/pip-ldoqhl56-record/install-record.txt --single-version-externally-managed --compile --user --prefix=" failed with error code 1 in /tmp/pip-build-njxuuzpo/mysqlclient/

1个回答

我也遇到这个问题,搞了大半个晚上。我是参照这个链接解决的:https://www.cnblogs.com/BambooEatPanda/p/11076778.html
先去/usr/bin下面查找有没有libssl.so文件(我的是没有的),然后输入apt-get install libssl-dev 下载完成后就能安装mysqlclient了。你可以试试。

Csdn user default icon
上传中...
上传图片
插入图片
抄袭、复制答案,以达到刷声望分或其他目的的行为,在CSDN问答是严格禁止的,一经发现立刻封号。是时候展现真正的技术了!
其他相关推荐
关于Mac下python pip版本问题以及pycharm安装python第三方库失败问题
我的电脑是mac 10.15版本 目前有两个python: 1. 系统自带Python 2.7.16 2. 自己安装python Python 3.7.3 在终端查询pip版本,结果是2.7的那个: pip 19.3.1 from /Library/Python/2.7/site-packages/pip (python 2.7) 查询pip3,结果显示错误: xcrun: error: invalid active developer path (/Library/Developer/CommandLineTools), missing xcrun at: /Library/Developer/CommandLineTools/usr/bin/xcrun 好像问题就是在这里,我在终端用 pip install 安装python第三方库的时候总会有问题,提示pip版本过低,我想更新pip又会失败;或者根本无法安装。 然后我就选择从pycharm上搜索第三方库并安装,奇怪的是有的库可以成功安装,有的库安装失败并提示说pip版本过低,让我尝试从终端安装,可是从终端安装的话又会遇到之前的问题。 请问这个该怎么解决?
关于python安装pymssql报错,求大神指点,在ubuntu14.04下
报错内容: ``` (pyenvdata)lin@lin-ThinkPad:~$ pip install pymssql Downloading/unpacking pymssql Downloading pymssql-2.1.1.tar.gz (2.4MB): 2.4MB downloaded Running setup.py (path:/home/lin/pyenvdata/build/pymssql/setup.py) egg_info for package pymssql setup.py: platform.system() => 'Linux' setup.py: platform.architecture() => ('64bit', 'ELF') setup.py: platform.linux_distribution() => ('Ubuntu', '14.04', 'trusty') setup.py: platform.libc_ver() => ('glibc', '2.4') setup.py: Not using bundled FreeTDS setup.py: include_dirs = ['/usr/local/include'] setup.py: library_dirs = ['/usr/local/lib'] Installed /home/lin/pyenvdata/build/pymssql/setuptools_git-1.1-py2.7.egg Installing collected packages: pymssql Running setup.py install for pymssql setup.py: platform.system() => 'Linux' setup.py: platform.architecture() => ('64bit', 'ELF') setup.py: platform.linux_distribution() => ('Ubuntu', '14.04', 'trusty') setup.py: platform.libc_ver() => ('glibc', '2.4') setup.py: Not using bundled FreeTDS setup.py: include_dirs = ['/usr/local/include'] setup.py: library_dirs = ['/usr/local/lib'] building '_mssql' extension x86_64-linux-gnu-gcc -pthread -fno-strict-aliasing -DNDEBUG -g -fwrapv -O2 -Wall -Wstrict-prototypes -fPIC -I/usr/local/include -I/usr/include/python2.7 -c _mssql.c -o build/temp.linux-x86_64-2.7/_mssql.o -DMSDBLIB _mssql.c:314:22: fatal error: sqlfront.h: 没有那个文件或目录 #include "sqlfront.h" ^ compilation terminated. error: command 'x86_64-linux-gnu-gcc' failed with exit status 1 Complete output from command /home/lin/pyenvdata/bin/python -c "import setuptools, tokenize;__file__='/home/lin/pyenvdata/build/pymssql/setup.py';exec(compile(getattr(tokenize, 'open', open)(__file__).read().replace('\r\n', '\n'), __file__, 'exec'))" install --record /tmp/pip-c75p_h-record/install-record.txt --single-version-externally-managed --compile --install-headers /home/lin/pyenvdata/include/site/python2.7: setup.py: platform.system() => 'Linux' setup.py: platform.architecture() => ('64bit', 'ELF') setup.py: platform.linux_distribution() => ('Ubuntu', '14.04', 'trusty') setup.py: platform.libc_ver() => ('glibc', '2.4') setup.py: Not using bundled FreeTDS setup.py: include_dirs = ['/usr/local/include'] setup.py: library_dirs = ['/usr/local/lib'] running install running build running build_ext building '_mssql' extension creating build creating build/temp.linux-x86_64-2.7 x86_64-linux-gnu-gcc -pthread -fno-strict-aliasing -DNDEBUG -g -fwrapv -O2 -Wall -Wstrict-prototypes -fPIC -I/usr/local/include -I/usr/include/python2.7 -c _mssql.c -o build/temp.linux-x86_64-2.7/_mssql.o -DMSDBLIB _mssql.c:314:22: fatal error: sqlfront.h: 没有那个文件或目录 #include "sqlfront.h" ^ compilation terminated. error: command 'x86_64-linux-gnu-gcc' failed with exit status 1 ---------------------------------------- Cleaning up... Command /home/lin/pyenvdata/bin/python -c "import setuptools, tokenize;__file__='/home/lin/pyenvdata/build/pymssql/setup.py';exec(compile(getattr(tokenize, 'open', open)(__file__).read().replace('\r\n', '\n'), __file__, 'exec'))" install --record /tmp/pip-c75p_h-record/install-record.txt --single-version-externally-managed --compile --install-headers /home/lin/pyenvdata/include/site/python2.7 failed with error code 1 in /home/lin/pyenvdata/build/pymssql Traceback (most recent call last): File "/home/lin/pyenvdata/bin/pip", line 11, in <module> sys.exit(main()) File "/home/lin/pyenvdata/local/lib/python2.7/site-packages/pip/__init__.py", line 185, in main return command.main(cmd_args) File "/home/lin/pyenvdata/local/lib/python2.7/site-packages/pip/basecommand.py", line 161, in main text = '\n'.join(complete_log) UnicodeDecodeError: 'ascii' codec can't decode byte 0xe6 in position 46: ordinal not in range(128) ```
关于centos6.8 安装python3.5.2 关于pip的问题
centos内默认有python2.6,后来新安装python3.5.2版本,(不是覆盖安装,原有Python2.6继续保留),问题:新版本的python pip如何安装,还是用原有老版本python2.6 中的pip? 2.pip安装的模块一般路径在哪里,可否改变安装路径,如何处理? 感谢阅读!
python3.7配置了pip,安装3.7对应的pygame一直安装不成功显示找不到对应是什么问题?
如图一,python3.7配置了pip19.3.1,安装3.7对应的pygame一直安装不成功,提示找不到对应版本,求教下这个怎么解决?![图片说明](https://img-ask.csdn.net/upload/201912/02/1575216297_77750.png) 使用powershell配置,结果如下: ![图片说明](https://img-ask.csdn.net/upload/201912/02/1575216352_197983.png)
如何在django中使用mysql自带的MySQL Connector Python 8.0 for Python 3.7?
django连接mysql提示 django.core.exceptions.ImproperlyConfigured: Error loading MySQLdb module. Did you install mysqlclient? 也就是说要我pip install mysqlclient 可我安装mysql的时候自带MySQL Connector Python 8.0 for Python 3.7 C:\Program Files\MySQL\MySQL Connector Python 8.0 for Python 3.7 也就是说我只要告诉django连接mysql用这个目录里的文件就好了... 可我怎么才能让django知道这件事...
ubuntu19.04 用pip安装pygame 出错 请大神请教
![图片说明](https://img-ask.csdn.net/upload/201906/09/1560070283_259700.png)
python3.6安装pypsa包时报错,无法安装。
在使用pip install pypsa,安装报错如下![图片说明](https://img-ask.csdn.net/upload/201910/15/1571110476_72432.png)![图片说明](https://img-ask.csdn.net/upload/201910/15/1571110486_931164.png) ERROR: Command errored out with exit status 1: command: 'd:\python3\python.exe' 'd:\python3\lib\site-packages\pip\_vendor\pep517\_in_process.py' get_requires_for_build_wheel 'C:\Users\xyrrrr\AppData\Local\Temp\tmpk8s4cp1x' cwd: C:\Users\xyrrrr\AppData\Local\Temp\pip-install-y9r5hyt9\cartopy Complete output (3 lines): setup.py:171: UserWarning: Unable to determine GEOS version. Ensure you have 3.3.3 or later installed, or installation may fail. '.'.join(str(v) for v in GEOS_MIN_VERSION), )) Proj 4.9.0 must be installed. ---------------------------------------- ERROR: Command errored out with exit status 1: 'd:\python3\python.exe' 'd:\python3\lib\site-packages\pip\_vendor\pep517\_in_process.py' get_requires_for_build_wheel 'C:\Users\xyrrrr\AppData\Local\Temp\tmpk8s4cp1x' Check the logs for full command output. 查了很多,真的不懂如何解决,小白求专业人士帮助!谢谢。 一天也没解决,我就是一个刚下载python的小白 饶了我吧
各位朋友好,请教ubuntu系统python3.4环境下安装matplotlib报错的解决办法
具体的问题是这样的: 我的系统是Ubuntu14.04 的64位系统,python3.4版本下,想使用matplotlib来做图。 由于matplotlib依赖numpy和python的图像库PIL,因此我先安装numpy和PIL然后,再安装matplotlib, 这里附上我的安装matplotlib的shell命令 #安装科学计算库numpy sudo pip3 install numpy #安装图像处理库PIL sudo apt-get install python3.4-dev -y sudo apt-get install libjpeg8-dev zlib1g-dev libfreetype6-dev -y sudo ln -s /usr/lib/x86_64-linux-gnu/libjpeg.so /usr/lib sudo ln -s /usr/lib/x86_64-linux-gnu/libfreetype.so /usr/lib sudo ln -s /usr/lib/x86_64-linux-gnu/libz.so /usr/lib sudo apt-get install python3-pil #安装画图库matplotlib sudo pip3 install matplotlib 但是发现虽然安装成功(在python3的shell交互环境下, import matplotlib 是可以的),但是 执行如下语句 from matplotlib import pyplot as plt 报错: "/usr/local/lib/python3.4/dist-packages/matplotlib-1.5.1-py3.4-linux-x86_64.egg/matplotlib/backends/backend_gtk3.py", line 58, in <module> cursors.MOVE : Gdk.Cursor.new(Gdk.CursorType.FLEUR), TypeError: constructor returned NULL 希望各位朋友能指点一下,十分感谢
centos7.2下安装python-pip的问题
Error: Package: python-pip-7.1.0-1.el6.noarch (epel) Requires: python(abi) = 2.6 Installed: python-2.7.5-48.el7.x86_64 (@base) python(abi) = 2.7 python(abi) = 2.7 Available: python34-3.4.5-2.el6.i686 (epel) python(abi) = 3.4 You could try using --skip-broken to work around the problem You could try running: rpm -Va --nofiles --nodigest 麻烦哪位大神给讲一下,安装时报了这个错误怎么解决
python3.7 安装requests报错,求大神支招?
python3.7 通过pip 安装requests 报错,百度上也查过很多方法 1、通过更改源 2、通过wheel安装 3、pip --timout=60000等方式都不能解决 公司每台电脑上都装了赛门铁克(Symantec),会不会与这个有影响。 求详细解决方式 报错如下: ![图片说明](https://img-ask.csdn.net/upload/201906/10/1560136696_190131.jpg) Retrying (Retry(total=4, connect=None, read=None, redirect=None, status=None)) after connection broken by 'ConnectTimeoutError(<pip._vendor.urllib3.connection.VerifiedHTTPSConnection object at 0x0000000003F7B588>, 'Connection to pypi.org timed out. (connect timeout=15)')': /simple/requests/
python的pip工具安装第三方库,在不指定安装版本的情况自动安装兼容已有包的版本?
_在Ubuntu16.04的Python虚拟环境,使用pip工具安装了django-stack,默认安装的是django-stack的最新稳定版本,但是由于版本过新,而我电脑中现有的Django版本并不支持,所以pip在暗转django-stack的时候,自动将我的Django版本更新了;_ ![图片说明](https://img-ask.csdn.net/upload/201908/30/1567138036_161509.png) **请问一下各位大佬,除了制定版本号安装,能不能实现pip的默认安装是安装兼容现有依赖包的,而不是重装的依赖包?**
python使用pip安装multiprocess报错
Windows8下使用pip -install multiprocessing 安装包时报了这个错误,我用的是python3.6,为什么会安装出python2中的包?
新问题:ubuntu下python版本问题
ubuntu原来安装了python3.5, 所以python3指向python3.5,现在又新安装了python3.6, 请问,pyhton3.6的pip怎么调出来使用,使用什么指令?pip3是python3.5的pip 非常感谢!!!
Pyltp有没有适用于python3.8的版本
我在构建知识图谱的时候想使用Pyltp,用pip直接安装会报错,于是想直接下载,想请教一下各位大佬Pyltp有没有适用于python3.8的版本,还是说pyltp0.2.1就可以适用
Windows命令行启动ride.py报错。
Win10,64位,Python版本3.8.1, pip 19.3.1 Pypubsub 4.0.3 pywin32 227 requests 2.22.0 robotframework 3.1.2 robotframework-ride 1.7.4 setuptools 41.2.0 wxPython 4.1.0a1.dev4523+46bae17a 出现的情况是:用命令行python ride.py启动就如图报错; 直接双击ride.py会有一个空白的命令行窗口闪一下,然后就没反应了。 这个报错图上面还有蛮长的一段,内容都是<class 'robotide.preferences.configobj.UnreprError'> Parse error in value at lineXX这种。 ![图片说明](https://img-ask.csdn.net/upload/202001/12/1578762599_139263.png) 还请大佬能为我答疑解惑。
为什么用pip安装的库有的可以直接在终端用命令执行?
1.如题,在终端用pip安装一些第三方库,有些是需要进入python中,使用import该第三方库进行使用;另外有一种是用pip安装第三方库之后,直接在终端输入相关命令使用该第三方库,此时该三方库犹如一条命令,其中一些完美的库里还附带使用说明,查看该第三方库的使用说明,这是怎么做到的? 2.例如用pip安装TensorFlow深度学习框架下的tensorboard后,可以在命令行使用tensorbord --help查看tensorboard的使用说明。而自己写的一些.py文件就需要在python里用import进行导入后使用。 3.尝试过使用python自带的setuptools,但是不得其法。 4.求解。
python:我的pip无法安装库是什么情况?
我的pip一安装库就会错误,求大佬解答 例如在终端执行pip install flask就会这样 ![图片说明](https://img-ask.csdn.net/upload/201909/02/1567431191_534064.png) 我已经安装了pip python是3.7版本 求解答
pip安装scrapy报错,求解?
root@iZ253bbf6h1Z:/home/guoyufeng/CODE/pythonCode/SCrapyLeraning/tutorial/tutorial/spiders# sudo apt-get install python-pipReading package lists... DoneBuilding dependency tree Reading state information... Donepython-pip is already the newest version.The following packages were automatically installed and are no longer required: ipython libwebp5 libwebpmux1 python-boto python-crypto python-decorator python-django python-guppy python-guppy-lib python-imaging python-mysqldb python-openssl python-pam python-pexpect python-pil python-pyasn1 python-pygments python-serial python-simplegeneric python-support python-twisted-bin python-twisted-conch python-twisted-core python-twisted-mail python-twisted-names python-twisted-web python-w3lib python-zope.interfaceUse 'apt-get autoremove' to remove them.0 upgraded, 0 newly installed, 0 to remove and 107 not upgraded.root@iZ253bbf6h1Z:/home/guoyufeng/CODE/pythonCode/SCrapyLeraning/tutorial/tutorial/spiders# pip install ScrapyDownloading/unpacking Scrapy Downloading Scrapy-1.0.1-py2-none-any.whl (290kB): 290kB downloadedCleaning up...Exception:Traceback (most recent call last): File "/usr/lib/python2.7/dist-packages/pip/basecommand.py", line 122, in main status = self.run(options, args) File "/usr/lib/python2.7/dist-packages/pip/commands/install.py", line 278, in run requirement_set.prepare_files(finder, force_root_egg_info=self.bundle, bundle=self.bundle) File "/usr/lib/python2.7/dist-packages/pip/req.py", line 1260, in prepare_files )[0]IndexError: list index out of rangeStoring debug log for failure in /root/.pip/pip.log
用linux安装软件出现的问题 ERROR: Exception: Traceback (most recent call last)
edx@ubuntu:~$ git clone https://github.com/kan-bayashi/PytorchWaveNetVocoder.git 正克隆到 'PytorchWaveNetVocoder'... remote: Enumerating objects: 330, done. remote: Counting objects: 100% (330/330), done. remote: Compressing objects: 100% (159/159), done. remote: Total 2328 (delta 220), reused 258 (delta 171), pack-reused 1998 接收对象中: 100% (2328/2328), 436.01 KiB | 736.00 KiB/s, 完成. 处理 delta 中: 100% (1436/1436), 完成. edx@ubuntu:~$ cd PytorchWaveNetVocoder/tools edx@ubuntu:~/PytorchWaveNetVocoder/tools$ make test -d venv || virtualenv -p python3.6 venv Running virtualenv with interpreter /usr/bin/python3.6 Using base prefix '/usr' New python executable in /home/edx/PytorchWaveNetVocoder/tools/venv/bin/python3.6 Also creating executable in /home/edx/PytorchWaveNetVocoder/tools/venv/bin/python Installing setuptools, pkg_resources, pip, wheel...done. . venv/bin/activate && pip install --upgrade pip Requirement already up-to-date: pip in ./venv/lib/python3.6/site-packages (19.3.1) . venv/bin/activate && cd ../ && pip install torch==1.0.1 torchvision==0.2.2 Collecting torch==1.0.1 Downloading https://files.pythonhosted.org/packages/f7/92/1ae072a56665e36e81046d5fb8a2f39c7728c25c21df1777486c49b179ae/torch-1.0.1-cp36-cp36m-manylinux1_x86_64.whl (560.0MB) |████████████████████████████████| 560.0MB 98kB/s eta 0:00:01ERROR: Exception: Traceback (most recent call last): File "/home/edx/PytorchWaveNetVocoder/tools/venv/lib/python3.6/site-packages/pip/_internal/cli/base_command.py", line 153, in _main status = self.run(options, args) File "/home/edx/PytorchWaveNetVocoder/tools/venv/lib/python3.6/site-packages/pip/_internal/commands/install.py", line 382, in run resolver.resolve(requirement_set) File "/home/edx/PytorchWaveNetVocoder/tools/venv/lib/python3.6/site-packages/pip/_internal/legacy_resolve.py", line 201, in resolve self._resolve_one(requirement_set, req) File "/home/edx/PytorchWaveNetVocoder/tools/venv/lib/python3.6/site-packages/pip/_internal/legacy_resolve.py", line 365, in _resolve_one abstract_dist = self._get_abstract_dist_for(req_to_install) File "/home/edx/PytorchWaveNetVocoder/tools/venv/lib/python3.6/site-packages/pip/_internal/legacy_resolve.py", line 313, in _get_abstract_dist_for req, self.session, self.finder, self.require_hashes File "/home/edx/PytorchWaveNetVocoder/tools/venv/lib/python3.6/site-packages/pip/_internal/operations/prepare.py", line 194, in prepare_linked_requirement progress_bar=self.progress_bar File "/home/edx/PytorchWaveNetVocoder/tools/venv/lib/python3.6/site-packages/pip/_internal/download.py", line 465, in unpack_url progress_bar=progress_bar File "/home/edx/PytorchWaveNetVocoder/tools/venv/lib/python3.6/site-packages/pip/_internal/download.py", line 316, in unpack_http_url progress_bar) File "/home/edx/PytorchWaveNetVocoder/tools/venv/lib/python3.6/site-packages/pip/_internal/download.py", line 551, in _download_http_url _download_url(resp, link, content_file, hashes, progress_bar) File "/home/edx/PytorchWaveNetVocoder/tools/venv/lib/python3.6/site-packages/pip/_internal/download.py", line 253, in _download_url hashes.check_against_chunks(downloaded_chunks) File "/home/edx/PytorchWaveNetVocoder/tools/venv/lib/python3.6/site-packages/pip/_internal/utils/hashes.py", line 80, in check_against_chunks for chunk in chunks: File "/home/edx/PytorchWaveNetVocoder/tools/venv/lib/python3.6/site-packages/pip/_internal/download.py", line 223, in written_chunks for chunk in chunks: File "/home/edx/PytorchWaveNetVocoder/tools/venv/lib/python3.6/site-packages/pip/_internal/utils/ui.py", line 160, in iter for x in it: File "/home/edx/PytorchWaveNetVocoder/tools/venv/lib/python3.6/site-packages/pip/_internal/download.py", line 212, in resp_read decode_content=False): File "/home/edx/PytorchWaveNetVocoder/tools/venv/lib/python3.6/site-packages/pip/_vendor/urllib3/response.py", line 564, in stream data = self.read(amt=amt, decode_content=decode_content) File "/home/edx/PytorchWaveNetVocoder/tools/venv/lib/python3.6/site-packages/pip/_vendor/urllib3/response.py", line 507, in read data = self._fp.read(amt) if not fp_closed else b"" File "/home/edx/PytorchWaveNetVocoder/tools/venv/lib/python3.6/site-packages/pip/_vendor/cachecontrol/filewrapper.py", line 65, in read self._close() File "/home/edx/PytorchWaveNetVocoder/tools/venv/lib/python3.6/site-packages/pip/_vendor/cachecontrol/filewrapper.py", line 52, in _close self.__callback(self.__buf.getvalue()) File "/home/edx/PytorchWaveNetVocoder/tools/venv/lib/python3.6/site-packages/pip/_vendor/cachecontrol/controller.py", line 300, in cache_response cache_url, self.serializer.dumps(request, response, body=body) File "/home/edx/PytorchWaveNetVocoder/tools/venv/lib/python3.6/site-packages/pip/_vendor/cachecontrol/serialize.py", line 72, in dumps return b",".join([b"cc=4", msgpack.dumps(data, use_bin_type=True)]) File "/home/edx/PytorchWaveNetVocoder/tools/venv/lib/python3.6/site-packages/pip/_vendor/msgpack/__init__.py", line 46, in packb return Packer(**kwargs).pack(o) File "/home/edx/PytorchWaveNetVocoder/tools/venv/lib/python3.6/site-packages/pip/_vendor/msgpack/fallback.py", line 900, in pack self._pack(obj) File "/home/edx/PytorchWaveNetVocoder/tools/venv/lib/python3.6/site-packages/pip/_vendor/msgpack/fallback.py", line 891, in _pack nest_limit - 1) File "/home/edx/PytorchWaveNetVocoder/tools/venv/lib/python3.6/site-packages/pip/_vendor/msgpack/fallback.py", line 985, in _pack_map_pairs self._pack(v, nest_limit - 1) File "/home/edx/PytorchWaveNetVocoder/tools/venv/lib/python3.6/site-packages/pip/_vendor/msgpack/fallback.py", line 891, in _pack nest_limit - 1) File "/home/edx/PytorchWaveNetVocoder/tools/venv/lib/python3.6/site-packages/pip/_vendor/msgpack/fallback.py", line 984, in _pack_map_pairs self._pack(k, nest_limit - 1) File "/home/edx/PytorchWaveNetVocoder/tools/venv/lib/python3.6/site-packages/pip/_vendor/msgpack/fallback.py", line 847, in _pack return self._buffer.write(obj) MemoryError Makefile:6: recipe for target 'venv/bin/activate' failed make: *** [venv/bin/activate] Error 2 这是运行出来的错误 ,因为时第一次使用,所以没有看懂什么意思,想求助大佬们,怎么解决![图片说明](https://img-ask.csdn.net/upload/201911/07/1573114791_122624.png)这是代码运行make的文件程序
相见恨晚的超实用网站
相见恨晚的超实用网站 持续更新中。。。
字节跳动视频编解码面经
三四月份投了字节跳动的实习(图形图像岗位),然后hr打电话过来问了一下会不会opengl,c++,shador,当时只会一点c++,其他两个都不会,也就直接被拒了。 七月初内推了字节跳动的提前批,因为内推没有具体的岗位,hr又打电话问要不要考虑一下图形图像岗,我说实习投过这个岗位不合适,不会opengl和shador,然后hr就说秋招更看重基础。我当时想着能进去就不错了,管他哪个岗呢,就同意了面试...
Java学习的正确打开方式
在博主认为,对于入门级学习java的最佳学习方法莫过于视频+博客+书籍+总结,前三者博主将淋漓尽致地挥毫于这篇博客文章中,至于总结在于个人,实际上越到后面你会发现学习的最好方式就是阅读参考官方文档其次就是国内的书籍,博客次之,这又是一个层次了,这里暂时不提后面再谈。博主将为各位入门java保驾护航,各位只管冲鸭!!!上天是公平的,只要不辜负时间,时间自然不会辜负你。 何谓学习?博主所理解的学习,它是一个过程,是一个不断累积、不断沉淀、不断总结、善于传达自己的个人见解以及乐于分享的过程。
程序员必须掌握的核心算法有哪些?
由于我之前一直强调数据结构以及算法学习的重要性,所以就有一些读者经常问我,数据结构与算法应该要学习到哪个程度呢?,说实话,这个问题我不知道要怎么回答你,主要取决于你想学习到哪些程度,不过针对这个问题,我稍微总结一下我学过的算法知识点,以及我觉得值得学习的算法。这些算法与数据结构的学习大多数是零散的,并没有一本把他们全部覆盖的书籍。下面是我觉得值得学习的一些算法以及数据结构,当然,我也会整理一些看过...
大学四年自学走来,这些私藏的实用工具/学习网站我贡献出来了
大学四年,看课本是不可能一直看课本的了,对于学习,特别是自学,善于搜索网上的一些资源来辅助,还是非常有必要的,下面我就把这几年私藏的各种资源,网站贡献出来给你们。主要有:电子书搜索、实用工具、在线视频学习网站、非视频学习网站、软件下载、面试/求职必备网站。 注意:文中提到的所有资源,文末我都给你整理好了,你们只管拿去,如果觉得不错,转发、分享就是最大的支持了。 一、电子书搜索 对于大部分程序员...
linux系列之常用运维命令整理笔录
本博客记录工作中需要的linux运维命令,大学时候开始接触linux,会一些基本操作,可是都没有整理起来,加上是做开发,不做运维,有些命令忘记了,所以现在整理成博客,当然vi,文件操作等就不介绍了,慢慢积累一些其它拓展的命令,博客不定时更新 free -m 其中:m表示兆,也可以用g,注意都要小写 Men:表示物理内存统计 total:表示物理内存总数(total=used+free) use...
比特币原理详解
一、什么是比特币 比特币是一种电子货币,是一种基于密码学的货币,在2008年11月1日由中本聪发表比特币白皮书,文中提出了一种去中心化的电子记账系统,我们平时的电子现金是银行来记账,因为银行的背后是国家信用。去中心化电子记账系统是参与者共同记账。比特币可以防止主权危机、信用风险。其好处不多做赘述,这一层面介绍的文章很多,本文主要从更深层的技术原理角度进行介绍。 二、问题引入 假设现有4个人...
python学习方法总结(内附python全套学习资料)
不要再问我python好不好学了 我之前做过半年少儿编程老师,一个小学四年级的小孩子都能在我的教学下独立完成python游戏,植物大战僵尸简单版,如果要肯花时间,接下来的网络开发也不是问题,人工智能也可以学个调包也没啥问题。。。。。所以python真的是想学就一定能学会的!!!! --------------------华丽的分割线-------------------------------- ...
python 简易微信实现(注册登录+数据库存储+聊天+GUI+文件传输)
socket+tkinter详解+简易微信实现 历经多天的努力,查阅了许多大佬的博客后终于实现了一个简易的微信O(∩_∩)O~~ 简易数据库的实现 使用pands+CSV实现数据库框架搭建 import socket import threading from pandas import * import pymysql import csv # 创建DataFrame对象 # 存储用户数据的表(...
程序员接私活怎样防止做完了不给钱?
首先跟大家说明一点,我们做 IT 类的外包开发,是非标品开发,所以很有可能在开发过程中会有这样那样的需求修改,而这种需求修改很容易造成扯皮,进而影响到费用支付,甚至出现做完了项目收不到钱的情况。 那么,怎么保证自己的薪酬安全呢? 我们在开工前,一定要做好一些证据方面的准备(也就是“讨薪”的理论依据),这其中最重要的就是需求文档和验收标准。一定要让需求方提供这两个文档资料作为开发的基础。之后开发...
网页实现一个简单的音乐播放器(大佬别看。(⊙﹏⊙))
今天闲着无事,就想写点东西。然后听了下歌,就打算写个播放器。 于是乎用h5 audio的加上js简单的播放器完工了。 演示地点演示 html代码如下` music 这个年纪 七月的风 音乐 ` 然后就是css`*{ margin: 0; padding: 0; text-decoration: none; list-...
Python十大装B语法
Python 是一种代表简单思想的语言,其语法相对简单,很容易上手。不过,如果就此小视 Python 语法的精妙和深邃,那就大错特错了。本文精心筛选了最能展现 Python 语法之精妙的十个知识点,并附上详细的实例代码。如能在实战中融会贯通、灵活使用,必将使代码更为精炼、高效,同时也会极大提升代码B格,使之看上去更老练,读起来更优雅。
数据库优化 - SQL优化
以实际SQL入手,带你一步一步走上SQL优化之路!
2019年11月中国大陆编程语言排行榜
2019年11月2日,我统计了某招聘网站,获得有效程序员招聘数据9万条。针对招聘信息,提取编程语言关键字,并统计如下: 编程语言比例 rank pl_ percentage 1 java 33.62% 2 cpp 16.42% 3 c_sharp 12.82% 4 javascript 12.31% 5 python 7.93% 6 go 7.25% 7 p...
通俗易懂地给女朋友讲:线程池的内部原理
餐盘在灯光的照耀下格外晶莹洁白,女朋友拿起红酒杯轻轻地抿了一小口,对我说:“经常听你说线程池,到底线程池到底是个什么原理?”
《奇巧淫技》系列-python!!每天早上八点自动发送天气预报邮件到QQ邮箱
将代码部署服务器,每日早上定时获取到天气数据,并发送到邮箱。 也可以说是一个小型人工智障。 知识可以运用在不同地方,不一定非是天气预报。
经典算法(5)杨辉三角
杨辉三角 是经典算法,这篇博客对它的算法思想进行了讲解,并有完整的代码实现。
Python实例大全(基于Python3.7.4)
博客说明: 这是自己写的有关python语言的一篇综合博客。 只作为知识广度和编程技巧学习,不过于追究学习深度,点到即止、会用即可。 主要是基础语句,如三大控制语句(顺序、分支、循环),随机数的生成,数据类型的区分和使用; 也会涉及常用的算法和数据结构,以及面试题相关经验; 主体部分是针对python的数据挖掘和数据分析,主要先攻爬虫方向:正则表达式匹配,常用数据清洗办法,scrapy及其他爬虫框架,数据存储方式及其实现; 最后还会粗略涉及人工智能领域,玩转大数据与云计算、进行相关的预测和分析。
腾讯算法面试题:64匹马8个跑道需要多少轮才能选出最快的四匹?
昨天,有网友私信我,说去阿里面试,彻底的被打击到了。问了为什么网上大量使用ThreadLocal的源码都会加上private static?他被难住了,因为他从来都没有考虑过这个问题。无独有偶,今天笔者又发现有网友吐槽了一道腾讯的面试题,我们一起来看看。 腾讯算法面试题:64匹马8个跑道需要多少轮才能选出最快的四匹? 在互联网职场论坛,一名程序员发帖求助到。二面腾讯,其中一个算法题:64匹...
面试官:你连RESTful都不知道我怎么敢要你?
干货,2019 RESTful最贱实践
刷了几千道算法题,这些我私藏的刷题网站都在这里了!
遥想当年,机缘巧合入了 ACM 的坑,周边巨擘林立,从此过上了"天天被虐似死狗"的生活… 然而我是谁,我可是死狗中的战斗鸡,智力不够那刷题来凑,开始了夜以继日哼哧哼哧刷题的日子,从此"读题与提交齐飞, AC 与 WA 一色 ",我惊喜的发现被题虐既刺激又有快感,那一刻我泪流满面。这么好的事儿作为一个正直的人绝不能自己独享,经过激烈的颅内斗争,我决定把我私藏的十几个 T 的,阿不,十几个刷题网...
为啥国人偏爱Mybatis,而老外喜欢Hibernate/JPA呢?
关于SQL和ORM的争论,永远都不会终止,我也一直在思考这个问题。昨天又跟群里的小伙伴进行了一番讨论,感触还是有一些,于是就有了今天这篇文。 声明:本文不会下关于Mybatis和JPA两个持久层框架哪个更好这样的结论。只是摆事实,讲道理,所以,请各位看官勿喷。 一、事件起因 关于Mybatis和JPA孰优孰劣的问题,争论已经很多年了。一直也没有结论,毕竟每个人的喜好和习惯是大不相同的。我也看...
SQL-小白最佳入门sql查询一
不要偷偷的查询我的个人资料,即使你再喜欢我,也不要这样,真的不好;
JavaScript 为什么能活到现在?
作者 | 司徒正美 责编 |郭芮 出品 | CSDN(ID:CSDNnews) JavaScript能发展到现在的程度已经经历不少的坎坷,早产带来的某些缺陷是永久性的,因此浏览器才有禁用JavaScript的选项。甚至在jQuery时代有人问出这样的问题,jQuery与JavaScript哪个快?在Babel.js出来之前,发明一门全新的语言代码代替JavaScript...
项目中的if else太多了,该怎么重构?
介绍 最近跟着公司的大佬开发了一款IM系统,类似QQ和微信哈,就是聊天软件。我们有一部分业务逻辑是这样的 if (msgType = "文本") { // dosomething } else if(msgType = "图片") { // doshomething } else if(msgType = "视频") { // doshomething } else { // doshom...
Nginx 原理和架构
Nginx 是一个免费的,开源的,高性能的 HTTP 服务器和反向代理,以及 IMAP / POP3 代理服务器。Nginx 以其高性能,稳定性,丰富的功能,简单的配置和低资源消耗而闻名。 Nginx 的整体架构 Nginx 里有一个 master 进程和多个 worker 进程。master 进程并不处理网络请求,主要负责调度工作进程:加载配置、启动工作进程及非停升级。worker 进程负责处...
致 Python 初学者
欢迎来到“Python进阶”专栏!来到这里的每一位同学,应该大致上学习了很多 Python 的基础知识,正在努力成长的过程中。在此期间,一定遇到了很多的困惑,对未来的学习方向感到迷茫。我非常理解你们所面临的处境。我从2007年开始接触 python 这门编程语言,从2009年开始单一使用 python 应对所有的开发工作,直至今天。回顾自己的学习过程,也曾经遇到过无数的困难,也曾经迷茫过、困惑过。开办这个专栏,正是为了帮助像我当年一样困惑的 Python 初学者走出困境、快速成长。希望我的经验能真正帮到你
Python 编程开发 实用经验和技巧
Python是一门很灵活的语言,也有很多实用的方法,有时候实现一个功能可以用多种方法实现,我这里总结了一些常用的方法和技巧,包括小数保留指定位小数、判断变量的数据类型、类方法@classmethod、制表符中文对齐、遍历字典、datetime.timedelta的使用等,会持续更新......
吐血推荐珍藏的Visual Studio Code插件
作为一名Java工程师,由于工作需要,最近一个月一直在写NodeJS,这种经历可以说是一部辛酸史了。好在有神器Visual Studio Code陪伴,让我的这段经历没有更加困难。眼看这段经历要告一段落了,今天就来给大家分享一下我常用的一些VSC的插件。 VSC的插件安装方法很简单,只需要点击左侧最下方的插件栏选项,然后就可以搜索你想要的插件了。 下面我们进入正题 Material Theme ...
“狗屁不通文章生成器”登顶GitHub热榜,分分钟写出万字形式主义大作
一、垃圾文字生成器介绍 最近在浏览GitHub的时候,发现了这样一个骨骼清奇的雷人项目,而且热度还特别高。 项目中文名:狗屁不通文章生成器 项目英文名:BullshitGenerator 根据作者的介绍,他是偶尔需要一些中文文字用于GUI开发时测试文本渲染,因此开发了这个废话生成器。但由于生成的废话实在是太过富于哲理,所以最近已经被小伙伴们给玩坏了。 他的文风可能是这样的: 你发现,...
相关热词 c#委托 逆变与协变 c#新建一个项目 c#获取dll文件路径 c#子窗体调用主窗体事件 c# 拷贝目录 c# 调用cef 网页填表c#源代码 c#部署端口监听项目、 c#接口中的属性使用方法 c# 昨天
立即提问