python3.7配置了pip,安装3.7对应的pygame一直安装不成功显示找不到对应是什么问题?

如图一,python3.7配置了pip19.3.1,安装3.7对应的pygame一直安装不成功,提示找不到对应版本,求教下这个怎么解决?图片说明
使用powershell配置,结果如下:
图片说明

2个回答

名称不对 可以直接pip install pygame 自动匹配比较合适

Csdn user default icon
上传中...
上传图片
插入图片
抄袭、复制答案,以达到刷声望分或其他目的的行为,在CSDN问答是严格禁止的,一经发现立刻封号。是时候展现真正的技术了!
其他相关推荐
关于centos6.8 安装python3.5.2 关于pip的问题
centos内默认有python2.6,后来新安装python3.5.2版本,(不是覆盖安装,原有Python2.6继续保留),问题:新版本的python pip如何安装,还是用原有老版本python2.6 中的pip? 2.pip安装的模块一般路径在哪里,可否改变安装路径,如何处理? 感谢阅读!
关于Python3.7中安装pip install Scrapy出现的问题
我的是WIN10,安装的3.7版的Python,python和pip兼正常,但是我在电脑上安装scrapy,就是pip install scrapy这样,却出现了问题。 但是,跟别人的不一样,我的不是因为环境问题而安装不上去,出现的是下面这样的代码 ERROR: Command "'d:\program files\python37\python.exe' -u -c 'import setuptools, tokenize;__file__='"'"'C:\\Users\\dev\\AppData\\Local\\Temp\\pip-install-6z92nq_l\\Twisted\\setup.py'"'"';f=getattr(tokenize, '"'"'open'"'"', open)(__file__);code=f.read().replace('"'"'\r\n'"'"', '"'"'\n'"'"');f.close();exec(compile(code, __file__, '"'"'exec'"'"'))' install --record 'C:\Users\dev\AppData\Local\Temp\pip-record-vclemy75\install-record.txt' --single-version-externally-managed --compile" failed with error code 1 in C:\Users\dev\AppData\Local\Temp\pip-install-6z92nq_l\Twisted\ 我是真不知道是什么原因了,穷途末路,请各位大神帮帮我吧
如何在django中使用mysql自带的MySQL Connector Python 8.0 for Python 3.7?
django连接mysql提示 django.core.exceptions.ImproperlyConfigured: Error loading MySQLdb module. Did you install mysqlclient? 也就是说要我pip install mysqlclient 可我安装mysql的时候自带MySQL Connector Python 8.0 for Python 3.7 C:\Program Files\MySQL\MySQL Connector Python 8.0 for Python 3.7 也就是说我只要告诉django连接mysql用这个目录里的文件就好了... 可我怎么才能让django知道这件事...
ubuntu18.04 python3.6 pip安装mysqlclient报错
ubuntu18.04 python3.6 pip安装mysqlclient报错 求大佬解答 ``` Building wheels for collected packages: mysqlclient Running setup.py bdist_wheel for mysqlclient ... error Complete output from command /usr/bin/python3 -u -c "import setuptools, tokenize;__file__='/tmp/pip-build-njxuuzpo/mysqlclient/setup.py';f=getattr(tokenize, 'open', open)(__file__);code=f.read().replace('\r\n', '\n');f.close();exec(compile(code, __file__, 'exec'))" bdist_wheel -d /tmp/tmpzs54ny_2pip-wheel- --python-tag cp36: running bdist_wheel running build running build_py creating build creating build/lib.linux-x86_64-3.6 creating build/lib.linux-x86_64-3.6/MySQLdb copying MySQLdb/__init__.py -> build/lib.linux-x86_64-3.6/MySQLdb copying MySQLdb/_exceptions.py -> build/lib.linux-x86_64-3.6/MySQLdb copying MySQLdb/compat.py -> build/lib.linux-x86_64-3.6/MySQLdb copying MySQLdb/connections.py -> build/lib.linux-x86_64-3.6/MySQLdb copying MySQLdb/converters.py -> build/lib.linux-x86_64-3.6/MySQLdb copying MySQLdb/cursors.py -> build/lib.linux-x86_64-3.6/MySQLdb copying MySQLdb/release.py -> build/lib.linux-x86_64-3.6/MySQLdb copying MySQLdb/times.py -> build/lib.linux-x86_64-3.6/MySQLdb creating build/lib.linux-x86_64-3.6/MySQLdb/constants copying MySQLdb/constants/__init__.py -> build/lib.linux-x86_64-3.6/MySQLdb/constants copying MySQLdb/constants/CLIENT.py -> build/lib.linux-x86_64-3.6/MySQLdb/constants copying MySQLdb/constants/CR.py -> build/lib.linux-x86_64-3.6/MySQLdb/constants copying MySQLdb/constants/ER.py -> build/lib.linux-x86_64-3.6/MySQLdb/constants copying MySQLdb/constants/FIELD_TYPE.py -> build/lib.linux-x86_64-3.6/MySQLdb/constants copying MySQLdb/constants/FLAG.py -> build/lib.linux-x86_64-3.6/MySQLdb/constants running build_ext building 'MySQLdb._mysql' extension creating build/temp.linux-x86_64-3.6 creating build/temp.linux-x86_64-3.6/MySQLdb x86_64-linux-gnu-gcc -pthread -DNDEBUG -g -fwrapv -O2 -Wall -g -fstack-protector-strong -Wformat -Werror=format-security -Wdate-time -D_FORTIFY_SOURCE=2 -fPIC -Dversion_info=(1,4,5,'final',0) -D__version__=1.4.5 -I/usr/include/mysql -I/usr/include/python3.6m -c MySQLdb/_mysql.c -o build/temp.linux-x86_64-3.6/MySQLdb/_mysql.o x86_64-linux-gnu-gcc -pthread -shared -Wl,-O1 -Wl,-Bsymbolic-functions -Wl,-Bsymbolic-functions -Wl,-z,relro -Wl,-Bsymbolic-functions -Wl,-z,relro -g -fstack-protector-strong -Wformat -Werror=format-security -Wdate-time -D_FORTIFY_SOURCE=2 build/temp.linux-x86_64-3.6/MySQLdb/_mysql.o -lmysqlclient -lpthread -lz -lm -lrt -latomic -lssl -lcrypto -ldl -o build/lib.linux-x86_64-3.6/MySQLdb/_mysql.cpython-36m-x86_64-linux-gnu.so /usr/bin/ld: cannot find -lssl /usr/bin/ld: cannot find -lcrypto collect2: error: ld returned 1 exit status error: command 'x86_64-linux-gnu-gcc' failed with exit status 1 ---------------------------------------- Failed building wheel for mysqlclient Running setup.py clean for mysqlclient Failed to build mysqlclient Installing collected packages: mysqlclient Running setup.py install for mysqlclient ... error Complete output from command /usr/bin/python3 -u -c "import setuptools, tokenize;__file__='/tmp/pip-build-njxuuzpo/mysqlclient/setup.py';f=getattr(tokenize, 'open', open)(__file__);code=f.read().replace('\r\n', '\n');f.close();exec(compile(code, __file__, 'exec'))" install --record /tmp/pip-ldoqhl56-record/install-record.txt --single-version-externally-managed --compile --user --prefix=: running install running build running build_py creating build creating build/lib.linux-x86_64-3.6 creating build/lib.linux-x86_64-3.6/MySQLdb copying MySQLdb/__init__.py -> build/lib.linux-x86_64-3.6/MySQLdb copying MySQLdb/_exceptions.py -> build/lib.linux-x86_64-3.6/MySQLdb copying MySQLdb/compat.py -> build/lib.linux-x86_64-3.6/MySQLdb copying MySQLdb/connections.py -> build/lib.linux-x86_64-3.6/MySQLdb copying MySQLdb/converters.py -> build/lib.linux-x86_64-3.6/MySQLdb copying MySQLdb/cursors.py -> build/lib.linux-x86_64-3.6/MySQLdb copying MySQLdb/release.py -> build/lib.linux-x86_64-3.6/MySQLdb copying MySQLdb/times.py -> build/lib.linux-x86_64-3.6/MySQLdb creating build/lib.linux-x86_64-3.6/MySQLdb/constants copying MySQLdb/constants/__init__.py -> build/lib.linux-x86_64-3.6/MySQLdb/constants copying MySQLdb/constants/CLIENT.py -> build/lib.linux-x86_64-3.6/MySQLdb/constants copying MySQLdb/constants/CR.py -> build/lib.linux-x86_64-3.6/MySQLdb/constants copying MySQLdb/constants/ER.py -> build/lib.linux-x86_64-3.6/MySQLdb/constants copying MySQLdb/constants/FIELD_TYPE.py -> build/lib.linux-x86_64-3.6/MySQLdb/constants copying MySQLdb/constants/FLAG.py -> build/lib.linux-x86_64-3.6/MySQLdb/constants running build_ext building 'MySQLdb._mysql' extension creating build/temp.linux-x86_64-3.6 creating build/temp.linux-x86_64-3.6/MySQLdb x86_64-linux-gnu-gcc -pthread -DNDEBUG -g -fwrapv -O2 -Wall -g -fstack-protector-strong -Wformat -Werror=format-security -Wdate-time -D_FORTIFY_SOURCE=2 -fPIC -Dversion_info=(1,4,5,'final',0) -D__version__=1.4.5 -I/usr/include/mysql -I/usr/include/python3.6m -c MySQLdb/_mysql.c -o build/temp.linux-x86_64-3.6/MySQLdb/_mysql.o x86_64-linux-gnu-gcc -pthread -shared -Wl,-O1 -Wl,-Bsymbolic-functions -Wl,-Bsymbolic-functions -Wl,-z,relro -Wl,-Bsymbolic-functions -Wl,-z,relro -g -fstack-protector-strong -Wformat -Werror=format-security -Wdate-time -D_FORTIFY_SOURCE=2 build/temp.linux-x86_64-3.6/MySQLdb/_mysql.o -lmysqlclient -lpthread -lz -lm -lrt -latomic -lssl -lcrypto -ldl -o build/lib.linux-x86_64-3.6/MySQLdb/_mysql.cpython-36m-x86_64-linux-gnu.so /usr/bin/ld: cannot find -lssl /usr/bin/ld: cannot find -lcrypto collect2: error: ld returned 1 exit status error: command 'x86_64-linux-gnu-gcc' failed with exit status 1 ---------------------------------------- Command "/usr/bin/python3 -u -c "import setuptools, tokenize;__file__='/tmp/pip-build-njxuuzpo/mysqlclient/setup.py';f=getattr(tokenize, 'open', open)(__file__);code=f.read().replace('\r\n', '\n');f.close();exec(compile(code, __file__, 'exec'))" install --record /tmp/pip-ldoqhl56-record/install-record.txt --single-version-externally-managed --compile --user --prefix=" failed with error code 1 in /tmp/pip-build-njxuuzpo/mysqlclient/ ```
python3.7安装email库出现报错
下面是全部报错信息 ``` Collecting email Downloading https://files.pythonhosted.org/packages/71/e7/816030d3b0426c130040bd068be62b9213357ed02896f5d9badcf46d1b5f/email-4.0.2.tar.gz (1.2MB) |████████████████████████████████| 1.2MB 11kB/s ERROR: Complete output from command python setup.py egg_info: ERROR: Traceback (most recent call last): File "<string>", line 1, in <module> File "d:\软件\python3.7.3\lib\site-packages\setuptools\__init__.py", line 18, in <module> import setuptools.version File "d:\软件\python3.7.3\lib\site-packages\setuptools\version.py", line 1, in <module> import pkg_resources File "d:\软件\python3.7.3\lib\site-packages\pkg_resources\__init__.py", line 36, in <module> import email.parser File "C:\Users\wenrui\AppData\Local\Temp\pip-install-zuekqdy0\email\email\parser.py", line 10, in <module> from cStringIO import StringIO ModuleNotFoundError: No module named 'cStringIO' ---------------------------------------- ERROR: Command "python setup.py egg_info" failed with error code 1 in C:\Users\wenrui\AppData\Local\Temp\pip-install-zuekqdy0\email\ ```
windows10系统下,Anaconda 3 (Python3.7),使用pip install方法安装第三方库 jieba以及nltk,出现WARNING: pip is configured with locations that require TLS/SSL, however ?
我是windows10系统,安装了Anaconda3 ( python3.7),(电脑里还有python2.7) 想利用pip install 第三方库 但是报错提示如下。 ``` C:\Users\win>cd C:\Users\win\Anaconda3\Scripts C:\Users\win\Anaconda3\Scripts>pip install jieba WARNING: pip is configured with locations that require TLS/SSL, however the ssl module in Python is not available. Collecting jieba WARNING: Retrying (Retry(total=4, connect=None, read=None, redirect=None, status=None)) after connection broken by 'SSLError("Can't connect to HTTPS URL because the SSL module is not available.")': /simple/jieba/ WARNING: Retrying (Retry(total=3, connect=None, read=None, redirect=None, status=None)) after connection broken by 'SSLError("Can't connect to HTTPS URL because the SSL module is not available.")': /simple/jieba/ WARNING: Retrying (Retry(total=2, connect=None, read=None, redirect=None, status=None)) after connection broken by 'SSLError("Can't connect to HTTPS URL because the SSL module is not available.")': /simple/jieba/ WARNING: Retrying (Retry(total=1, connect=None, read=None, redirect=None, status=None)) after connection broken by 'SSLError("Can't connect to HTTPS URL because the SSL module is not available.")': /simple/jieba/ WARNING: Retrying (Retry(total=0, connect=None, read=None, redirect=None, status=None)) after connection broken by 'SSLError("Can't connect to HTTPS URL because the SSL module is not available.")': /simple/jieba/ Could not fetch URL https://pypi.org/simple/jieba/: There was a problem confirming the ssl certificate: HTTPSConnectionPool(host='pypi.org', port=443): Max retries exceeded with url: /simple/jieba/ (Caused by SSLError("Can't connect to HTTPS URL because the SSL module is not available.")) - skipping ERROR: Could not find a version that satisfies the requirement jieba (from versions: none) ERROR: No matching distribution found for jieba WARNING: pip is configured with locations that require TLS/SSL, however the ssl module in Python is not available. Could not fetch URL https://pypi.org/simple/pip/: There was a problem confirming the ssl certificate: HTTPSConnectionPool(host='pypi.org', port=443): Max retries exceeded with url: /simple/pip/ (Caused by SSLError("Can't connect to HTTPS URL because the SSL module is not available.")) - skipping ``` 我搜索了这个问题,有回答说要配置环境变量 , 然而配置后并没有用,可能是我操作不对 ![图片说明](https://img-ask.csdn.net/upload/201910/29/1572335749_876553.png) 目前看到一个很靠谱的博客,https://blog.csdn.net/lilongsy/article/details/87436552 但是本人太菜鸡,没看懂 ┭┮﹏┭┮
请教朋友们,python3.4如何安装相对应的第三方库
向各位大神求教一个问题,之前我在ubuntu14下面用python2.7版本做项目,现在准备用python3.4了,ubuntu14下面两个版本都有。但是遇到一个问题,之前安装python对应的第三方库比如:pip install pyaudtio,这个下载的第三方库匹配的是python2.7的版本,现在我3.4的版本不能用,不知道用什么命令才会下载到python3.4对应的库 希望大神们指点一下,十分感谢。
python3.7 安装requests报错,求大神支招?
python3.7 通过pip 安装requests 报错,百度上也查过很多方法 1、通过更改源 2、通过wheel安装 3、pip --timout=60000等方式都不能解决 公司每台电脑上都装了赛门铁克(Symantec),会不会与这个有影响。 求详细解决方式 报错如下: ![图片说明](https://img-ask.csdn.net/upload/201906/10/1560136696_190131.jpg) Retrying (Retry(total=4, connect=None, read=None, redirect=None, status=None)) after connection broken by 'ConnectTimeoutError(<pip._vendor.urllib3.connection.VerifiedHTTPSConnection object at 0x0000000003F7B588>, 'Connection to pypi.org timed out. (connect timeout=15)')': /simple/requests/
Python3.7+Pyside2 运行exe文件提示“ImportError: DLL load failed: 找不到指定的程序。
# Python3.7+Pyside2 运行exe文件提示“ImportError: DLL load failed: 找不到指定的程序 1.问题描述 a.python 3.7 + pyside2 (只用pyside2,没有使用PyQt5) b.使用pyinstaller -F xxx.py 打包,生成xxx.exe c.使用cmd运行exe文件 2.报错 Traceback (most recent call last): File "PyInstaller\loader\rthooks\pyi_rth_qt5plugins.py", line 47, in <module> ModuleNotFoundError: No module named 'PyQt5' During handling of the above exception, another exception occurred: Traceback (most recent call last): File "PyInstaller\loader\rthooks\pyi_rth_qt5plugins.py", line 49, in <module> ImportError: DLL load failed: 找不到指定的程序。 [16072] Failed to execute script pyi_rth_qt5plugins 不知道为啥提示No module named 'PyQt5',在安装的lib中也只有pyside2; 多谢大神指点。 20190730,更新: 经过多次尝试和修改,发现lib库的安装的问题。代码中没有调用QT5的,在lib安装的时候,如果是使用pycharm setting中安装,安装的路径是在项目的文件夹,如果使用python的终端命令pip进行安装,安装在python的lib目录下,两个路径有时候不能完全的调用。 后来重新都是统一使用python 终端 pip命令安装,问题解决。
pip升级怎么提示这个 怎么 解决 老版本也删除了 我的是python 3.7
``` D:\python>python -m pip install --upgrade pip Collecting pip Downloading https://files.pythonhosted.org/packages/30/db/9e38760b32e3e7f40cce46dd5fb107b8c73840df38f0046d8e6514e675a1/pip-19.2.3-py2.py3-none-any.whl (1.4MB) 1% |▌ | 20kB 1.4kB/s eta 0:16:35Exception: Traceback (most recent call last): File "D:\python\lib\site-packages\pip\_vendor\urllib3\response.py", line 302, in _error_catcher yield File "D:\python\lib\site-packages\pip\_vendor\urllib3\response.py", line 384, in read data = self._fp.read(amt) File "D:\python\lib\site-packages\pip\_vendor\cachecontrol\filewrapper.py", line 60, in read data = self.__fp.read(amt) File "D:\python\lib\http\client.py", line 447, in read n = self.readinto(b) File "D:\python\lib\http\client.py", line 491, in readinto n = self.fp.readinto(b) File "D:\python\lib\socket.py", line 589, in readinto return self._sock.recv_into(b) File "D:\python\lib\ssl.py", line 1049, in recv_into return self.read(nbytes, buffer) File "D:\python\lib\ssl.py", line 908, in read return self._sslobj.read(len, buffer) socket.timeout: The read operation timed out During handling of the above exception, another exception occurred: Traceback (most recent call last): File "D:\python\lib\site-packages\pip\_internal\basecommand.py", line 228, in main status = self.run(options, args) File "D:\python\lib\site-packages\pip\_internal\commands\install.py", line 291, in run resolver.resolve(requirement_set) File "D:\python\lib\site-packages\pip\_internal\resolve.py", line 103, in resolve self._resolve_one(requirement_set, req) File "D:\python\lib\site-packages\pip\_internal\resolve.py", line 257, in _resolve_one abstract_dist = self._get_abstract_dist_for(req_to_install) File "D:\python\lib\site-packages\pip\_internal\resolve.py", line 210, in _get_abstract_dist_for self.require_hashes File "D:\python\lib\site-packages\pip\_internal\operations\prepare.py", line 310, in prepare_linked_requirement progress_bar=self.progress_bar File "D:\python\lib\site-packages\pip\_internal\download.py", line 837, in unpack_url progress_bar=progress_bar File "D:\python\lib\site-packages\pip\_internal\download.py", line 674, in unpack_http_url progress_bar) File "D:\python\lib\site-packages\pip\_internal\download.py", line 898, in _download_http_url _download_url(resp, link, content_file, hashes, progress_bar) File "D:\python\lib\site-packages\pip\_internal\download.py", line 618, in _download_url hashes.check_against_chunks(downloaded_chunks) File "D:\python\lib\site-packages\pip\_internal\utils\hashes.py", line 48, in check_against_chunks for chunk in chunks: File "D:\python\lib\site-packages\pip\_internal\download.py", line 586, in written_chunks for chunk in chunks: File "D:\python\lib\site-packages\pip\_internal\utils\ui.py", line 159, in iter for x in it: File "D:\python\lib\site-packages\pip\_internal\download.py", line 575, in resp_read decode_content=False): File "D:\python\lib\site-packages\pip\_vendor\urllib3\response.py", line 436, in stream data = self.read(amt=amt, decode_content=decode_content) File "D:\python\lib\site-packages\pip\_vendor\urllib3\response.py", line 401, in read raise IncompleteRead(self._fp_bytes_read, self.length_remaining) File "D:\python\lib\contextlib.py", line 130, in __exit__ self.gen.throw(type, value, traceback) File "D:\python\lib\site-packages\pip\_vendor\urllib3\response.py", line 307, in _error_catcher raise ReadTimeoutError(self._pool, None, 'Read timed out.') pip._vendor.urllib3.exceptions.ReadTimeoutError: HTTPSConnectionPool(host='files.pythonhosted.org', port=443): Read timed out. ```
centos7+python3.7安装mod_wsgi时发生错误
各位大神:我在开发过程中需要将django部署到apache上,操作系统是centos7,pthony版本是3.7,已经装了httpd(apache),pip版本是19.2.3。使用pip3 install mod_wsgi命令后出现如下错误,如何解决?![图片说明](https://img-ask.csdn.net/upload/201909/29/1569748452_516879.jpg)![图片说明](https://img-ask.csdn.net/upload/201909/29/1569748464_754633.jpg)
python3.7 下载email包,一直报错
C:\Users\111>pip -V pip 19.1.1 from D:\Python37\lib\site-packages\pip-19.1.1-py3.7.egg\pip (python 3.7) C:\Users\111>pip install email Collecting email Using cached https://files.pythonhosted.org/packages/71/e7/816030d3b0426c130040bd068be62b9213357ed02896f5d9badcf46d1b5f/email-4.0.2.tar.gz ERROR: Complete output from command python setup.py egg_info: ERROR: Traceback (most recent call last): File "<string>", line 1, in <module> File "D:\Python37\lib\site-packages\setuptools\__init__.py", line 12, in <module> import setuptools.version File "D:\Python37\lib\site-packages\setuptools\version.py", line 1, in <module> import pkg_resources File "D:\Python37\lib\site-packages\pkg_resources\__init__.py", line 36, in <module> import email.parser File "C:\Users\111\AppData\Local\Temp\pip-install-i6c6xiar\email\email\parser.py", line 10, in <module> from cStringIO import StringIO ModuleNotFoundError: No module named 'cStringIO' ---------------------------------------- ERROR: Command "python setup.py egg_info" failed with error code 1 in C:\Users\111\AppData\Local\Temp\pip-install-i6c6xiar\email\ ``` ```
python2.7如何安装pyqt5-tools
在使用pip install python-qt5可以成功安装pyqt5,但无法安装pyqt5-tools
python3.5.0安装lxml,导入lxml.html和lxml.etree出错
系统是win7,安装的是python3.5.0版本,lxml安装的是lxml-3.7.1-cp35-cp35m-win_amd64.whl(通过pip安装的)。安装成功后import lxml没有报错,但import lxml.html 和 lxml.etree时就报错了,报错信息如下: >>> import lxml.html Traceback (most recent call last): File "<pyshell#11>", line 1, in <module> import lxml.html File "C:\Program Files\Python 3.5\lib\site-packages\lxml\html\__init__.py", line 54, in <module> from .. import etree File "type.pxd", line 9, in init lxml.etree (src\lxml\lxml.etree.c:220742) ValueError: builtins.type has the wrong size, try recompiling. Expected 840, got 864 >>> import lxml.etree Traceback (most recent call last): File "<pyshell#13>", line 1, in <module> import lxml.etree File "type.pxd", line 9, in init lxml.etree (src\lxml\lxml.etree.c:220742) ValueError: builtins.type has the wrong size, try recompiling. Expected 840, got 864
Python2.7连接mysql安装pip时出现
我在安装pip install MySQL_python-1.2.5-cp27-none-win_amd64.whl后就出现这样,求救大神 (https://img-ask.csdn.net/upload/201809/10/1536565849_561121.png)
pip3 install ERROR: Exception: Traceback (most recent call last)
操作系统:macOS。 凡是在使用"pip3 install XXX"时,都会出现如下报错。 和网上别人提出的报错内容不太一致,网上看到的方法都试过了也没有用。所以来请求大佬们帮助。 ``` ERROR: Exception: Traceback (most recent call last): File "/Library/Frameworks/Python.framework/Versions/3.7/lib/python3.7/site-packages/pip/_vendor/urllib3/response.py", line 397, in _error_catcher yield File "/Library/Frameworks/Python.framework/Versions/3.7/lib/python3.7/site-packages/pip/_vendor/urllib3/response.py", line 479, in read data = self._fp.read(amt) File "/Library/Frameworks/Python.framework/Versions/3.7/lib/python3.7/site-packages/pip/_vendor/cachecontrol/filewrapper.py", line 62, in read data = self.__fp.read(amt) File "/Library/Frameworks/Python.framework/Versions/3.7/lib/python3.7/http/client.py", line 457, in read n = self.readinto(b) File "/Library/Frameworks/Python.framework/Versions/3.7/lib/python3.7/http/client.py", line 501, in readinto n = self.fp.readinto(b) File "/Library/Frameworks/Python.framework/Versions/3.7/lib/python3.7/socket.py", line 589, in readinto return self._sock.recv_into(b) File "/Library/Frameworks/Python.framework/Versions/3.7/lib/python3.7/ssl.py", line 1071, in recv_into return self.read(nbytes, buffer) File "/Library/Frameworks/Python.framework/Versions/3.7/lib/python3.7/ssl.py", line 929, in read return self._sslobj.read(len, buffer) socket.timeout: The read operation timed out During handling of the above exception, another exception occurred: Traceback (most recent call last): File "/Library/Frameworks/Python.framework/Versions/3.7/lib/python3.7/site-packages/pip/_internal/cli/base_command.py", line 188, in main status = self.run(options, args) File "/Library/Frameworks/Python.framework/Versions/3.7/lib/python3.7/site-packages/pip/_internal/commands/install.py", line 345, in run resolver.resolve(requirement_set) File "/Library/Frameworks/Python.framework/Versions/3.7/lib/python3.7/site-packages/pip/_internal/legacy_resolve.py", line 196, in resolve self._resolve_one(requirement_set, req) File "/Library/Frameworks/Python.framework/Versions/3.7/lib/python3.7/site-packages/pip/_internal/legacy_resolve.py", line 359, in _resolve_one abstract_dist = self._get_abstract_dist_for(req_to_install) File "/Library/Frameworks/Python.framework/Versions/3.7/lib/python3.7/site-packages/pip/_internal/legacy_resolve.py", line 307, in _get_abstract_dist_for self.require_hashes File "/Library/Frameworks/Python.framework/Versions/3.7/lib/python3.7/site-packages/pip/_internal/operations/prepare.py", line 199, in prepare_linked_requirement progress_bar=self.progress_bar File "/Library/Frameworks/Python.framework/Versions/3.7/lib/python3.7/site-packages/pip/_internal/download.py", line 1064, in unpack_url progress_bar=progress_bar File "/Library/Frameworks/Python.framework/Versions/3.7/lib/python3.7/site-packages/pip/_internal/download.py", line 924, in unpack_http_url progress_bar) File "/Library/Frameworks/Python.framework/Versions/3.7/lib/python3.7/site-packages/pip/_internal/download.py", line 1152, in _download_http_url _download_url(resp, link, content_file, hashes, progress_bar) File "/Library/Frameworks/Python.framework/Versions/3.7/lib/python3.7/site-packages/pip/_internal/download.py", line 861, in _download_url hashes.check_against_chunks(downloaded_chunks) File "/Library/Frameworks/Python.framework/Versions/3.7/lib/python3.7/site-packages/pip/_internal/utils/hashes.py", line 75, in check_against_chunks for chunk in chunks: File "/Library/Frameworks/Python.framework/Versions/3.7/lib/python3.7/site-packages/pip/_internal/download.py", line 829, in written_chunks for chunk in chunks: File "/Library/Frameworks/Python.framework/Versions/3.7/lib/python3.7/site-packages/pip/_internal/utils/ui.py", line 156, in iter for x in it: File "/Library/Frameworks/Python.framework/Versions/3.7/lib/python3.7/site-packages/pip/_internal/download.py", line 818, in resp_read decode_content=False): File "/Library/Frameworks/Python.framework/Versions/3.7/lib/python3.7/site-packages/pip/_vendor/urllib3/response.py", line 531, in stream data = self.read(amt=amt, decode_content=decode_content) File "/Library/Frameworks/Python.framework/Versions/3.7/lib/python3.7/site-packages/pip/_vendor/urllib3/response.py", line 496, in read raise IncompleteRead(self._fp_bytes_read, self.length_remaining) File "/Library/Frameworks/Python.framework/Versions/3.7/lib/python3.7/contextlib.py", line 130, in __exit__ self.gen.throw(type, value, traceback) File "/Library/Frameworks/Python.framework/Versions/3.7/lib/python3.7/site-packages/pip/_vendor/urllib3/response.py", line 402, in _error_catcher raise ReadTimeoutError(self._pool, None, 'Read timed out.') pip._vendor.urllib3.exceptions.ReadTimeoutError: HTTPSConnectionPool(host='files.pythonhosted.org', port=443): Read timed out. ```
python3.6安装pypsa包时报错,无法安装。
在使用pip install pypsa,安装报错如下![图片说明](https://img-ask.csdn.net/upload/201910/15/1571110476_72432.png)![图片说明](https://img-ask.csdn.net/upload/201910/15/1571110486_931164.png) ERROR: Command errored out with exit status 1: command: 'd:\python3\python.exe' 'd:\python3\lib\site-packages\pip\_vendor\pep517\_in_process.py' get_requires_for_build_wheel 'C:\Users\xyrrrr\AppData\Local\Temp\tmpk8s4cp1x' cwd: C:\Users\xyrrrr\AppData\Local\Temp\pip-install-y9r5hyt9\cartopy Complete output (3 lines): setup.py:171: UserWarning: Unable to determine GEOS version. Ensure you have 3.3.3 or later installed, or installation may fail. '.'.join(str(v) for v in GEOS_MIN_VERSION), )) Proj 4.9.0 must be installed. ---------------------------------------- ERROR: Command errored out with exit status 1: 'd:\python3\python.exe' 'd:\python3\lib\site-packages\pip\_vendor\pep517\_in_process.py' get_requires_for_build_wheel 'C:\Users\xyrrrr\AppData\Local\Temp\tmpk8s4cp1x' Check the logs for full command output. 查了很多,真的不懂如何解决,小白求专业人士帮助!谢谢。 一天也没解决,我就是一个刚下载python的小白 饶了我吧
为什么python3.8下载matplotlib总是不成功?
python3.8下载matplotlib模块时,总是出现以下错误 ERROR: Command errored out with exit status 1: 'c:\users\air\python\python38\python.exe' -u -c 'import sys, setuptools, tokenize; sys.argv[0] = '"'"'C:\\Users\\air\\AppData\\Local\\Temp\\pip-install-5ntug3if\\matplotlib\\setup.py'"'"'; __file__='"'"'C:\\Users\\air\\AppData\\Local\\Temp\\pip-install-5ntug3if\\matplotlib\\setup.py'"'"';f=getattr(tokenize, '"'"'open'"'"', open)(__file__);code=f.read().replace('"'"'\r\n'"'"', '"'"'\n'"'"');f.close();exec(compile(code, __file__, '"'"'exec'"'"'))' install --record 'C:\Users\air\AppData\Local\Temp\pip-record-rp63qqyg\install-record.txt' --single-version-externally-managed --compile Check the logs for full command output. ![图片说明](https://img-ask.csdn.net/upload/201911/20/1574238491_785213.png) 有那位大神可以帮我看一下?
Linux下的python的pip问题
今天我安装了python3 然后pip安装tornado,测试发现导入不成功,通过find命令查到pip把tornado安装到python2.7里面去了 ![图片说明](https://img-ask.csdn.net/upload/201804/29/1525006422_521904.png) 通过搜索命令发现在python3.6里面有一个pip,于是我到usr/bin目录下面删除了pip的软连接 然后设置python3.6的pip软连接发现pip用不了 ![图片说明](https://img-ask.csdn.net/upload/201804/29/1525006713_105393.png)
相见恨晚的超实用网站
搞学习 知乎:www.zhihu.com 简答题:http://www.jiandati.com/ 网易公开课:https://open.163.com/ted/ 网易云课堂:https://study.163.com/ 中国大学MOOC:www.icourse163.org 网易云课堂:study.163.com 哔哩哔哩弹幕网:www.bilibili.com 我要自学网:www.51zxw
花了20分钟,给女朋友们写了一个web版群聊程序
参考博客 [1]https://www.byteslounge.com/tutorials/java-ee-html5-websocket-example
爬虫福利二 之 妹子图网MM批量下载
爬虫福利一:27报网MM批量下载    点击 看了本文,相信大家对爬虫一定会产生强烈的兴趣,激励自己去学习爬虫,在这里提前祝:大家学有所成! 目标网站:妹子图网 环境:Python3.x 相关第三方模块:requests、beautifulsoup4 Re:各位在测试时只需要将代码里的变量 path 指定为你当前系统要保存的路径,使用 python xxx.py 或IDE运行即可。
字节跳动视频编解码面经
引言 本文主要是记录一下面试字节跳动的经历。 三四月份投了字节跳动的实习(图形图像岗位),然后hr打电话过来问了一下会不会opengl,c++,shador,当时只会一点c++,其他两个都不会,也就直接被拒了。 七月初内推了字节跳动的提前批,因为内推没有具体的岗位,hr又打电话问要不要考虑一下图形图像岗,我说实习投过这个岗位不合适,不会opengl和shador,然后hr就说秋招更看重基础。我当时
Java学习的正确打开方式
在博主认为,对于入门级学习java的最佳学习方法莫过于视频+博客+书籍+总结,前三者博主将淋漓尽致地挥毫于这篇博客文章中,至于总结在于个人,实际上越到后面你会发现学习的最好方式就是阅读参考官方文档其次就是国内的书籍,博客次之,这又是一个层次了,这里暂时不提后面再谈。博主将为各位入门java保驾护航,各位只管冲鸭!!!上天是公平的,只要不辜负时间,时间自然不会辜负你。 何谓学习?博主所理解的学习,它
程序员必须掌握的核心算法有哪些?
由于我之前一直强调数据结构以及算法学习的重要性,所以就有一些读者经常问我,数据结构与算法应该要学习到哪个程度呢?,说实话,这个问题我不知道要怎么回答你,主要取决于你想学习到哪些程度,不过针对这个问题,我稍微总结一下我学过的算法知识点,以及我觉得值得学习的算法。这些算法与数据结构的学习大多数是零散的,并没有一本把他们全部覆盖的书籍。下面是我觉得值得学习的一些算法以及数据结构,当然,我也会整理一些看过
大学四年自学走来,这些私藏的实用工具/学习网站我贡献出来了
大学四年,看课本是不可能一直看课本的了,对于学习,特别是自学,善于搜索网上的一些资源来辅助,还是非常有必要的,下面我就把这几年私藏的各种资源,网站贡献出来给你们。主要有:电子书搜索、实用工具、在线视频学习网站、非视频学习网站、软件下载、面试/求职必备网站。 注意:文中提到的所有资源,文末我都给你整理好了,你们只管拿去,如果觉得不错,转发、分享就是最大的支持了。 一、电子书搜索 对于大部分程序员...
linux系列之常用运维命令整理笔录
本博客记录工作中需要的linux运维命令,大学时候开始接触linux,会一些基本操作,可是都没有整理起来,加上是做开发,不做运维,有些命令忘记了,所以现在整理成博客,当然vi,文件操作等就不介绍了,慢慢积累一些其它拓展的命令,博客不定时更新 顺便拉下票,我在参加csdn博客之星竞选,欢迎投票支持,每个QQ或者微信每天都可以投5票,扫二维码即可,http://m234140.nofollow.ax.
比特币原理详解
一、什么是比特币 比特币是一种电子货币,是一种基于密码学的货币,在2008年11月1日由中本聪发表比特币白皮书,文中提出了一种去中心化的电子记账系统,我们平时的电子现金是银行来记账,因为银行的背后是国家信用。去中心化电子记账系统是参与者共同记账。比特币可以防止主权危机、信用风险。其好处不多做赘述,这一层面介绍的文章很多,本文主要从更深层的技术原理角度进行介绍。 二、问题引入 假设现有4个人...
Python 基础(一):入门必备知识
目录1 标识符2 关键字3 引号4 编码5 输入输出6 缩进7 多行8 注释9 数据类型10 运算符10.1 常用运算符10.2 运算符优先级 1 标识符 标识符是编程时使用的名字,用于给变量、函数、语句块等命名,Python 中标识符由字母、数字、下划线组成,不能以数字开头,区分大小写。 以下划线开头的标识符有特殊含义,单下划线开头的标识符,如:_xxx ,表示不能直接访问的类属性,需通过类提供
这30个CSS选择器,你必须熟记(上)
关注前端达人,与你共同进步CSS的魅力就是让我们前端工程师像设计师一样进行网页的设计,我们能轻而易举的改变颜色、布局、制作出漂亮的影音效果等等,我们只需要改几行代码,不需...
国产开源API网关项目进入Apache孵化器:APISIX
点击蓝色“程序猿DD”关注我回复“资源”获取独家整理的学习资料!近日,又有一个开源项目加入了这个Java开源界大名鼎鼎的Apache基金会,开始进行孵化器。项目名称:AP...
程序员接私活怎样防止做完了不给钱?
首先跟大家说明一点,我们做 IT 类的外包开发,是非标品开发,所以很有可能在开发过程中会有这样那样的需求修改,而这种需求修改很容易造成扯皮,进而影响到费用支付,甚至出现做完了项目收不到钱的情况。 那么,怎么保证自己的薪酬安全呢? 我们在开工前,一定要做好一些证据方面的准备(也就是“讨薪”的理论依据),这其中最重要的就是需求文档和验收标准。一定要让需求方提供这两个文档资料作为开发的基础。之后开发
网页实现一个简单的音乐播放器(大佬别看。(⊙﹏⊙))
今天闲着无事,就想写点东西。然后听了下歌,就打算写个播放器。 于是乎用h5 audio的加上js简单的播放器完工了。 欢迎 改进 留言。 演示地点跳到演示地点 html代码如下`&lt;!DOCTYPE html&gt; &lt;html&gt; &lt;head&gt; &lt;title&gt;music&lt;/title&gt; &lt;meta charset="utf-8"&gt
Python十大装B语法
Python 是一种代表简单思想的语言,其语法相对简单,很容易上手。不过,如果就此小视 Python 语法的精妙和深邃,那就大错特错了。本文精心筛选了最能展现 Python 语法之精妙的十个知识点,并附上详细的实例代码。如能在实战中融会贯通、灵活使用,必将使代码更为精炼、高效,同时也会极大提升代码B格,使之看上去更老练,读起来更优雅。 1. for - else 什么?不是 if 和 else 才
数据库优化 - SQL优化
前面一篇文章从实例的角度进行数据库优化,通过配置一些参数让数据库性能达到最优。但是一些“不好”的SQL也会导致数据库查询变慢,影响业务流程。本文从SQL角度进行数据库优化,提升SQL运行效率。 判断问题SQL 判断SQL是否有问题时可以通过两个表象进行判断: 系统级别表象 CPU消耗严重 IO等待严重 页面响应时间过长
2019年11月中国大陆编程语言排行榜
2019年11月2日,我统计了某招聘网站,获得有效程序员招聘数据9万条。针对招聘信息,提取编程语言关键字,并统计如下: 编程语言比例 rank pl_ percentage 1 java 33.62% 2 c/c++ 16.42% 3 c_sharp 12.82% 4 javascript 12.31% 5 python 7.93% 6 go 7.25% 7
通俗易懂地给女朋友讲:线程池的内部原理
餐厅的约会 餐盘在灯光的照耀下格外晶莹洁白,女朋友拿起红酒杯轻轻地抿了一小口,对我说:“经常听你说线程池,到底线程池到底是个什么原理?”我楞了一下,心里想女朋友今天是怎么了,怎么突然问出这么专业的问题,但做为一个专业人士在女朋友面前也不能露怯啊,想了一下便说:“我先给你讲讲我前同事老王的故事吧!” 大龄程序员老王 老王是一个已经北漂十多年的程序员,岁数大了,加班加不动了,升迁也无望,于是拿着手里
经典算法(5)杨辉三角
杨辉三角 是经典算法,这篇博客对它的算法思想进行了讲解,并有完整的代码实现。
编写Spring MVC控制器的14个技巧
本期目录 1.使用@Controller构造型 2.实现控制器接口 3.扩展AbstractController类 4.为处理程序方法指定URL映射 5.为处理程序方法指定HTTP请求方法 6.将请求参数映射到处理程序方法 7.返回模型和视图 8.将对象放入模型 9.处理程序方法中的重定向 10.处理表格提交和表格验证 11.处理文件上传 12.在控制器中自动装配业务类 ...
腾讯算法面试题:64匹马8个跑道需要多少轮才能选出最快的四匹?
昨天,有网友私信我,说去阿里面试,彻底的被打击到了。问了为什么网上大量使用ThreadLocal的源码都会加上private static?他被难住了,因为他从来都没有考虑过这个问题。无独有偶,今天笔者又发现有网友吐槽了一道腾讯的面试题,我们一起来看看。 腾讯算法面试题:64匹马8个跑道需要多少轮才能选出最快的四匹? 在互联网职场论坛,一名程序员发帖求助到。二面腾讯,其中一个算法题:64匹
面试官:你连RESTful都不知道我怎么敢要你?
面试官:了解RESTful吗? 我:听说过。 面试官:那什么是RESTful? 我:就是用起来很规范,挺好的 面试官:是RESTful挺好的,还是自我感觉挺好的 我:都挺好的。 面试官:… 把门关上。 我:… 要干嘛?先关上再说。 面试官:我说出去把门关上。 我:what ?,夺门而去 文章目录01 前言02 RESTful的来源03 RESTful6大原则1. C-S架构2. 无状态3.统一的接
求小姐姐抠图竟遭白眼?痛定思痛,我决定用 Python 自力更生!
点击蓝色“Python空间”关注我丫加个“星标”,每天一起快乐的学习大家好,我是 Rocky0429,一个刚恰完午饭,正在用刷网页浪费生命的蒟蒻...一堆堆无聊八卦信息的网页内容慢慢使我的双眼模糊,一个哈欠打出了三斤老泪,就在此时我看到了一张图片:是谁!是谁把我女朋友的照片放出来的!awsl!太好看了叭...等等,那个背景上的一堆鬼画符是什么鬼?!真是看不下去!叔叔婶婶能忍,隔壁老王的三姨妈的四表...
为啥国人偏爱Mybatis,而老外喜欢Hibernate/JPA呢?
关于SQL和ORM的争论,永远都不会终止,我也一直在思考这个问题。昨天又跟群里的小伙伴进行了一番讨论,感触还是有一些,于是就有了今天这篇文。 声明:本文不会下关于Mybatis和JPA两个持久层框架哪个更好这样的结论。只是摆事实,讲道理,所以,请各位看官勿喷。 一、事件起因 关于Mybatis和JPA孰优孰劣的问题,争论已经很多年了。一直也没有结论,毕竟每个人的喜好和习惯是大不相同的。我也看
SQL-小白最佳入门sql查询一
不要偷偷的查询我的个人资料,即使你再喜欢我,也不要这样,真的不好;
项目中的if else太多了,该怎么重构?
介绍 最近跟着公司的大佬开发了一款IM系统,类似QQ和微信哈,就是聊天软件。我们有一部分业务逻辑是这样的 if (msgType = "文本") { // dosomething } else if(msgType = "图片") { // doshomething } else if(msgType = "视频") { // doshomething } else { // doshom...
致 Python 初学者
欢迎来到“Python进阶”专栏!来到这里的每一位同学,应该大致上学习了很多 Python 的基础知识,正在努力成长的过程中。在此期间,一定遇到了很多的困惑,对未来的学习方向感到迷茫。我非常理解你们所面临的处境。我从2007年开始接触 python 这门编程语言,从2009年开始单一使用 python 应对所有的开发工作,直至今天。回顾自己的学习过程,也曾经遇到过无数的困难,也曾经迷茫过、困惑过。开办这个专栏,正是为了帮助像我当年一样困惑的 Python 初学者走出困境、快速成长。希望我的经验能真正帮到你
“狗屁不通文章生成器”登顶GitHub热榜,分分钟写出万字形式主义大作
一、垃圾文字生成器介绍 最近在浏览GitHub的时候,发现了这样一个骨骼清奇的雷人项目,而且热度还特别高。 项目中文名:狗屁不通文章生成器 项目英文名:BullshitGenerator 根据作者的介绍,他是偶尔需要一些中文文字用于GUI开发时测试文本渲染,因此开发了这个废话生成器。但由于生成的废话实在是太过富于哲理,所以最近已经被小伙伴们给玩坏了。 他的文风可能是这样的: 你发现,...
程序员:我终于知道post和get的区别
是一个老生常谈的话题,然而随着不断的学习,对于以前的认识有很多误区,所以还是需要不断地总结的,学而时习之,不亦说乎
《程序人生》系列-这个程序员只用了20行代码就拿了冠军
你知道的越多,你不知道的越多 点赞再看,养成习惯GitHub上已经开源https://github.com/JavaFamily,有一线大厂面试点脑图,欢迎Star和完善 前言 这一期不算《吊打面试官》系列的,所有没前言我直接开始。 絮叨 本来应该是没有这期的,看过我上期的小伙伴应该是知道的嘛,双十一比较忙嘛,要值班又要去帮忙拍摄年会的视频素材,还得搞个程序员一天的Vlog,还要写BU...
相关热词 c# 图片上传 c# gdi 占用内存 c#中遍历字典 c#控制台模拟dos c# 斜率 最小二乘法 c#进程延迟 c# mysql完整项目 c# grid 总行数 c# web浏览器插件 c# xml 生成xsd
立即提问