创建angular-cli项目,ng serve之后打开的不是预想的结果?求大神指点。(angular小白一枚)

运行效果:图片说明
操作步骤:
1.ng new angular-demo
图片说明图片说明

2.ng serve
图片说明

注释:看到别人搭建完成运行效果时介样的:

Csdn user default icon
上传中...
上传图片
插入图片
抄袭、复制答案,以达到刷声望分或其他目的的行为,在CSDN问答是严格禁止的,一经发现立刻封号。是时候展现真正的技术了!
其他相关推荐
angular-cli.json这个文件在哪?
angular-cli.json这个文件在哪? 我要配置这个文本编辑器 http://www.07net01.com/2017/02/1811011.html
win7 X64,安装angular-cli报错
各位大神好,npm install -g @angular/cli 时报一个“CL.exe”不存在的错误,在环境变量添加了一下,然后又报了个新错误,求助大神解决。 注:cmd已用管理员用户打开 报错如下: ``` “C:\Program Files\nodejs\node_global\node_modules\@angular\cli\node_modules\nod e-sass\build\binding.sln”(默认目标) (1) -> “C:\Program Files\nodejs\node_global\node_modules\@angular\cli\node_modules\nod e-sass\build\binding.vcxproj.metaproj”(默认目标) (2) -> “C:\Program Files\nodejs\node_global\node_modules\@angular\cli\node_modules\nod e-sass\build\src\libsass.vcxproj”(默认目标) (3) -> (ClCompile 目标) -> cl : 命令行 warning D9024: 无法识别的源文件类型“EnumerateProviders”,假定为 对象文件 [C:\Program Fi les\nodejs\node_global\node_modules\@angular\cli\node_modules\node-sass\build\s rc\libsass.vcxproj] cl : 命令行 warning D9027: 源文件“EnumerateProviders”被忽略 [C:\Program File s\nodejs\n ode_global\node_modules\@angular\cli\node_modules\node-sass\build\src\libsass.v cxproj] cl : 命令行 warning D9024: 无法识别的源文件类型“EnumerateProviders”,假定为 对象文件 [C:\Program Fi les\nodejs\node_global\node_modules\@angular\cli\node_modules\node-sass\build\s rc\libsass.vcxproj] cl : 命令行 warning D9027: 源文件“EnumerateProviders”被忽略 [C:\Program File s\nodejs\n ode_global\node_modules\@angular\cli\node_modules\node-sass\build\src\libsass.v cxproj] cl : 命令行 warning D9024: 无法识别的源文件类型“EnumerateProviders”,假定为 对象文件 [C:\Program Fi les\nodejs\node_global\node_modules\@angular\cli\node_modules\node-sass\build\s rc\libsass.vcxproj] cl : 命令行 warning D9027: 源文件“EnumerateProviders”被忽略 [C:\Program File s\nodejs\n ode_global\node_modules\@angular\cli\node_modules\node-sass\build\src\libsass.v cxproj] “C:\Program Files\nodejs\node_global\node_modules\@angular\cli\node_modules\nod e-sass\build\binding.sln”(默认目标) (1) -> “C:\Program Files\nodejs\node_global\node_modules\@angular\cli\node_modules\nod e-sass\build\binding.vcxproj.metaproj”(默认目标) (2) -> “C:\Program Files\nodejs\node_global\node_modules\@angular\cli\node_modules\nod e-sass\build\src\libsass.vcxproj”(默认目标) (3) -> (ClCompile 目标) -> c1xx : fatal error C1081: “totalPro=18" \GF \Gm- \MT \GS \Gy \fp:precise \Zc: wchar_t \Zc:forScope \Zc:inline \GR- \FoRelease\obj\libsass\ \FdRelease\obj\lib sass\libsass.pdb \Gd \TP \wd4267 \wd4351 \wd4355 \wd4800 \wd4251 \errorReport:q ueue \GR \EHsc \MP ..\..\src\libsass\src\ast.cpp ..\..\src\libsass\src\ast_fwd_ decl.cpp ..\..\src\libsass\src\base64vlq.cpp ..\..\src\libsass\src\bind.cpp ..\ ..\src\libsass\src\check_nesting.cpp ..\..\src\libsass\src\color_maps.cpp ..\.. \src\libsass\src\constants.cpp ..\..\src\libsass\src\context.cpp ..\..\src\libs ass\src\cssize.cpp ..\..\src\libsass\src\emitter.cpp ..\..\src\libsass\src\envi ronment.cpp ..\..\src\libsass\src\error_handling.cpp ..\..\src\libsass\src\eval .cpp ..\..\src\libsass\src\expand.cpp ..\..\src\libsass\src\extend.cpp ..\..\sr c\libsass\src\file.cpp ..\..\src\libsass\src\functions.cpp ..\..\src\libsass\sr c\inspect.cpp ..\..\src\libsass\src\json.cpp ..\..\src\libsass\src\lexer.cpp .. \..\src\libsass\src\listize.cpp ..\..\src\libsass\src\memory\SharedPtr.cpp ..\. .\src\libsass\src\node.cpp ..\..\src\libsass\src\output.cpp ..\..\src\libsass\s rc\parser.cpp ..\..\src\libsass\src\plugins.cpp ..\..\src\libsass\src\position. cpp ..\..\src\libsass\src\prelexer.cpp ..\..\src\libsass\src\remove_placeholder s.cpp ..\..\src\libsass\src\sass.cpp ..\..\src\libsass\src\sass2scss.cpp ..\..\ src\libsass\src\sass_context.cpp ..\..\src\libsass\src\sass_functions.cpp ..\.. \src\libsass\src\sass_util.cpp ..\..\src\libsass\src\sass_values.cpp ..\..\src\ libsass\src\source_map.cpp ..\..\src\libsass\src\subset_map.cpp ..\..\src\libsa ss\src\to_c.cpp ..\..\src\libsass\src\to_value.cpp ..\..\src\libsass\src\units. cpp ..\..\src\libsass\src\utf8_string.cpp ..\..\src\libsass\src\util.cpp ..\..\ src\libsass\src\values.cpp”: 文件名太长 [C:\Program Files\nodejs\node_global\n ode_modules\@angular\cli\node_modules\node-sass\build\src\libsass.vcxproj] 6 个警告 1 个错误 已用时间 00:00:01.01 gyp ERR! build error gyp ERR! stack Error: `C:\Program Files (x86)\MSBuild\14.0\bin\msbuild.exe` fail ed with exit code: 1 gyp ERR! stack at ChildProcess.onExit (C:\Program Files\nodejs\node_global\n ode_modules\@angular\cli\node_modules\node-gyp\lib\build.js:258:23) gyp ERR! stack at emitTwo (events.js:125:13) gyp ERR! stack at ChildProcess.emit (events.js:213:7) gyp ERR! stack at Process.ChildProcess._handle.onexit (internal/child_proces s.js:200:12) gyp ERR! System Windows_NT 6.1.7601 gyp ERR! command "C:\\Program Files\\nodejs\\node.exe" "C:\\Program Files\\nodej s\\node_global\\node_modules\\@angular\\cli\\node_modules\\node-gyp\\bin\\node-g yp.js" "rebuild" "--verbose" "--libsass_ext=" "--libsass_cflags=" "--libsass_ldf lags=" "--libsass_library=" gyp ERR! cwd C:\Program Files\nodejs\node_global\node_modules\@angular\cli\node_ modules\node-sass gyp ERR! node -v v8.7.0 gyp ERR! node-gyp -v v3.6.2 gyp ERR! not ok Build failed with error code: 1 npm ERR! path C:\Program Files\nodejs\node_global\node_modules\@angular\cli\node _modules\scss-tokenizer\node_modules npm ERR! code EPERM npm ERR! errno -4048 npm ERR! syscall lstat npm ERR! Error: EPERM: operation not permitted, lstat 'C:\Program Files\nodejs\n ode_global\node_modules\@angular\cli\node_modules\scss-tokenizer\node_modules' npm ERR! { Error: EPERM: operation not permitted, lstat 'C:\Program Files\nodej s\node_global\node_modules\@angular\cli\node_modules\scss-tokenizer\node_modules ' npm ERR! stack: 'Error: EPERM: operation not permitted, lstat \'C:\\Program Fi les\\nodejs\\node_global\\node_modules\\@angular\\cli\\node_modules\\scss-tokeni zer\\node_modules\'', npm ERR! errno: -4048, npm ERR! code: 'EPERM', npm ERR! syscall: 'lstat', npm ERR! path: 'C:\\Program Files\\nodejs\\node_global\\node_modules\\@angular \\cli\\node_modules\\scss-tokenizer\\node_modules' } npm ERR! npm ERR! Please try running this command again as root/Administrator. npm ERR! A complete log of this run can be found in: npm ERR! C:\Program Files\nodejs\node_cache\_logs\2017-10-25T01_39_52_411Z-d ebug.log ```
angular-cli node sqlite3编译出错
1. 描述问题 使用angular-universal创建服务时,在node里添加sqlit3模块,添加后再编译的时候总是报错,导致无法执行 2.相关代码 ``` const sqlite3 = require('sqlite3').verbose(); const db = new sqlite3.Database('./src/assets/NLAT.1.db'); db.all("SELECT * from blah blah blah where this=",function(err,rows){ //rows contain values while errors, well you can figure out. }); ``` 3.报错信息 ``` E:\project\NetWork-Analysis\dist\server.js:33542 throw new Error("package.json does not exist at " + package_json_path); ^ Error: package.json does not exist at E:\package.json at Object.exports.find (E:\project\NetWork-Analysis\dist\server.js:33542:15) at Object.<anonymous> (E:\project\NetWork-Analysis\dist\server.js:23111:27) at Object.module.exports (E:\project\NetWork-Analysis\dist\server.js:23317:30) at __webpack_require__ (E:\project\NetWork-Analysis\dist\server.js:20:30) at Module.<anonymous> (E:\project\NetWork-Analysis\dist\server.js:120:17) at __webpack_require__ (E:\project\NetWork-Analysis\dist\server.js:20:30) at E:\project\NetWork-Analysis\dist\server.js:84:18 at Object.<anonymous> (E:\project\NetWork-Analysis\dist\server.js:87:10) at Module._compile (internal/modules/cjs/loader.js:776:30) at Object.Module._extensions..js (internal/modules/cjs/loader.js:787:10) ``` 4.尝试过的方式,方法,报错内容提示 网上搜索过,但是没有找到相关的报错信息,报错出现在npm run serve:ssr之后,build:ssr都可以执行并编译
angular路由 angular-ui-router
angular-ui-router 里的路由定义,.state()哪里怎么导入指定路径的controller代码 大神求助呀
关于generator-angular-fullstack目录的问题
generator-angular-fullstack创建后里面有client/components目录,这个目录中的文件是怎么产生的?菜鸟,求大神指导![图片说明](https://img-ask.csdn.net/upload/201508/26/1440571373_908692.png)
angular2 导入项目 运行报错
本机环境: C:\Users\Administrator>node -v v10.16.3 C:\Users\Administrator>npm -v 6.9.0 angular版本:@angular:8.2.4 导入项目,运行的时候报错: ``` D:\Workspace\Web_Workspack\cncl_web>ng serve An unhandled exception occurred: Cannot find module '@angular/compiler-cli' See "C:\Users\ADMINI~1\AppData\Local\Temp\ng-fKL8Bh\angular-errors.log" for further details. ``` 项目:package.json ``` { "name": "bjproject", "version": "0.0.0", "scripts": { "ng": "ng", "start": "ng serve", "build": "ng build", "test": "ng test", "lint": "ng lint", "e2e": "ng e2e" }, "private": true, "dependencies": { "@angular/animations": "^6.1.0", "@angular/common": "^6.1.0", "@angular/compiler": "^6.1.0", "@angular/core": "^6.1.0", "@angular/forms": "^6.1.0", "@angular/http": "^6.1.0", "@angular/platform-browser": "^6.1.0", "@angular/platform-browser-dynamic": "^6.1.0", "@angular/router": "^6.1.0", "@types/jquery": "^1.12.4", "bootstrap": "^3.3.7", "classlist.js": "^1.1.20150312", "core-js": "^2.5.4", "echarts": "^4.2.0-rc.1", "font-awesome": "^4.7.0", "jquery": "^1.12.4", "ng-zorro-antd": "^1.6.0", "ng2-cookies": "^1.0.12", "rxjs": "~6.2.0", "web-animations-js": "^2.3.1", "zone.js": "~0.8.26" }, "devDependencies": { "@angular-devkit/build-angular": "~0.8.0", "@angular/cli": "~6.2.4", "@angular/compiler-cli": "^6.1.0", "@angular/language-service": "^6.1.0", "@types/jasmine": "~2.8.8", "@types/jasminewd2": "~2.0.3", "@types/node": "~8.9.4", "codelyzer": "~4.3.0", "jasmine-core": "~2.99.1", "jasmine-spec-reporter": "~4.2.1", "karma": "~3.0.0", "karma-chrome-launcher": "~2.2.0", "karma-coverage-istanbul-reporter": "~2.0.1", "karma-jasmine": "~1.1.2", "karma-jasmine-html-reporter": "^0.2.2", "protractor": "~5.4.0", "ts-node": "~7.0.0", "tslint": "~5.11.0", "typescript": "~2.9.2", "bootstrap": "^3.3.7" } } ```
AngularJs1和angular-ui-route.js,点击导航栏切换页面,滚动条每次都会置顶
请教一个问题,我用的是AngularJs1和angular-ui-route.js,点击导航栏切换页面,页面虽然没有刷新,但滚动条怎么每次都会置顶啊,希望它能停留在之前浏览的位置 网上找了很久都没找到答案,急求
ng-alain cli命令无效
![图片说明](https://img-ask.csdn.net/upload/202001/06/1578302398_731524.png) 一开始是都能执行的执行的,现在除了module都报这个错误,创建新项目也是可以
angular项目引用ng-zorro-antd运行时报错
ERROR in node_modules/ng-zorro-antd/empty/nz-embed-empty.component.d.ts(17,17): error TS1110: Type expected. node_modules/ng-zorro-antd/empty/nz-empty.component.d.ts(11,17): error TS1110: Type expected. node_modules/ng-zorro-antd/menu/nz-menu.service.d.ts(10,13): error TS1110: Type expected. node_modules/ng-zorro-antd/menu/nz-menu.service.d.ts(10,90): error TS1005: '(' expected. node_modules/ng-zorro-antd/menu/nz-submenu.component.d.ts(18,23): error TS1110: Type expected. node_modules/ng-zorro-antd/menu/nz-submenu.service.d.ts(9,12): error TS1110: Type expected. node_modules/ng-zorro-antd/menu/nz-submenu.service.d.ts(9,57): error TS1005: '(' expected. node_modules/ng-zorro-antd/menu/nz-submenu.service.d.ts(15,16): error TS1110: Type expected. node_modules/ng-zorro-antd/menu/nz-submenu.service.d.ts(15,50): error TS1005: '(' expected. node_modules/ng-zorro-antd/select/nz-select.service.d.ts(23,12): error TS1110: Type expected. node_modules/ng-zorro-antd/select/nz-select.service.d.ts(23,46): error TS1005: '(' expected. node_modules/ng-zorro-antd/select/nz-select.service.d.ts(26,27): error TS1110: Type expected. node_modules/ng-zorro-antd/select/nz-select.service.d.ts(26,59): error TS1005: '(' expected. node_modules/ng-zorro-antd/select/nz-select.service.d.ts(27,19): error TS1110: Type expected. node_modules/ng-zorro-antd/select/nz-select.service.d.ts(27,49): error TS1005: '(' expected. node_modules/ng-zorro-antd/select/nz-select.service.d.ts(28,19): error TS1110: Type expected. node_modules/ng-zorro-antd/select/nz-select.service.d.ts(28,52): error TS1005: '(' expected. node_modules/ng-zorro-antd/select/nz-select.service.d.ts(37,21): error TS1110: Type expected. node_modules/ng-zorro-antd/select/nz-select.service.d.ts(40,8): error TS1005: '(' expected. node_modules/ng-zorro-antd/select/nz-select.service.d.ts(41,13): error TS1110: Type expected. node_modules/ng-zorro-antd/select/nz-select.service.d.ts(41,43): error TS1005: '(' expected. ``` ```
angular的ng-click不触发
``` <label class="item item-input item-input-psw"> <i class="icon-s icon-s-locked"></i> <div class="item-con" > <input type="{{pwshow?'password':'text'}}" ng-model="user.password" placeholder="输入密码" ng-change="iconShow()"> <div ng-class="{true: 'icon-s-clear-show', false: 'icon-s-clear-hide'}[isIconActive]" ng-click="iconClear()"></div> <a href="javascript:;" class="eye-click" item-end ng-Class="pwshow?'eyeshow':'eyehide'" ng-click="pwshow = !pwshow" > <div class="icon-s-eye"></div> </a> </div> </label> ``` 其中的两个ng-click事件不触发,如果绑定在外层的div上可以触发,可见不是函数等其他问题。 希望大神解决
angular 用ng serve的时候报错
![图片说明](https://img-ask.csdn.net/upload/201812/14/1544761967_557624.png) 新建了一个html,然后完整复制了index.html的代码进去,然后就报错了,删掉那个html之后也还有这个问题
angularJS 报错:$http.get is not a function
TypeError: $http.get is not a function at Function.$scope.init (userscore.js:24) at new studentscoreController (userscore.js:37) at Object.e [as invoke] (angular-1.4.4.min.js:39) at $get.Q.instance (angular-1.4.4.min.js:80) at K (angular-1.4.4.min.js:61) at g (angular-1.4.4.min.js:54) at angular-1.4.4.min.js:53 at angular-1.4.4.min.js:20 at n.$get.n.$eval (angular-1.4.4.min.js:133) at n.$get.n.$apply (angular-1.4.4.min.js:133)
angular中 ng serve 命令不能运行,引用资源不能解析
在源码的一个less文件中 第一行代码: @import 'node_modules/@delon/theme/styles/default'; 然后 ng serve 就会报错: Can't resolve './node_modules/@delon/theme/styles/default.less' 为什么引用不了 这个模块 ,去掉以后就没问题
electron-builder 打包angular项目
angular-cli项目,添加了electron模块,用electron-builder去打包,结果报错,说未编译模块 这是执行语句: ``` "ng build --prod --build-optimizer && electron-builder -w" ``` 报错信息: ``` Error: Unresolved node modules: abbrev, are-we-there-yet, aproba, ansi-regex, ajv at E:\project\NetWork-Analysis-elec-b\node_modules\app-builder-lib\src\util\packageDependencies.ts:112:21 From previous event: at Collector.resolveUnresolvedHoisted (E:\project\NetWork-Analysis-elec-b\node_modules\app-builder-lib\src\util\packageDependencies.ts:88:81) at E:\project\NetWork-Analysis-elec-b\node_modules\app-builder-lib\src\util\packageDependencies.ts:83:18 at Generator.next (<anonymous>) at runCallback (timers.js:705:18) at tryOnImmediate (timers.js:676:5) at processImmediate (timers.js:658:5) From previous event: at Collector.collect (E:\project\NetWork-Analysis-elec-b\node_modules\app-builder-lib\src\util\packageDependencies.ts:76:28) at E:\project\NetWork-Analysis-elec-b\node_modules\app-builder-lib\src\util\packageDependencies.ts:47:44 at Generator.next (<anonymous>) at _getProductionDependencies (E:\project\NetWork-Analysis-elec-b\node_modules\app-builder-lib\out\util\packageDependencies.js:92:37) at getProductionDependencies (E:\project\NetWork-Analysis-elec-b\node_modules\app-builder-lib\out\util\packageDependencies.js:83:37) at Lazy.<anonymous> (E:\project\NetWork-Analysis-elec-b\node_modules\app-builder-lib\src\packager.ts:138:24) at Generator.next (<anonymous>) at Lazy.get value [as value] (E:\project\NetWork-Analysis-elec-b\node_modules\lazy-val\src\main.ts:18:25) at E:\project\NetWork-Analysis-elec-b\node_modules\app-builder-lib\out\util\yarn.js:166:90 From previous event: at _getProductionDependencies (E:\project\NetWork-Analysis-elec-b\node_modules\app-builder-lib\out\util\packageDependencies.js:92:37) at getProductionDependencies (E:\project\NetWork-Analysis-elec-b\node_modules\app-builder-lib\out\util\packageDependencies.js:83:37) at Lazy.<anonymous> (E:\project\NetWork-Analysis-elec-b\node_modules\app-builder-lib\src\packager.ts:138:24) at Generator.next (<anonymous>) From previous event: at Lazy.get value [as value] (E:\project\NetWork-Analysis-elec-b\node_modules\lazy-val\src\main.ts:18:25) at E:\project\NetWork-Analysis-elec-b\node_modules\app-builder-lib\out\util\yarn.js:166:90 at Generator.next (<anonymous>) From previous event: at _rebuild (E:\project\NetWork-Analysis-elec-b\node_modules\app-builder-lib\src\util\yarn.ts:179:5) at rebuild (E:\project\NetWork-Analysis-elec-b\node_modules\app-builder-lib\out\util\yarn.js:163:19) at E:\project\NetWork-Analysis-elec-b\node_modules\app-builder-lib\src\util\yarn.ts:20:11 at Generator.next (<anonymous>) at runCallback (timers.js:705:18) at tryOnImmediate (timers.js:676:5) at processImmediate (timers.js:658:5) From previous event: at _installOrRebuild (E:\project\NetWork-Analysis-elec-b\node_modules\app-builder-lib\out\util\yarn.js:71:28) at installOrRebuild (E:\project\NetWork-Analysis-elec-b\node_modules\app-builder-lib\out\util\yarn.js:55:28) at E:\project\NetWork-Analysis-elec-b\node_modules\app-builder-lib\src\packager.ts:509:13 at Generator.next (<anonymous>) From previous event: at Packager.installAppDependencies (E:\project\NetWork-Analysis-elec-b\node_modules\app-builder-lib\src\packager.ts:470:70) at E:\project\NetWork-Analysis-elec-b\node_modules\app-builder-lib\src\packager.ts:420:20 at Generator.next (<anonymous>) From previous event: at Packager.doBuild (E:\project\NetWork-Analysis-elec-b\node_modules\app-builder-lib\src\packager.ts:396:24) at E:\project\NetWork-Analysis-elec-b\node_modules\app-builder-lib\src\packager.ts:366:57 at Generator.next (<anonymous>) at E:\project\NetWork-Analysis-elec-b\node_modules\graceful-fs\graceful-fs.js:111:16 at E:\project\NetWork-Analysis-elec-b\node_modules\graceful-fs\graceful-fs.js:45:10 at FSReqWrap.args [as oncomplete] (fs.js:140:20) From previous event: at Packager._build (E:\project\NetWork-Analysis-elec-b\node_modules\app-builder-lib\src\packager.ts:335:133) at E:\project\NetWork-Analysis-elec-b\node_modules\app-builder-lib\src\packager.ts:331:23 at Generator.next (<anonymous>) at runCallback (timers.js:705:18) at tryOnImmediate (timers.js:676:5) at processImmediate (timers.js:658:5) From previous event: at Packager.build (E:\project\NetWork-Analysis-elec-b\node_modules\app-builder-lib\src\packager.ts:288:14) at build (E:\project\NetWork-Analysis-elec-b\node_modules\app-builder-lib\src\index.ts:59:28) at build (E:\project\NetWork-Analysis-elec-b\node_modules\electron-builder\src\builder.ts:228:10) at then (E:\project\NetWork-Analysis-elec-b\node_modules\electron-builder\src\cli\cli.ts:49:19) ``` 尝试的解决方法,一开始还有两个模块,是jquery和popper.js,后来我通过npm安装后,jquery和popper.js消失了,但其他的还是报错
angular项目执行构建命令 ng build花费时间问题
# angular项目执行构建命令 ng build花费时间问题,有时候2分多钟,有时候要10多分钟,求解? # 执行的时同样的命令 ``` ng build --prod -e=prod --build-optimizer --extract-licenses=false ``` ![这次花费了10多分钟](https://img-ask.csdn.net/upload/201803/13/1520907803_763761.png) ![比上面的少了一位数](https://img-ask.csdn.net/upload/201803/13/1520907890_630096.png)
asp.net core angular4 升级 angular5 后运行报错
升级方式:执行的这个命令 npm install @angular/animations@^5.2.0 @angular/common@^5.2.0 @angular/compiler@^5.2.0 @angular/compiler-cli@^5.2.0 @angular/core@^5.2.0 @angular/forms@^5.2.0 @angular/http@^5.2.0 @angular/platform-browser@^5.2.0 @angular/platform-browser-dynamic@^5.2.0 @angular/platform-server@^5.2.0 @angular/router@^5.2.0 typescript@2.4.2 rxjs@^5.5.2 升级后的包也没有异常 ![图片说明](https://img-ask.csdn.net/upload/201804/24/1524558860_952386.png) 升级编译报错: ![图片说明](https://img-ask.csdn.net/upload/201804/24/1524558472_910150.png) angular/compiler-cli needs to be 2.3.1 or greater. Current version is "5.2.1" 这个错误不知是什么地方的问题。初学请各位大神指教
cordova创建项目失败-------新手求解
安装好了cordova但是创建项目出错 D:\>npm -v 3.10.10 D:\>node -v v6.10.2 D:\>ng -v @angular/cli: 1.2.0 node: 6.10.2 os: win32 x64 D:\>ionic -v 3.5.0 D:\>cordova -v 7.0.1 ![图片说明](https://img-ask.csdn.net/upload/201707/23/1500825496_42526.png) ![图片说明](https://img-ask.csdn.net/upload/201707/23/1500825371_770805.png)
angular使用material的tree组件?
angular使用material的tree组件,进行增删之后需要重新获取数据 ,此时树就会重新收起来,如何让他重新加载树时回到上次的位置?
在angular中使用Echart,步骤如下,请各位大神辛苦看下是啥毛病
1、安装依赖包npm install --save echarts ng2-echarts 2、在angular-cli.json中配置 ![图片说明](https://img-ask.csdn.net/upload/201710/17/1508204327_550755.png) 3、在父组件HomeComponent里面引用 ![图片说明](https://img-ask.csdn.net/upload/201710/17/1508204476_764818.png) 4、在组件FaceComponent里面写数据 ![图片说明](https://img-ask.csdn.net/upload/201710/17/1508204653_129483.png) ![图片说明](https://img-ask.csdn.net/upload/201710/17/1508204702_162116.png) ![图片说明](https://img-ask.csdn.net/upload/201710/17/1508204755_874759.png) 5、在face.component.html中写 ![图片说明](https://img-ask.csdn.net/upload/201710/17/1508204828_351063.png) 6、执行ng s --open 结果 ![图片说明](https://img-ask.csdn.net/upload/201710/17/1508204921_780191.png) 7、执行ng build --target=production --environment=prod 结果是存在问题的,希望大神给看看是啥原因 ![图片说明](https://img-ask.csdn.net/upload/201710/17/1508205010_244917.png)
《奇巧淫技》系列-python!!每天早上八点自动发送天气预报邮件到QQ邮箱
将代码部署服务器,每日早上定时获取到天气数据,并发送到邮箱。 也可以说是一个小人工智障。 思路可以运用在不同地方,主要介绍的是思路。
Linux(服务器编程):15---两种高效的事件处理模式(reactor模式、proactor模式)
前言 同步I/O模型通常用于实现Reactor模式 异步I/O模型则用于实现Proactor模式 最后我们会使用同步I/O方式模拟出Proactor模式 一、Reactor模式 Reactor模式特点 它要求主线程(I/O处理单元)只负责监听文件描述符上是否有事件发生,有的话就立即将时间通知工作线程(逻辑单元)。除此之外,主线程不做任何其他实质性的工作 读写数据,接受新的连接,以及处...
为什么要学数据结构?
一、前言 在可视化化程序设计的今天,借助于集成开发环境可以很快地生成程序,程序设计不再是计算机专业人员的专利。很多人认为,只要掌握几种开发工具就可以成为编程高手,其实,这是一种误解。要想成为一个专业的开发人员,至少需要以下三个条件: 1) 能够熟练地选择和设计各种数据结构和算法 2) 至少要能够熟练地掌握一门程序设计语言 3) 熟知所涉及的相关应用领域的知识 其中,后两个条件比较容易实现,而第一个...
C语言魔塔游戏
很早就很想写这个,今天终于写完了。 游戏截图: 编译环境: VS2017 游戏需要一些图片,如果有想要的或者对游戏有什么看法的可以加我的QQ 2985486630 讨论,如果暂时没有回应,可以在博客下方留言,到时候我会看到。 下面我来介绍一下游戏的主要功能和实现方式 首先是玩家的定义,使用结构体,这个名字是可以自己改变的 struct gamerole { char n
进程通信方式总结与盘点
​ 进程通信是指进程之间的信息交换。这里需要和进程同步做一下区分,进程同步控制多个进程按一定顺序执行,进程通信是一种手段,而进程同步是目标。从某方面来讲,进程通信可以解决进程同步问题。 ​ 首先回顾下我们前面博文中讲到的信号量机制,为了实现进程的互斥与同步,需要在进程间交换一定的信息,因此信号量机制也可以被归为进程通信的一种方式,但是也被称为低级进程通信,主要原因为: 效率低:一次只可操作少量的...
究竟你适不适合买Mac?
我清晰的记得,刚买的macbook pro回到家,开机后第一件事情,就是上了淘宝网,花了500元钱,找了一个上门维修电脑的师傅,上门给我装了一个windows系统。。。。。。 表砍我。。。 当时买mac的初衷,只是想要个固态硬盘的笔记本,用来运行一些复杂的扑克软件。而看了当时所有的SSD笔记本后,最终决定,还是买个好(xiong)看(da)的。 已经有好几个朋友问我mba怎么样了,所以今天尽量客观
听说了吗?阿里双11作战室竟1根网线都没有
双11不光是购物狂欢节,更是对技术的一次“大考”,对于阿里巴巴企业内部运营的基础保障技术而言,亦是如此。 回溯双11历史,这背后也经历过“小米加步枪”的阶段:作战室从随处是网线,交换机放地上的“一地狼藉”;到如今媲美5G的wifi网速,到现场却看不到一根网线;从当年使用商用AP(无线路由器),让光明顶双11当天断网一分钟,到全部使用阿里自研AP……阿里巴巴企业智能事业部工程师们提供的基础保障...
在阿里,40岁的奋斗姿势
在阿里,40岁的奋斗姿势 在阿里,什么样的年纪可以称为老呢?35岁? 在云网络,有这样一群人,他们的平均年龄接近40,却刚刚开辟职业生涯的第二战场。 他们的奋斗姿势是什么样的呢? 洛神赋 “翩若惊鸿,婉若游龙。荣曜秋菊,华茂春松。髣髴兮若轻云之蔽月,飘飖兮若流风之回雪。远而望之,皎若太阳升朝霞;迫而察之,灼若芙蕖出渌波。” 爱洛神,爱阿里云 2018年,阿里云网络产品部门启动洛神2.0升...
关于研发效能提升的思考
研发效能提升是最近比较热门的一个话题,本人根据这几年的工作心得,做了一些思考总结,由于个人深度有限,暂且抛转引入。 三要素 任何生产力的提升都离不开这三个因素:人、流程和工具,少了其中任何一个因素都无法实现。 人,即思想,也就是古人说的“道”,道不同不相为谋,是制高点,也是高层建筑的基石。 流程,即方法,也是古人说的“法”。研发效能的提升,也就是要提高投入产出比,既要增加产出,也要减...
Python爬虫爬取淘宝,京东商品信息
小编是一个理科生,不善长说一些废话。简单介绍下原理然后直接上代码。 使用的工具(Python+pycharm2019.3+selenium+xpath+chromedriver)其中要使用pycharm也可以私聊我selenium是一个框架可以通过pip下载 pip install selenium -i https://pypi.tuna.tsinghua.edu.cn/simple/ 
阿里程序员写了一个新手都写不出的低级bug,被骂惨了。
这种新手都不会范的错,居然被一个工作好几年的小伙子写出来,差点被当场开除了。
Java工作4年来应聘要16K最后没要,细节如下。。。
前奏: 今天2B哥和大家分享一位前几天面试的一位应聘者,工作4年26岁,统招本科。 以下就是他的简历和面试情况。 基本情况: 专业技能: 1、&nbsp;熟悉Sping了解SpringMVC、SpringBoot、Mybatis等框架、了解SpringCloud微服务 2、&nbsp;熟悉常用项目管理工具:SVN、GIT、MAVEN、Jenkins 3、&nbsp;熟悉Nginx、tomca
2020年,冯唐49岁:我给20、30岁IT职场年轻人的建议
点击“技术领导力”关注∆  每天早上8:30推送 作者| Mr.K   编辑| Emma 来源| 技术领导力(ID:jishulingdaoli) 前天的推文《冯唐:职场人35岁以后,方法论比经验重要》,收到了不少读者的反馈,觉得挺受启发。其实,冯唐写了不少关于职场方面的文章,都挺不错的。可惜大家只记住了“春风十里不如你”、“如何避免成为油腻腻的中年人”等不那么正经的文章。 本文整理了冯
程序员该看的几部电影
##1、骇客帝国(1999) 概念:在线/离线,递归,循环,矩阵等 剧情简介: 不久的将来,网络黑客尼奥对这个看似正常的现实世界产生了怀疑。 他结识了黑客崔妮蒂,并见到了黑客组织的首领墨菲斯。 墨菲斯告诉他,现实世界其实是由一个名叫“母体”的计算机人工智能系统控制,人们就像他们饲养的动物,没有自由和思想,而尼奥就是能够拯救人类的救世主。 可是,救赎之路从来都不会一帆风顺,到底哪里才是真实的世界?
入职阿里5年,他如何破解“技术债”?
简介: 作者 | 都铎 作为一名技术人,你常常会听到这样的话: “先快速上线” “没时间改” “再缓一缓吧” “以后再解决” “先用临时方案处理” …… 当你埋下的坑越来越多,不知道哪天哪位同学就会踩上一颗雷。特别赞同“人最大的恐惧就是未知,当技术债可说不可见的时候,才是最让人不想解决的时候。” 作为一个程序员,我们反对复制粘贴,但是我们经常会见到相似的代码,相同的二方包,甚至整个代码...
Python绘图,圣诞树,花,爱心 | Turtle篇
每周每日,分享Python实战代码,入门资料,进阶资料,基础语法,爬虫,数据分析,web网站,机器学习,深度学习等等。 公众号回复【进群】沟通交流吧,QQ扫码进群学习吧 微信群 QQ群 1.画圣诞树 import turtle screen = turtle.Screen() screen.setup(800,600) circle = turtle.Turtle()...
作为一个程序员,CPU的这些硬核知识你必须会!
CPU对每个程序员来说,是个既熟悉又陌生的东西? 如果你只知道CPU是中央处理器的话,那可能对你并没有什么用,那么作为程序员的我们,必须要搞懂的就是CPU这家伙是如何运行的,尤其要搞懂它里面的寄存器是怎么一回事,因为这将让你从底层明白程序的运行机制。 随我一起,来好好认识下CPU这货吧 把CPU掰开来看 对于CPU来说,我们首先就要搞明白它是怎么回事,也就是它的内部构造,当然,CPU那么牛的一个东
破14亿,Python分析我国存在哪些人口危机!
2020年1月17日,国家统计局发布了2019年国民经济报告,报告中指出我国人口突破14亿。 猪哥的朋友圈被14亿人口刷屏,但是很多人并没有看到我国复杂的人口问题:老龄化、男女比例失衡、生育率下降、人口红利下降等。 今天我们就来分析一下我们国家的人口数据吧! 一、背景 1.人口突破14亿 2020年1月17日,国家统计局发布了 2019年国民经济报告 ,报告中指出:年末中国大陆总人口(包括31个
在家远程办公效率低?那你一定要收好这个「在家办公」神器!
相信大家都已经收到国务院延长春节假期的消息,接下来,在家远程办公可能将会持续一段时间。 但是问题来了。远程办公不是人在电脑前就当坐班了,相反,对于沟通效率,文件协作,以及信息安全都有着极高的要求。有着非常多的挑战,比如: 1在异地互相不见面的会议上,如何提高沟通效率? 2文件之间的来往反馈如何做到及时性?如何保证信息安全? 3如何规划安排每天工作,以及如何进行成果验收? ......
作为一个程序员,内存和磁盘的这些事情,你不得不知道啊!!!
截止目前,我已经分享了如下几篇文章: 一个程序在计算机中是如何运行的?超级干货!!! 作为一个程序员,CPU的这些硬核知识你必须会! 作为一个程序员,内存的这些硬核知识你必须懂! 这些知识可以说是我们之前都不太重视的基础知识,可能大家在上大学的时候都学习过了,但是嘞,当时由于老师讲解的没那么有趣,又加上这些知识本身就比较枯燥,所以嘞,大家当初几乎等于没学。 再说啦,学习这些,也看不出来有什么用啊!
2020年的1月,我辞掉了我的第一份工作
其实,这篇文章,我应该早点写的,毕竟现在已经2月份了。不过一些其它原因,或者是我的惰性、还有一些迷茫的念头,让自己迟迟没有试着写一点东西,记录下,或者说是总结下自己前3年的工作上的经历、学习的过程。 我自己知道的,在写自己的博客方面,我的文笔很一般,非技术类的文章不想去写;另外我又是一个还比较热衷于技术的人,而平常复杂一点的东西,如果想写文章写的清楚点,是需要足够...
别低估自己的直觉,也别高估自己的智商
所有群全部吵翻天,朋友圈全部沦陷,公众号疯狂转发。这两周没怎么发原创,只发新闻,可能有人注意到了。我不是懒,是文章写了却没发,因为大家的关注力始终在这次的疫情上面,发了也没人看。当然,我...
Java坑人面试题系列: 包装类(中级难度)
Java Magazine上面有一个专门坑人的面试题系列: https://blogs.oracle.com/javamagazine/quiz-2。 这些问题的设计宗旨,主要是测试面试者对Java语言的了解程度,而不是为了用弯弯绕绕的手段把面试者搞蒙。 如果你看过往期的问题,就会发现每一个都不简单。 这些试题模拟了认证考试中的一些难题。 而 “中级(intermediate)” 和 “高级(ad
深度学习入门笔记(十八):卷积神经网络(一)
欢迎关注WX公众号:【程序员管小亮】 专栏——深度学习入门笔记 声明 1)该文章整理自网上的大牛和机器学习专家无私奉献的资料,具体引用的资料请看参考文献。 2)本文仅供学术交流,非商用。所以每一部分具体的参考资料并没有详细对应。如果某部分不小心侵犯了大家的利益,还望海涵,并联系博主删除。 3)博主才疏学浅,文中如有不当之处,请各位指出,共同进步,谢谢。 4)此属于第一版本,若有错误,还需继续修正与...
这个世界上人真的分三六九等,你信吗?
偶然间,在知乎上看到一个问题 一时间,勾起了我深深的回忆。 以前在厂里打过两次工,做过家教,干过辅导班,做过中介。零下几度的晚上,贴过广告,满脸、满手地长冻疮。 再回首那段岁月,虽然苦,但让我学会了坚持和忍耐。让我明白了,在这个世界上,无论环境多么的恶劣,只要心存希望,星星之火,亦可燎原。 下文是原回答,希望能对你能有所启发。 如果我说,这个世界上人真的分三六九等,...
节后首个工作日,企业们集体开晨会让钉钉挂了
By 超神经场景描述:昨天 2 月 3 日,是大部分城市号召远程工作的第一天,全国有接近 2 亿人在家开始远程办公,钉钉上也有超过 1000 万家企业活跃起来。关键词:十一出行 人脸...
Java基础知识点梳理
Java基础知识点梳理 摘要: 虽然已经在实际工作中经常与java打交道,但是一直没系统地对java这门语言进行梳理和总结,掌握的知识也比较零散。恰好利用这段时间重新认识下java,并对一些常见的语法和知识点做个总结与回顾,一方面为了加深印象,方便后面查阅,一方面为了学好java打下基础。 Java简介 java语言于1995年正式推出,最开始被命名为Oak语言,由James Gosling(詹姆
2020年全新Java学习路线图,含配套视频,学完即为中级Java程序员!!
新的一年来临,突如其来的疫情打破了平静的生活! 在家的你是否很无聊,如果无聊就来学习吧! 世上只有一种投资只赚不赔,那就是学习!!! 传智播客于2020年升级了Java学习线路图,硬核升级,免费放送! 学完你就是中级程序员,能更快一步找到工作! 一、Java基础 JavaSE基础是Java中级程序员的起点,是帮助你从小白到懂得编程的必经之路。 在Java基础板块中有6个子模块的学
B 站上有哪些很好的学习资源?
哇说起B站,在小九眼里就是宝藏般的存在,放年假宅在家时一天刷6、7个小时不在话下,更别提今年的跨年晚会,我简直是跪着看完的!! 最早大家聚在在B站是为了追番,再后来我在上面刷欧美新歌和漂亮小姐姐的舞蹈视频,最近两年我和周围的朋友们已经把B站当作学习教室了,而且学习成本还免费,真是个励志的好平台ヽ(.◕ฺˇд ˇ◕ฺ;)ノ 下面我们就来盘点一下B站上优质的学习资源: 综合类 Oeasy: 综合
你也能看懂的:蒙特卡罗方法
蒙特卡罗方法,也称统计模拟方法,是1940年代中期由于科学技术的发展和电子计算机的发明,而提出的一种以概率统计理论为指导的数值计算方法。是指使用随机数(或更常见的伪随机数)来解决很多计算问题的方法 蒙特卡罗方法可以粗略地分成两类:一类是所求解的问题本身具有内在的随机性,借助计算机的运算能力可以直接模拟这种随机的过程。另一种类型是所求解问题可以转化为某种随机分布的特征数,比如随机事件出现的概率,或...
相关热词 c# 为空 判断 委托 c#记事本颜色 c# 系统默认声音 js中调用c#方法参数 c#引入dll文件报错 c#根据名称实例化 c#从邮件服务器获取邮件 c# 保存文件夹 c#代码打包引用 c# 压缩效率
立即提问