linux 安装openjdk8后配置了环境变量,运行javac,为什么提示"Command 'javac' not found" ?

我在终端(ubuntu19.10)用 sudo install openjdk安装的jdk
然后用 gedit /etc/profile
在文件末尾增加了几行:

export JAVA_HOME=/usr/lib/jvm/java-8-openjdk-amd64
export JRE_HOME=${JAVA_HOME}/jre
export CLASSPATH=.:${JAVA_HOME}/lib:${JRE_HOME}/lib
export PATH=${JAVA_HOME}/bin:$PATH

(我的jdk安装目录是/usr/lib/jvm/java-8-openjdk-amd64/jre/bin/java)

之后保存并source /etc/profile,然后reboot,
输入javac,就出现了如题的问题,求救。。。

1个回答

Csdn user default icon
上传中...
上传图片
插入图片
抄袭、复制答案,以达到刷声望分或其他目的的行为,在CSDN问答是严格禁止的,一经发现立刻封号。是时候展现真正的技术了!
其他相关推荐
linux小白,openjdk问题
想请教个问题:我用虚拟机装CentOS7系统,里面有自带的openjdk(我想直接用这个jdk),运行java -version 显示已安装,我还要再设置环境变量吗?我的运行界面[MUTTOU@localhost~]$ java文件放在哪个目录下合适? locate jdk 命令查找所在: /usr/lib/jvm/java-1.7.0-openjdk-1.7.0.51-2.4.5.5.el7.x86_64/jre/bin ......(网上看,后面都没jre了) 搞了个通宵,也没搞明白,刚接触linux,运行javac HelloWorld.java 一直找不到。。。 希望给予解答,非常感谢!!!
树莓派里面如何正确配置java的环境变量
最近入树莓派,也初学Linux,想在上面搭建一个轻量级的Web服务器 之前用apt-get install 命令搭建了openJDK+Tomcat7+Mysql成功 后来发现openJDK部分功能受限,想安装Oracle官方的JDK 下载后配置环境变量,发现网上的都是各说各话 而且很多都是错误的 我现在的/ect/profile配置文件如下 ``` # /etc/profile: system-wide .profile file for the Bourne shell (sh(1)) # and Bourne compatible shells (bash(1), ksh(1), ash(1), ...). if [ "`id -u`" -eq 0 ]; then PATH="/usr/local/sbin:/usr/local/bin:/usr/sbin:/usr/bin:/sbin:/bin" else PATH="/usr/local/sbin:/usr/local/bin:/usr/sbin:/usr/bin:/sbin:/bin:/usr/local/games:/usr/games" fi export PATH if [ "$PS1" ]; then if [ "$BASH" ] && [ "$BASH" != "/bin/sh" ]; then # The file bash.bashrc already sets the default PS1. # PS1='\h:\w\$ ' if [ -f /etc/bash.bashrc ]; then . /etc/bash.bashrc fi else if [ "`id -u`" -eq 0 ]; then PS1='# ' else PS1='$ ' fi fi fi # The default umask is now handled by pam_umask. # See pam_umask(8) and /etc/login.defs. if [ -d /etc/profile.d ]; then for i in /etc/profile.d/*.sh; do if [ -r $i ]; then . $i fi done unset i fi JAVA_HOME=/usr/local/jdk1.8.0 CLASSPATH=.:$JAVA_HOME/lib/tools.jar:$JAVA_HOME/lib/dt.jar PATH=$JAVA_HOME/bin:$PATH export JAVA_HOME export PATH export CLASSPATH ``` 命令行输入java -version提示找不到java 请大家帮帮忙
jdk中的jre/lib/security目录下为啥要导入证书
之前项目中用httpclient调用第三方接口,走的是https,之前正常运行。后来测试把测试环境的jdk换成了openjdk,后运行报错 报错信息如下 ``` java.lang.RuntimeException: javax.net.ssl.SSLException: java.lang.RuntimeException: Unexpected error: java.security.InvalidAlgorithmParameterException: the trustAnchors parameter must be non-empty ``` 后来排查发现之前jdk的jre/lib/sercurity目录下有cer证书,而新安装的openjdk目录下没有证书,后来把jdk目录下证书拷贝到openjdk目录下,就好了。 想确认下这个证书的作用是什么。是不是可以认为就好比浏览器访问https需要导入证书。
debian10.2安装phpstorm2019.3.1时出现了问题,求大佬解答
debian 10.2 phpstorm 2019.3.1 在设置完环境变量后,运行phpstorm与直接进入文件目录执行./phpstorm.sh出现的都是这个问题,求各位大佬给个解决方法,万分感谢 另外我实在是莫得币子了,知识无价,学海无涯,有任何解决办法我都会去尝试,谢谢大家了 OpenJDK 64-Bit Server VM warning: Option UseConcMarkSweepGC was deprecated in version 9.0 and will likely be removed in a future release. No protocol specified 2020-01-19 23:59:09,363 [ 2351] WARN - #com.intellij.idea.Main - java.awt.AWTError: Can't connect to X11 window server using ':0' as the value of the DISPLAY variable. java.util.concurrent.ExecutionException: java.awt.AWTError: Can't connect to X11 window server using ':0' as the value of the DISPLAY variable. at java.base/java.util.concurrent.CompletableFuture.reportGet(CompletableFuture.java:395) at java.base/java.util.concurrent.CompletableFuture.get(CompletableFuture.java:1999) at com.intellij.idea.StartupUtil.runInEdtAndWait(StartupUtil.java:678) at com.intellij.idea.StartupUtil.lambda$showUserAgreementAndConsentsIfNeeded$15(StartupUtil.java:673) at com.intellij.ui.AppUIUtil.showConsentsAgreementIfNeeded(AppUIUtil.java:332) at com.intellij.idea.StartupUtil.showUserAgreementAndConsentsIfNeeded(StartupUtil.java:673) at com.intellij.idea.StartupUtil.startApp(StartupUtil.java:231) at com.intellij.idea.StartupUtil.prepareApp(StartupUtil.java:213) at com.intellij.ide.plugins.MainRunner.lambda$start$0(MainRunner.java:39) at java.base/java.lang.Thread.run(Thread.java:834) Caused by: java.awt.AWTError: Can't connect to X11 window server using ':0' as the value of the DISPLAY variable. at java.desktop/sun.awt.X11GraphicsEnvironment.initDisplay(Native Method) at java.desktop/sun.awt.X11GraphicsEnvironment$1.run(X11GraphicsEnvironment.java:102) at java.base/java.security.AccessController.doPrivileged(Native Method) at java.desktop/sun.awt.X11GraphicsEnvironment.<clinit>(X11GraphicsEnvironment.java:61) at java.base/java.lang.Class.forName0(Native Method) at java.base/java.lang.Class.forName(Class.java:315) at java.desktop/java.awt.GraphicsEnvironment$LocalGE.createGE(GraphicsEnvironment.java:101) at java.desktop/java.awt.GraphicsEnvironment$LocalGE.<clinit>(GraphicsEnvironment.java:83) at java.desktop/java.awt.GraphicsEnvironment.getLocalGraphicsEnvironment(GraphicsEnvironment.java:129) at java.desktop/sun.awt.X11.XToolkit.<clinit>(XToolkit.java:232) at java.base/java.lang.Class.forName0(Native Method) at java.base/java.lang.Class.forName(Class.java:315) at java.desktop/java.awt.Toolkit$2.run(Toolkit.java:588) at java.desktop/java.awt.Toolkit$2.run(Toolkit.java:583) at java.base/java.security.AccessController.doPrivileged(Native Method) at java.desktop/java.awt.Toolkit.getDefaultToolkit(Toolkit.java:582) at java.desktop/java.awt.Toolkit.getEventQueue(Toolkit.java:1499) at java.desktop/java.awt.EventQueue.invokeLater(EventQueue.java:1318) at com.intellij.idea.StartupUtil.lambda$scheduleInitUi$9(StartupUtil.java:265) at java.base/java.util.concurrent.ThreadPoolExecutor.runWorker(ThreadPoolExecutor.java:1128) at java.base/java.util.concurrent.ThreadPoolExecutor$Worker.run(ThreadPoolExecutor.java:628) ... 1 more 2020-01-19 23:59:10,475 [ 3463] ERROR - tellij.diagnostic.LoadingState - Should be called at least in the state LAF_INITIALIZED, the current state is: BOOTSTRAP Current violators count: 1 java.lang.Throwable at com.intellij.diagnostic.LoadingState.logStateError(LoadingState.java:55) at com.intellij.diagnostic.LoadingState.checkOccurred(LoadingState.java:51) at com.intellij.util.ui.UIUtil.<clinit>(UIUtil.java:83) at com.intellij.ide.a.c.a.a(a.java:182) at com.intellij.ide.a.d.n.a(n.java:544) at com.intellij.ide.a.d.n.c(n.java:222) at com.intellij.ide.a.d.n.a(n.java:117) at java.base/jdk.internal.reflect.NativeMethodAccessorImpl.invoke0(Native Method) at java.base/jdk.internal.reflect.NativeMethodAccessorImpl.invoke(NativeMethodAccessorImpl.java:62) at java.base/jdk.internal.reflect.DelegatingMethodAccessorImpl.invoke(DelegatingMethodAccessorImpl.java:43) at java.base/java.lang.reflect.Method.invoke(Method.java:566) at com.intellij.idea.MainImpl.start(MainImpl.java:94) at com.intellij.idea.StartupUtil.lambda$startApp$5(StartupUtil.java:246) at com.intellij.util.ui.EdtInvocationManager.executeWithCustomManager(EdtInvocationManager.java:73) at com.intellij.idea.StartupUtil.startApp(StartupUtil.java:241) at com.intellij.idea.StartupUtil.prepareApp(StartupUtil.java:213) at com.intellij.ide.plugins.MainRunner.lambda$start$0(MainRunner.java:39) at java.base/java.lang.Thread.run(Thread.java:834) 2020-01-19 23:59:10,475 [ 3463] ERROR - tellij.diagnostic.LoadingState - PhpStorm 2019.3.1 Build #PS-193.5662.63 2020-01-19 23:59:10,476 [ 3464] ERROR - tellij.diagnostic.LoadingState - JDK: 11.0.5; VM: OpenJDK 64-Bit Server VM; Vendor: JetBrains s.r.o 2020-01-19 23:59:10,476 [ 3464] ERROR - tellij.diagnostic.LoadingState - OS: Linux 2020-01-19 23:59:10,485 [ 3473] ERROR - tellij.diagnostic.LoadingState - Should be called at least in the state LAF_INITIALIZED, the current state is: BOOTSTRAP Current violators count: 2 java.lang.Throwable at com.intellij.diagnostic.LoadingState.logStateError(LoadingState.java:55) at com.intellij.diagnostic.LoadingState.checkOccurred(LoadingState.java:51) at com.intellij.openapi.util.registry.Registry.is(Registry.java:52) at com.intellij.util.ui.UIUtil.<clinit>(UIUtil.java:90) at com.intellij.ide.a.c.a.a(a.java:182) at com.intellij.ide.a.d.n.a(n.java:544) at com.intellij.ide.a.d.n.c(n.java:222) at com.intellij.ide.a.d.n.a(n.java:117) at java.base/jdk.internal.reflect.NativeMethodAccessorImpl.invoke0(Native Method) at java.base/jdk.internal.reflect.NativeMethodAccessorImpl.invoke(NativeMethodAccessorImpl.java:62) at java.base/jdk.internal.reflect.DelegatingMethodAccessorImpl.invoke(DelegatingMethodAccessorImpl.java:43) at java.base/java.lang.reflect.Method.invoke(Method.java:566) at com.intellij.idea.MainImpl.start(MainImpl.java:94) at com.intellij.idea.StartupUtil.lambda$startApp$5(StartupUtil.java:246) at com.intellij.util.ui.EdtInvocationManager.executeWithCustomManager(EdtInvocationManager.java:73) at com.intellij.idea.StartupUtil.startApp(StartupUtil.java:241) at com.intellij.idea.StartupUtil.prepareApp(StartupUtil.java:213) at com.intellij.ide.plugins.MainRunner.lambda$start$0(MainRunner.java:39) at java.base/java.lang.Thread.run(Thread.java:834) 2020-01-19 23:59:10,486 [ 3474] ERROR - tellij.diagnostic.LoadingState - PhpStorm 2019.3.1 Build #PS-193.5662.63 2020-01-19 23:59:10,486 [ 3474] ERROR - tellij.diagnostic.LoadingState - JDK: 11.0.5; VM: OpenJDK 64-Bit Server VM; Vendor: JetBrains s.r.o 2020-01-19 23:59:10,486 [ 3474] ERROR - tellij.diagnostic.LoadingState - OS: Linux 2020-01-19 23:59:10,540 [ 3528] ERROR - llij.ide.plugins.PluginManager - Could not initialize class sun.awt.X11.XToolkit java.lang.NoClassDefFoundError: Could not initialize class sun.awt.X11.XToolkit at java.base/java.lang.Class.forName0(Native Method) at java.base/java.lang.Class.forName(Class.java:315) at java.desktop/java.awt.Toolkit$2.run(Toolkit.java:588) at java.desktop/java.awt.Toolkit$2.run(Toolkit.java:583) at java.base/java.security.AccessController.doPrivileged(Native Method) at java.desktop/java.awt.Toolkit.getDefaultToolkit(Toolkit.java:582) at java.desktop/sun.swing.SwingUtilities2.getSystemMnemonicKeyMask(SwingUtilities2.java:2210) at java.desktop/javax.swing.plaf.basic.BasicLookAndFeel.initComponentDefaults(BasicLookAndFeel.java:1096) at java.desktop/javax.swing.plaf.metal.MetalLookAndFeel.initComponentDefaults(MetalLookAndFeel.java:440) at java.desktop/javax.swing.plaf.basic.BasicLookAndFeel.getDefaults(BasicLookAndFeel.java:150) at java.desktop/javax.swing.plaf.metal.MetalLookAndFeel.getDefaults(MetalLookAndFeel.java:1560) at java.desktop/javax.swing.UIManager.setLookAndFeel(UIManager.java:592) at java.desktop/javax.swing.UIManager.setLookAndFeel(UIManager.java:634) at java.desktop/javax.swing.UIManager.initializeDefaultLAF(UIManager.java:1409) at java.desktop/javax.swing.UIManager.initialize(UIManager.java:1522) at java.desktop/javax.swing.UIManager.maybeInitialize(UIManager.java:1488) at java.desktop/javax.swing.UIManager.getDefaults(UIManager.java:714) at java.desktop/javax.swing.UIManager.getFont(UIManager.java:727) at com.intellij.ui.scale.JBUIScale.lambda$static$0(JBUIScale.java:47) at com.intellij.openapi.util.AtomicNotNullLazyValue$1.compute(AtomicNotNullLazyValue.java:59) at com.intellij.openapi.util.AtomicNotNullLazyValue.getValue(AtomicNotNullLazyValue.java:37) at com.intellij.ui.scale.JBUIScale.lambda$static$1(JBUIScale.java:152) at com.intellij.util.LazyInitializer$MutableNotNullValue.initialize(LazyInitializer.java:113) at com.intellij.util.LazyInitializer$NullableValue.get(LazyInitializer.java:41) at com.intellij.util.LazyInitializer$MutableNotNullValue.get(LazyInitializer.java:102) at com.intellij.ui.scale.JBUIScale.lambda$static$2(JBUIScale.java:170) at com.intellij.util.LazyInitializer$MutableNotNullValue.initialize(LazyInitializer.java:113) at com.intellij.util.LazyInitializer$NullableValue.get(LazyInitializer.java:41) at com.intellij.util.LazyInitializer$MutableNotNullValue.get(LazyInitializer.java:102) at com.intellij.ui.scale.JBUIScale.scale(JBUIScale.java:294) at com.intellij.util.ui.JBInsets.create(JBInsets.java:41) at com.intellij.util.ui.UIUtil.<clinit>(UIUtil.java:457) at com.intellij.ide.a.c.a.a(a.java:182) at com.intellij.ide.a.d.n.a(n.java:544) at com.intellij.ide.a.d.n.c(n.java:222) at com.intellij.ide.a.d.n.a(n.java:117) at java.base/jdk.internal.reflect.NativeMethodAccessorImpl.invoke0(Native Method) at java.base/jdk.internal.reflect.NativeMethodAccessorImpl.invoke(NativeMethodAccessorImpl.java:62) at java.base/jdk.internal.reflect.DelegatingMethodAccessorImpl.invoke(DelegatingMethodAccessorImpl.java:43) at java.base/java.lang.reflect.Method.invoke(Method.java:566) at com.intellij.idea.MainImpl.start(MainImpl.java:94) at com.intellij.idea.StartupUtil.lambda$startApp$5(StartupUtil.java:246) at com.intellij.util.ui.EdtInvocationManager.executeWithCustomManager(EdtInvocationManager.java:73) at com.intellij.idea.StartupUtil.startApp(StartupUtil.java:241) at com.intellij.idea.StartupUtil.prepareApp(StartupUtil.java:213) at com.intellij.ide.plugins.MainRunner.lambda$start$0(MainRunner.java:39) at java.base/java.lang.Thread.run(Thread.java:834) 2020-01-19 23:59:10,542 [ 3530] ERROR - llij.ide.plugins.PluginManager - PhpStorm 2019.3.1 Build #PS-193.5662.63 2020-01-19 23:59:10,543 [ 3531] ERROR - llij.ide.plugins.PluginManager - JDK: 11.0.5; VM: OpenJDK 64-Bit Server VM; Vendor: JetBrains s.r.o 2020-01-19 23:59:10,543 [ 3531] ERROR - llij.ide.plugins.PluginManager - OS: Linux Start Failed: Internal error. Please refer to http://jb.gg/ide/critical-startup-errors java.lang.NoClassDefFoundError: Could not initialize class sun.awt.X11.XToolkit at java.base/java.lang.Class.forName0(Native Method) at java.base/java.lang.Class.forName(Class.java:315) at java.desktop/java.awt.Toolkit$2.run(Toolkit.java:588) at java.desktop/java.awt.Toolkit$2.run(Toolkit.java:583) at java.base/java.security.AccessController.doPrivileged(Native Method) at java.desktop/java.awt.Toolkit.getDefaultToolkit(Toolkit.java:582) at java.desktop/sun.swing.SwingUtilities2.getSystemMnemonicKeyMask(SwingUtilities2.java:2210) at java.desktop/javax.swing.plaf.basic.BasicLookAndFeel.initComponentDefaults(BasicLookAndFeel.java:1096) at java.desktop/javax.swing.plaf.metal.MetalLookAndFeel.initComponentDefaults(MetalLookAndFeel.java:440) at java.desktop/javax.swing.plaf.basic.BasicLookAndFeel.getDefaults(BasicLookAndFeel.java:150) at java.desktop/javax.swing.plaf.metal.MetalLookAndFeel.getDefaults(MetalLookAndFeel.java:1560) at java.desktop/javax.swing.UIManager.setLookAndFeel(UIManager.java:592) at java.desktop/javax.swing.UIManager.setLookAndFeel(UIManager.java:634) at java.desktop/javax.swing.UIManager.initializeDefaultLAF(UIManager.java:1409) at java.desktop/javax.swing.UIManager.initialize(UIManager.java:1522) at java.desktop/javax.swing.UIManager.maybeInitialize(UIManager.java:1488) at java.desktop/javax.swing.UIManager.getDefaults(UIManager.java:714) at java.desktop/javax.swing.UIManager.getFont(UIManager.java:727) at com.intellij.ui.scale.JBUIScale.lambda$static$0(JBUIScale.java:47) at com.intellij.openapi.util.AtomicNotNullLazyValue$1.compute(AtomicNotNullLazyValue.java:59) at com.intellij.openapi.util.AtomicNotNullLazyValue.getValue(AtomicNotNullLazyValue.java:37) at com.intellij.ui.scale.JBUIScale.lambda$static$1(JBUIScale.java:152) at com.intellij.util.LazyInitializer$MutableNotNullValue.initialize(LazyInitializer.java:113) at com.intellij.util.LazyInitializer$NullableValue.get(LazyInitializer.java:41) at com.intellij.util.LazyInitializer$MutableNotNullValue.get(LazyInitializer.java:102) at com.intellij.ui.scale.JBUIScale.lambda$static$2(JBUIScale.java:170) at com.intellij.util.LazyInitializer$MutableNotNullValue.initialize(LazyInitializer.java:113) at com.intellij.util.LazyInitializer$NullableValue.get(LazyInitializer.java:41) at com.intellij.util.LazyInitializer$MutableNotNullValue.get(LazyInitializer.java:102) at com.intellij.ui.scale.JBUIScale.scale(JBUIScale.java:294) at com.intellij.util.ui.JBInsets.create(JBInsets.java:41) at com.intellij.util.ui.UIUtil.<clinit>(UIUtil.java:457) at com.intellij.ide.a.c.a.a(a.java:182) at com.intellij.ide.a.d.n.a(n.java:544) at com.intellij.ide.a.d.n.c(n.java:222) at com.intellij.ide.a.d.n.a(n.java:117) at java.base/jdk.internal.reflect.NativeMethodAccessorImpl.invoke0(Native Method) at java.base/jdk.internal.reflect.NativeMethodAccessorImpl.invoke(NativeMethodAccessorImpl.java:62) at java.base/jdk.internal.reflect.DelegatingMethodAccessorImpl.invoke(DelegatingMethodAccessorImpl.java:43) at java.base/java.lang.reflect.Method.invoke(Method.java:566) at com.intellij.idea.MainImpl.start(MainImpl.java:94) at com.intellij.idea.StartupUtil.lambda$startApp$5(StartupUtil.java:246) at com.intellij.util.ui.EdtInvocationManager.executeWithCustomManager(EdtInvocationManager.java:73) at com.intellij.idea.StartupUtil.startApp(StartupUtil.java:241) at com.intellij.idea.StartupUtil.prepareApp(StartupUtil.java:213) at com.intellij.ide.plugins.MainRunner.lambda$start$0(MainRunner.java:39) at java.base/java.lang.Thread.run(Thread.java:834) ----- JRE 11.0.5+10-b520.17 amd64 by JetBrains s.r.o /home/PhpStorm-193.5662.63/jbr Also, a UI exception occurred on an attempt to show the above message: java.lang.NoClassDefFoundError: Could not initialize class java.awt.GraphicsEnvironment$LocalGE at java.desktop/java.awt.GraphicsEnvironment.getLocalGraphicsEnvironment(GraphicsEnvironment.java:129) at java.desktop/javax.swing.RepaintManager.<clinit>(RepaintManager.java:243) at java.desktop/javax.swing.JComponent.repaint(JComponent.java:4835) at java.desktop/java.awt.Component.repaint(Component.java:3412) at java.desktop/javax.swing.text.JTextComponent.setEditable(JTextComponent.java:1818) at java.desktop/javax.swing.text.JTextComponent.<init>(JTextComponent.java:323) at java.desktop/javax.swing.JEditorPane.<init>(JEditorPane.java:198) at java.desktop/javax.swing.JTextPane.<init>(JTextPane.java:87) at com.intellij.idea.Main.showMessage(Main.java:212) at com.intellij.idea.Main.showMessage(Main.java:188) at com.intellij.ide.plugins.StartupAbortedException.processException(StartupAbortedException.java:78) at com.intellij.ide.plugins.MainRunner.lambda$start$0(MainRunner.java:42) at java.base/java.lang.Thread.run(Thread.java:834)
Linux下编译openjdk1.7出现的问题,求大神帮忙解决
-internal-root_2017_11_26_17_51-b00' -Dmilestone=internal -Dbuild.number=b00 -Djavac.target=7 -Djavac.source=7 -Dboot.java.home=/NO_BOOTDIR -Dimport.jdk=/home/was/logs/openjdk/jdk -Dbuild.dir=/home/was/logs/openjdk/build/linux-amd64/langtools/build -Ddist.dir=/home/was/logs/openjdk/build/linux-amd64/langtools/dist build Error: JAVA_HOME is not defined correctly. We cannot execute /NO_BOOTDIR/bin/java Makefile:201: recipe for target 'build' failed make[2]: *** [build] Error 1 make[2]: Leaving directory '/home/was/logs/openjdk/langtools/make' make/langtools-rules.gmk:37: recipe for target 'langtools-build' failed make[1]: *** [langtools-build] Error 2 make[1]: Leaving directory '/home/was/logs/openjdk' Makefile:251: recipe for target 'build_product_image' failed make: *** [build_product_image] Error 2
OpenJDK make 编译出现错误
本人刚刚开始学习Java虚拟机看的是《深入理解Java虚拟机》一书,但刚刚一开始就遇到了困难,在编译OpenJDK时,make sanity通过编译,但是make all失败了,错误如下: ``` build-bootstrap-javac: [javac] Compiling 111 source files to /Users/xiaoliufu/Develop/JVM/jdkBuild/openjdk-7u40/build-fastdebug/langtools/build/bootstrap/classes [javac] /Users/xiaoliufu/Develop/JVM/jdkBuild/openjdk-7u40/langtools/src/share/classes/com/sun/tools/javac/comp/Resolve.java:2183: ??: [overrides] ?Resolve.InapplicableSymbolsError.Candidate?????, ???????????? hashCode ?? [javac] private class Candidate { [javac] ^ [javac] error: warnings found and -Werror [javac] 1 error [javac] 1 warning BUILD FAILED /Users/xiaoliufu/Develop/JVM/jdkBuild/openjdk-7u40/langtools/make/build.xml:452: The following error occurred while executing this line: /Users/xiaoliufu/Develop/JVM/jdkBuild/openjdk-7u40/langtools/make/build.xml:795: Compile failed; see the compiler error output for details. ``` 在ubuntu上和在Mac OSX上均进行了测试,都是这样的提示,希望有大神能指教一下,不胜感激!
ubuntu 16 下编译openjdk7 发生如下错误 求解
build.sh make sanity 成功返回 Sanity check passed。 以下是部分 build.log 内容 sanity: [echo] Sanity Settings: [echo] ant.home=/usr/share/ant [echo] ant.version=Apache Ant(TM) version 1.9.6 compiled on July 8 2015 [echo] ant.java.version=1.6 [echo] java.home=/usr/local/src/jdk1.6.0_45/jre [echo] java.version=1.6.0_45 [echo] os.name=Linux [echo] os.arch=amd64 [echo] os.version=4.13.0-37-generic [echo] bootstrap.dir=/usr/local/src/openjdk7/build/../build-debug/langtools/dist/bootstrap [echo] javac.jar=/usr/local/src/openjdk7/build/../build-debug/langtools/dist/bootstrap/lib/javac.jar [echo] javac.memoryInitialSize=256m [echo] javac.memoryMaximumSize=512m [echo] javac.source=7 [echo] javac.debug=true [echo] javac.target=7 [echo] javac.version.opt= [echo] javac.lint.opts= [echo] javac.no.jdk.warnings=-XDignore.symbol.file=true [echo] output.dir=/usr/local/src/openjdk7/build/../build-debug/jaxws [echo] build.dir=/usr/local/src/openjdk7/build/../build-debug/jaxws/build [echo] dist.dir=/usr/local/src/openjdk7/build/../build-debug/jaxws/dist [echo] drop.dir=${drop.dir} [echo] drops.dir=/java/devtools/share/jdk7-drops [echo] init: -jaxws_src-ready: -jaxws_src-copy-bundle: -jaxws_src-url-should-be-used: -jaxws_src-url-bundle: jaxws_src-update: -jaf_src-ready: -jaf_src-copy-bundle: -jaf_src-url-should-be-used: -jaf_src-url-bundle: [echo] Downloading from https://java.net/downloads/jax-ws/JDK7/jdk7-jaf-2010_08_19.zip [get] Getting: https://java.net/downloads/jax-ws/JDK7/jdk7-jaf-2010_08_19.zip [get] To: /usr/local/src/openjdk7/build-debug/jaxws/drop/bundles/jdk7-jaf-2010_08_19.zip.temp [get] https://java.net/downloads/jax-ws/JDK7/jdk7-jaf-2010_08_19.zip moved to http://www.oracle.com/splash/java.net/maintenance/index.html BUILD FAILED /usr/local/src/openjdk7/build-debug/jaxws/build/xml_generated/build-drop-jaf_src.xml:96: Redirection detected from https to http. Protocol switch unsafe, not allowed. Total time: 2 seconds Makefile:151: recipe for target 'all' failed make[3]: *** [all] Error 1 make[3]: Leaving directory '/usr/local/src/openjdk7/jaxws/make' make/jaxws-rules.gmk:42: recipe for target 'jaxws-build' failed make[2]: *** [jaxws-build] Error 2 make[2]: Leaving directory '/usr/local/src/openjdk7' Makefile:255: recipe for target 'generic_debug_build' failed make[1]: *** [generic_debug_build] Error 2 make[1]: Leaving directory '/usr/local/src/openjdk7' Makefile:263: recipe for target 'build_debug_image' failed make: *** [build_debug_image] Error 2
unity打包问题,unity 和android studio交互
CommandInvokationFailure: Gradle build failed. D:\Unity2018\Editor\Data\PlaybackEngines\AndroidPlayer/Tools\OpenJDK\Windows\bin\java.exe -classpath "D:\Unity2018\Editor\Data\PlaybackEngines\AndroidPlayer\Tools\gradle\lib\gradle-launcher-5.1.1.jar" org.gradle.launcher.GradleMain "-Dorg.gradle.jvmargs=-Xmx4096m" "assembleRelease" stderr[ FAILURE: Build failed with an exception. * What went wrong: Execution failed for task ':processReleaseResources'. > Android resource linking failed error: resource style/Theme.AppCompat.Light.DarkActionBar (aka com.ab1.ProductName:style/Theme.AppCompat.Light.DarkActionBar) not found. D:\WorkProject\test\TestPath\Temp\gradleOut\src\main\res\values\styles.xml:6:1-7:9: AAPT: error: style attribute 'attr/colorPrimary (aka com.ab1.ProductName:attr/colorPrimary)' not found. D:\WorkProject\test\TestPath\Temp\gradleOut\src\main\res\values\styles.xml:6:1-7:9: AAPT: error: style attribute 'attr/colorPrimaryDark (aka com.ab1.ProductName:attr/colorPrimaryDark)' not found. D:\WorkProject\test\TestPath\Temp\gradleOut\src\main\res\values\styles.xml:6:1-7:9: AAPT: error: style attribute 'attr/colorAccent (aka com.ab1.ProductName:attr/colorAccent)' not found. error: failed linking references. * Try: Run with --stacktrace option to get the stack trace. Run with --info or --debug option to get more log output. Run with --scan to get full insights. * Get more help at https://help.gradle.org BUILD FAILED in 8s ] stdout[ > Task :preBuild UP-TO-DATE > Task :preReleaseBuild > Task :compileReleaseAidl NO-SOURCE > Task :compileReleaseRenderscript NO-SOURCE > Task :checkReleaseManifest > Task :generateReleaseBuildConfig > Task :prepareLintJar > Task :generateReleaseSources > Task :javaPreCompileRelease > Task :mainApkListPersistenceRelease > Task :generateReleaseResValues > Task :generateReleaseResources > Task :mergeReleaseResources > Task :createReleaseCompatibleScreenManifests > Task :processReleaseManifest > Task :processReleaseResources FAILED Deprecated Gradle features were used in this build, making it incompatible with Gradle 6.0. Use '--warning-mode all' to show the individual deprecation warnings. See https://docs.gradle.org/5.1.1/userguide/command_line_interface.html#sec:command_line_warnings 11 actionable tasks: 11 executed ] exit code: 1 UnityEditor.Android.Command.WaitForProgramToRun (UnityEditor.Utils.Program p, UnityEditor.Android.Command+WaitingForProcessToExit waitingForProcessToExit, System.String errorMsg) (at <67e4f96bbb8d486db6550813353bb5eb>:0) UnityEditor.Android.Command.Run (System.Diagnostics.ProcessStartInfo psi, UnityEditor.Android.Command+WaitingForProcessToExit waitingForProcessToExit, System.String errorMsg) (at <67e4f96bbb8d486db6550813353bb5eb>:0) UnityEditor.Android.Command.Run (System.String command, System.String args, System.String workingdir, UnityEditor.Android.Command+WaitingForProcessToExit waitingForProcessToExit, System.String errorMsg) (at <67e4f96bbb8d486db6550813353bb5eb>:0) UnityEditor.Android.AndroidJavaTools.RunJava (System.String args, System.String workingdir, System.Action`1[T] progress, System.String error) (at <67e4f96bbb8d486db6550813353bb5eb>:0) UnityEditor.Android.GradleWrapper.Run (UnityEditor.Android.AndroidJavaTools javaTools, System.String workingdir, System.String task, System.Action`1[T] progress) (at <67e4f96bbb8d486db6550813353bb5eb>:0) Rethrow as GradleInvokationException: Gradle build failed UnityEditor.Android.GradleWrapper.Run (UnityEditor.Android.AndroidJavaTools javaTools, System.String workingdir, System.String task, System.Action`1[T] progress) (at <67e4f96bbb8d486db6550813353bb5eb>:0) UnityEditor.Android.PostProcessor.Tasks.BuildGradleProject.Execute (UnityEditor.Android.PostProcessor.PostProcessorContext context) (at <67e4f96bbb8d486db6550813353bb5eb>:0) UnityEditor.Android.PostProcessor.PostProcessRunner.RunAllTasks (UnityEditor.Android.PostProcessor.PostProcessorContext context) (at <67e4f96bbb8d486db6550813353bb5eb>:0) UnityEngine.GUIUtility:ProcessEvent(Int32, IntPtr)
Ubuntu16.04编译OpenJDK1.8 报错
在linux ubuntu16.04下编译openjdk1.8 编译到后面,报了如下错误 ## Starting jdk Importing CORBA classes.jar Importing JAXP classes.jar Importing JAXWS classes.jar Importing LANGTOOLS classes.jar Importing CORBA src.zip Importing JAXP src.zip Importing JAXWS src.zip Importing LANGTOOLS src.zip Importing CORBA bin.zip Compiling 162 files for BUILD_TOOLS 注: 某些输入文件使用了未经检查或不安全的操作。 注: 有关详细信息, 请使用 -Xlint:unchecked 重新编译。 Compiling 521 properties into resource bundles Copying and cleaning 53 properties make[2]: *** No rule to make target '/home/wangchunsheng/openjdk/jdk/src/share/classes/sun/util/locale/provider/LocaleDataMetaInfo-XLocales.java.template', needed by '/home/wangchunsheng/openjdk/build/linux-x86_64-normal-server-release/jdk/gensrc/sun/util/locale/provider/LocaleDataMetaInfo.java'。 停止。 BuildJdk.gmk:55: recipe for target 'gensrc-only' failed make[1]: *** [gensrc-only] Error 2 /home/wangchunsheng/openjdk//make/Main.gmk:115: recipe for target 'jdk-only' failed make: *** [jdk-only] Error 2 求教大神如何解决???
linux编译openjdk报错,求大神帮忙解决一下
![图片说明](https://img-ask.csdn.net/upload/201711/11/1510390424_400742.png)
同时运行两个版本的JDK
Windows系统可以同时运行两个版本的JDKma吗,如果能怎么配置环境变量?
在ubuntu上编译openjdk,出现以下错误,前后搜了两天,实在无法解决。
make[5]: *** [linux_amd64_compiler2/debug] Error 2 make[5]: Leaving directory '/home/zhang5788/jvm/openjdk/build/linux-amd64-debug/hotspot/outputdir' Makefile:191: recipe for target 'generic_build2' failed make[4]: *** [generic_build2] Error 2 make[4]: Leaving directory '/home/zhang5788/jvm/openjdk/hotspot/make' Makefile:151: recipe for target 'jvmg' failed make[3]: *** [jvmg] Error 2 make[3]: Leaving directory '/home/zhang5788/jvm/openjdk/hotspot/make' make/hotspot-rules.gmk:111: recipe for target 'hotspot-build' failed make[2]: *** [hotspot-build] Error 2 make[2]: Leaving directory '/home/zhang5788/jvm/openjdk' Makefile:262: recipe for target 'generic_debug_build' failed make[1]: *** [generic_debug_build] Error 2 make[1]: Leaving directory '/home/zhang5788/jvm/openjdk' Makefile:272: recipe for target 'build_debug_image' failed make: *** [build_debug_image] Error 2 [1]+ Done make sanity 环境是 ubuntu 16.04 openjdk7 oracle jdk 1.7jdk1.7.0_79
openjdk编译的前提是需要安装有jdk,这样自己再编译有意义么?
这几天一个新的国产计算机以及国产linux操作系统,上面没有jdk,想着自己编译openjdk,可是openjdk的编译前提却是需要已经要有JDK存在,请问openjdk必须依赖JDK才能编译通过,这样还有意义么,
关于openjdk的两个疑问,基础问题..
问题可能比较幼稚,本来想找一个windows版本的openjdk但是发现http://openjdk.java.net/ 上好像没有,那是不是意味着如果想要windows版本的openjdk只能自己下源码然后自行编译一个windows版本的openjdk?我接着搜索了windows版本怎么编译openjdk,然后看到一个帖子 http://blog.csdn.net/nannandetian/article/details/9146091 上面说编译openjdk是为了跟踪调试jdk源码,而且还建议在linux或者solaris环境下构建openjdk .这就让我更不能理解了..不是为了获得一个windows版本的openjdk才去自己编译的么?在linux下通过jdk配合源码不能够进行调试么,为什么要非要自己编译一套呢? 额,上面可能说的比较乱..总结一下我想问的: 1.怎么获得一个windows版本的openjdk. 2.自行编译openjdk的目的是为什么?能详细解释一下么..或者举个例子什么的.. 求解答
JDK与OpenJDK,oracle的mysql与社区版本的mysql,他们在版本推进中的一些功能会相互借鉴吗?
随着JDK和mysql企业版本的收费,越来越多的开始使用了openjdk和社区版本了
openjdk在ubuntu下编译通过后,我该怎么用gdb调试呢 (小的只有5金币 只能悬赏那么多了 )
情景是这样的:ubuntu下成功编译openjdk7 接下来 我想先单步调试javac 看看它里边是怎么运行的 等把javac弄清楚了 在去看看jvm内部 可是 在用gdb调试javac时 提示错误 我google了一下 原因可能是在编译openjdk时 没有添加调试信息 我转去看看的它makefile 期待能在里边加上个gcc -g 这样的段子 可是我发现它的makefile是一层套一层 以小的的功力 基本是看不懂 所以 我就想求教大大们 大家编译过openjdk7后 怎么调试它的啊(ubuntu下) 不胜感激
关于openJDK 和 oracle JDK 的认识上的问题
我知道 openJDK 由开源社区维护,Oracle JDK 显然由 Oracle 公司开发和维护。 但是,比如新出的 JDK 11,怎么 openJDK 也有 11 的版本,这些新功能到底是谁开发的 ?? 我最近在研究 javac 编译器的源码,文章指导我要下载 openJDK来看源码, 而我本机上装的是从 Oracle 下载的 JDK 1.8,搜索的时候,找不到 com.sun.tools.javac.parser.Scanner com.sun.tools.javac.parser.Lexer JavacParser 等 相关的类。 这就更让我有点糊涂了,难道 oracle jdk 编译 java => class,通过 javac.exe 就是 对 上面这些相关类的封装成的工具?? 然后,就不在 jdk 里再显示,这些编译器相关的类了?? 稀里糊涂的,求指导。
关于linux下无法使用jstack的问题
linux 版本 Linux version 2.6.32-358.6.2.el6.x86_64 (mockbuild@c6b8.bsys.dev.centos.org) (gcc version 4.4.7 20120313 (Red Hat 4.4.7-3) (GCC) ) #1 SMP Thu May 16 20:59:36 UTC 2013 JAVA版本 java version "1.7.0_55" OpenJDK Runtime Environment (rhel-2.4.7.1.el6_5-x86_64 u55-b13) OpenJDK 64-Bit Server VM (build 24.51-b03, mixed mode) 我想使用jstack来查看堆栈信息,确发现系统不支持这个命令,后来我搜索了整个磁盘也没发现有jstack这个东西,是不是因为我这个jdk的版本原因,需要重新安装其它版本的jdk吗,不是很懂,求指教
ubuntu 16 下编译openjdk7 发生如下错误 大神求解
build.sh make sanity 成功返回 Sanity check passed。 make 过程中发生 ![图片说明](https://img-ask.csdn.net/upload/201803/26/1522060964_853715.png) 以下是部分 build.log 内容 sanity: [echo] Sanity Settings: [echo] ant.home=/usr/share/ant [echo] ant.version=Apache Ant(TM) version 1.9.6 compiled on July 8 2015 [echo] ant.java.version=1.6 [echo] java.home=/usr/local/src/jdk1.6.0_45/jre [echo] java.version=1.6.0_45 [echo] os.name=Linux [echo] os.arch=amd64 [echo] os.version=4.13.0-37-generic [echo] bootstrap.dir=/usr/local/src/openjdk7/build/../build-debug/langtools/dist/bootstrap [echo] javac.jar=/usr/local/src/openjdk7/build/../build-debug/langtools/dist/bootstrap/lib/javac.jar [echo] javac.memoryInitialSize=256m [echo] javac.memoryMaximumSize=512m [echo] javac.source=7 [echo] javac.debug=true [echo] javac.target=7 [echo] javac.version.opt= [echo] javac.lint.opts= [echo] javac.no.jdk.warnings=-XDignore.symbol.file=true [echo] output.dir=/usr/local/src/openjdk7/build/../build-debug/jaxws [echo] build.dir=/usr/local/src/openjdk7/build/../build-debug/jaxws/build [echo] dist.dir=/usr/local/src/openjdk7/build/../build-debug/jaxws/dist [echo] drop.dir=${drop.dir} [echo] drops.dir=/java/devtools/share/jdk7-drops [echo] init: -jaxws_src-ready: -jaxws_src-copy-bundle: -jaxws_src-url-should-be-used: -jaxws_src-url-bundle: jaxws_src-update: -jaf_src-ready: -jaf_src-copy-bundle: -jaf_src-url-should-be-used: -jaf_src-url-bundle: [echo] Downloading from https://java.net/downloads/jax-ws/JDK7/jdk7-jaf-2010_08_19.zip [get] Getting: https://java.net/downloads/jax-ws/JDK7/jdk7-jaf-2010_08_19.zip [get] To: /usr/local/src/openjdk7/build-debug/jaxws/drop/bundles/jdk7-jaf-2010_08_19.zip.temp [get] https://java.net/downloads/jax-ws/JDK7/jdk7-jaf-2010_08_19.zip moved to http://www.oracle.com/splash/java.net/maintenance/index.html BUILD FAILED /usr/local/src/openjdk7/build-debug/jaxws/build/xml_generated/build-drop-jaf_src.xml:96: Redirection detected from https to http. Protocol switch unsafe, not allowed. Total time: 2 seconds Makefile:151: recipe for target 'all' failed make[3]: *** [all] Error 1 make[3]: Leaving directory '/usr/local/src/openjdk7/jaxws/make' make/jaxws-rules.gmk:42: recipe for target 'jaxws-build' failed make[2]: *** [jaxws-build] Error 2 make[2]: Leaving directory '/usr/local/src/openjdk7' Makefile:255: recipe for target 'generic_debug_build' failed make[1]: *** [generic_debug_build] Error 2 make[1]: Leaving directory '/usr/local/src/openjdk7' Makefile:263: recipe for target 'build_debug_image' failed make: *** [build_debug_image] Error 2
终于明白阿里百度这样的大公司,为什么面试经常拿ThreadLocal考验求职者了
点击上面↑「爱开发」关注我们每晚10点,捕获技术思考和创业资源洞察什么是ThreadLocalThreadLocal是一个本地线程副本变量工具类,各个线程都拥有一份线程私...
《奇巧淫技》系列-python!!每天早上八点自动发送天气预报邮件到QQ邮箱
将代码部署服务器,每日早上定时获取到天气数据,并发送到邮箱。 也可以说是一个小人工智障。 思路可以运用在不同地方,主要介绍的是思路。
面试官问我:什么是消息队列?什么场景需要他?用了会出现什么问题?
你知道的越多,你不知道的越多 点赞再看,养成习惯 GitHub上已经开源 https://github.com/JavaFamily 有一线大厂面试点脑图、个人联系方式和人才交流群,欢迎Star和完善 前言 消息队列在互联网技术存储方面使用如此广泛,几乎所有的后端技术面试官都要在消息队列的使用和原理方面对小伙伴们进行360°的刁难。 作为一个在互联网公司面一次拿一次Offer的面霸...
8年经验面试官详解 Java 面试秘诀
作者 |胡书敏 责编 | 刘静 出品 | CSDN(ID:CSDNnews) 本人目前在一家知名外企担任架构师,而且最近八年来,在多家外企和互联网公司担任Java技术面试官,前后累计面试了有两三百位候选人。在本文里,就将结合本人的面试经验,针对Java初学者、Java初级开发和Java开发,给出若干准备简历和准备面试的建议。 Java程序员准备和投递简历的实...
究竟你适不适合买Mac?
我清晰的记得,刚买的macbook pro回到家,开机后第一件事情,就是上了淘宝网,花了500元钱,找了一个上门维修电脑的师傅,上门给我装了一个windows系统。。。。。。 表砍我。。。 当时买mac的初衷,只是想要个固态硬盘的笔记本,用来运行一些复杂的扑克软件。而看了当时所有的SSD笔记本后,最终决定,还是买个好(xiong)看(da)的。 已经有好几个朋友问我mba怎么样了,所以今天尽量客观...
MyBatis研习录(01)——MyBatis概述与入门
MyBatis 是一款优秀的持久层框架,它支持定制化 SQL、存储过程以及高级映射。MyBatis原本是apache的一个开源项目iBatis, 2010年该项目由apache software foundation 迁移到了google code并改名为MyBatis 。2013年11月MyBatis又迁移到Github。
程序员一般通过什么途径接私活?
二哥,你好,我想知道一般程序猿都如何接私活,我也想接,能告诉我一些方法吗? 上面是一个读者“烦不烦”问我的一个问题。其实不止是“烦不烦”,还有很多读者问过我类似这样的问题。 我接的私活不算多,挣到的钱也没有多少,加起来不到 20W。说实话,这个数目说出来我是有点心虚的,毕竟太少了,大家轻喷。但我想,恰好配得上“一般程序员”这个称号啊。毕竟苍蝇再小也是肉,我也算是有经验的人了。 唾弃接私活、做外...
Python爬虫爬取淘宝,京东商品信息
小编是一个理科生,不善长说一些废话。简单介绍下原理然后直接上代码。 使用的工具(Python+pycharm2019.3+selenium+xpath+chromedriver)其中要使用pycharm也可以私聊我selenium是一个框架可以通过pip下载 pip installselenium -ihttps://pypi.tuna.tsinghua.edu.cn/simple/ ...
阿里程序员写了一个新手都写不出的低级bug,被骂惨了。
这种新手都不会范的错,居然被一个工作好几年的小伙子写出来,差点被当场开除了。
Java工作4年来应聘要16K最后没要,细节如下。。。
前奏: 今天2B哥和大家分享一位前几天面试的一位应聘者,工作4年26岁,统招本科。 以下就是他的简历和面试情况。 基本情况: 专业技能: 1、&nbsp;熟悉Sping了解SpringMVC、SpringBoot、Mybatis等框架、了解SpringCloud微服务 2、&nbsp;熟悉常用项目管理工具:SVN、GIT、MAVEN、Jenkins 3、&nbsp;熟悉Nginx、tomca...
Python爬虫精简步骤1 获取数据
爬虫,从本质上来说,就是利用程序在网上拿到对我们有价值的数据。 爬虫能做很多事,能做商业分析,也能做生活助手,比如:分析北京近两年二手房成交均价是多少?广州的Python工程师平均薪资是多少?北京哪家餐厅粤菜最好吃?等等。 这是个人利用爬虫所做到的事情,而公司,同样可以利用爬虫来实现巨大的商业价值。比如你所熟悉的搜索引擎——百度和谷歌,它们的核心技术之一也是爬虫,而且是超级爬虫。 从搜索巨头到人工...
Python绘图,圣诞树,花,爱心 | Turtle篇
每周每日,分享Python实战代码,入门资料,进阶资料,基础语法,爬虫,数据分析,web网站,机器学习,深度学习等等。 公众号回复【进群】沟通交流吧,QQ扫码进群学习吧 微信群 QQ群 1.画圣诞树 import turtle screen = turtle.Screen() screen.setup(800,600) circle = turtle.Turtle()...
作为一个程序员,CPU的这些硬核知识你必须会!
CPU对每个程序员来说,是个既熟悉又陌生的东西? 如果你只知道CPU是中央处理器的话,那可能对你并没有什么用,那么作为程序员的我们,必须要搞懂的就是CPU这家伙是如何运行的,尤其要搞懂它里面的寄存器是怎么一回事,因为这将让你从底层明白程序的运行机制。 随我一起,来好好认识下CPU这货吧 把CPU掰开来看 对于CPU来说,我们首先就要搞明白它是怎么回事,也就是它的内部构造,当然,CPU那么牛的一个东...
破14亿,Python分析我国存在哪些人口危机!
一、背景 二、爬取数据 三、数据分析 1、总人口 2、男女人口比例 3、人口城镇化 4、人口增长率 5、人口老化(抚养比) 6、各省人口 7、世界人口 四、遇到的问题 遇到的问题 1、数据分页,需要获取从1949-2018年数据,观察到有近20年参数:LAST20,由此推测获取近70年的参数可设置为:LAST70 2、2019年数据没有放上去,可以手动添加上去 3、将数据进行 行列转换 4、列名...
web前端javascript+jquery知识点总结
1.Javascript 语法.用途 javascript 在前端网页中占有非常重要的地位,可以用于验证表单,制作特效等功能,它是一种描述语言,也是一种基于对象(Object)和事件驱动并具有安全性的脚本语言 ...
Python实战:抓肺炎疫情实时数据,画2019-nCoV疫情地图
今天,群里白垩老师问如何用python画武汉肺炎疫情地图。白垩老师是研究海洋生态与地球生物的学者,国家重点实验室成员,于不惑之年学习python,实为我等学习楷模。先前我并没有关注武汉肺炎的具体数据,也没有画过类似的数据分布图。于是就拿了两个小时,专门研究了一下,遂成此文。
听说想当黑客的都玩过这个Monyer游戏(1~14攻略)
第零关 进入传送门开始第0关(游戏链接) 请点击链接进入第1关: 连接在左边→ ←连接在右边 看不到啊。。。。(只能看到一堆大佬做完的留名,也能看到菜鸡的我,在后面~~) 直接fn+f12吧 &lt;span&gt;连接在左边→&lt;/span&gt; &lt;a href="first.php"&gt;&lt;/a&gt; &lt;span&gt;←连接在右边&lt;/span&gt; o...
在家远程办公效率低?那你一定要收好这个「在家办公」神器!
相信大家都已经收到国务院延长春节假期的消息,接下来,在家远程办公可能将会持续一段时间。 但是问题来了。远程办公不是人在电脑前就当坐班了,相反,对于沟通效率,文件协作,以及信息安全都有着极高的要求。有着非常多的挑战,比如: 1在异地互相不见面的会议上,如何提高沟通效率? 2文件之间的来往反馈如何做到及时性?如何保证信息安全? 3如何规划安排每天工作,以及如何进行成果验收? ...... ...
作为一个程序员,内存和磁盘的这些事情,你不得不知道啊!!!
截止目前,我已经分享了如下几篇文章: 一个程序在计算机中是如何运行的?超级干货!!! 作为一个程序员,CPU的这些硬核知识你必须会! 作为一个程序员,内存的这些硬核知识你必须懂! 这些知识可以说是我们之前都不太重视的基础知识,可能大家在上大学的时候都学习过了,但是嘞,当时由于老师讲解的没那么有趣,又加上这些知识本身就比较枯燥,所以嘞,大家当初几乎等于没学。 再说啦,学习这些,也看不出来有什么用啊!...
渗透测试-灰鸽子远控木马
木马概述 灰鸽子( Huigezi),原本该软件适用于公司和家庭管理,其功能十分强大,不但能监视摄像头、键盘记录、监控桌面、文件操作等。还提供了黑客专用功能,如:伪装系统图标、随意更换启动项名称和表述、随意更换端口、运行后自删除、毫无提示安装等,并采用反弹链接这种缺陷设计,使得使用者拥有最高权限,一经破解即无法控制。最终导致被黑客恶意使用。原作者的灰鸽子被定义为是一款集多种控制方式于一体的木马程序...
Python:爬取疫情每日数据
前言 目前每天各大平台,如腾讯、今日头条都会更新疫情每日数据,他们的数据源都是一样的,主要都是通过各地的卫健委官网通报。 以全国、湖北和上海为例,分别为以下三个网站: 国家卫健委官网:http://www.nhc.gov.cn/xcs/yqtb/list_gzbd.shtml 湖北卫健委官网:http://wjw.hubei.gov.cn/bmdt/ztzl/fkxxgzbdgrfyyq/xxfb...
这个世界上人真的分三六九等,你信吗?
偶然间,在知乎上看到一个问题 一时间,勾起了我深深的回忆。 以前在厂里打过两次工,做过家教,干过辅导班,做过中介。零下几度的晚上,贴过广告,满脸、满手地长冻疮。 再回首那段岁月,虽然苦,但让我学会了坚持和忍耐。让我明白了,在这个世界上,无论环境多么的恶劣,只要心存希望,星星之火,亦可燎原。 下文是原回答,希望能对你能有所启发。 如果我说,这个世界上人真的分三六九等,...
B 站上有哪些很好的学习资源?
哇说起B站,在小九眼里就是宝藏般的存在,放年假宅在家时一天刷6、7个小时不在话下,更别提今年的跨年晚会,我简直是跪着看完的!! 最早大家聚在在B站是为了追番,再后来我在上面刷欧美新歌和漂亮小姐姐的舞蹈视频,最近两年我和周围的朋友们已经把B站当作学习教室了,而且学习成本还免费,真是个励志的好平台ヽ(.◕ฺˇд ˇ◕ฺ;)ノ 下面我们就来盘点一下B站上优质的学习资源: 综合类 Oeasy: 综合...
雷火神山直播超两亿,Web播放器事件监听是怎么实现的?
Web播放器解决了在手机浏览器和PC浏览器上播放音视频数据的问题,让视音频内容可以不依赖用户安装App,就能进行播放以及在社交平台进行传播。在视频业务大数据平台中,播放数据的统计分析非常重要,所以Web播放器在使用过程中,需要对其内部的数据进行收集并上报至服务端,此时,就需要对发生在其内部的一些播放行为进行事件监听。 那么Web播放器事件监听是怎么实现的呢? 01 监听事件明细表 名...
3万字总结,Mysql优化之精髓
本文知识点较多,篇幅较长,请耐心学习 MySQL已经成为时下关系型数据库产品的中坚力量,备受互联网大厂的青睐,出门面试想进BAT,想拿高工资,不会点MySQL优化知识,拿offer的成功率会大大下降。 为什么要优化 系统的吞吐量瓶颈往往出现在数据库的访问速度上 随着应用程序的运行,数据库的中的数据会越来越多,处理时间会相应变慢 数据是存放在磁盘上的,读写速度无法和内存相比 如何优化 设计...
Python新型冠状病毒疫情数据自动爬取+统计+发送报告+数据屏幕(三)发送篇
今天介绍的项目是使用 Itchat 发送统计报告 项目功能设计: 定时爬取疫情数据存入Mysql 进行数据分析制作疫情报告 使用itchat给亲人朋友发送分析报告 基于Django做数据屏幕 使用Tableau做数据分析 来看看最终效果 目前已经完成,预计2月12日前更新 使用 itchat 发送数据统计报告 itchat 是一个基于 web微信的一个框架,但微信官方并不允许使用这...
作为程序员的我,大学四年一直自学,全靠这些实用工具和学习网站!
我本人因为高中沉迷于爱情,导致学业荒废,后来高考,毫无疑问进入了一所普普通通的大学,实在惭愧???? 我又是那么好强,现在学历不行,没办法改变的事情了,所以,进入大学开始,我就下定决心,一定要让自己掌握更多的技能,尤其选择了计算机这个行业,一定要多学习技术。 在进入大学学习不久后,我就认清了一个现实:我这个大学的整体教学质量和学习风气,真的一言难尽,懂的人自然知道怎么回事? 怎么办?我该如何更好的提升自...
粒子群算法求解物流配送路线问题(python)
1.Matlab实现粒子群算法的程序代码:https://www.cnblogs.com/kexinxin/p/9858664.html matlab代码求解函数最优值:https://blog.csdn.net/zyqblog/article/details/80829043 讲解通俗易懂,有数学实例的博文:https://blog.csdn.net/daaikuaichuan/article/...
教你如何编写第一个简单的爬虫
很多人知道爬虫,也很想利用爬虫去爬取自己想要的数据,那么爬虫到底怎么用呢?今天就教大家编写一个简单的爬虫。 下面以爬取笔者的个人博客网站为例获取第一篇文章的标题名称,教大家学会一个简单的爬虫。 第一步:获取页面 #!/usr/bin/python # coding: utf-8 import requests #引入包requests link = "http://www.santostang....
前端JS初级面试题二 (。•ˇ‸ˇ•。)老铁们!快来瞧瞧自己都会了么
1. 传统事件绑定和符合W3C标准的事件绑定有什么区别? 传统事件绑定 &lt;div onclick=""&gt;123&lt;/div&gt; div1.onclick = function(){}; &lt;button onmouseover=""&gt;&lt;/button&gt; 注意: 如果给同一个元素绑定了两次或多次相同类型的事件,那么后面的绑定会覆盖前面的绑定 (不支持DOM事...
相关热词 c#导入fbx c#中屏蔽键盘某个键 c#正态概率密度 c#和数据库登陆界面设计 c# 高斯消去法 c# codedom c#读取cad文件文本 c# 控制全局鼠标移动 c# temp 目录 bytes初始化 c#
立即提问