如何用python setup.py打包多个.py文件到同一个包下面

网上提供的一个最简单的例子是:只有一个test.py需要打包时
在setup.py中写上如下内容:

coding: utf-8

from distutils.core import setup
setup(name="MyTest",
version="1.0",
description="test",
author="ChaoMa",
author_email="1277859938@qq.com",
url="http://127.0.0.1:8080/educationma/search",
py_modules=["test"],
)

我现在test.py和hello.py都需要打包到同一个包下面,那么setup.py应该怎么写呢?

2个回答

MANIFEST.in

py_modules=["test", "hello"]
链表里面添加所有文件。

Csdn user default icon
上传中...
上传图片
插入图片
抄袭、复制答案,以达到刷声望分或其他目的的行为,在CSDN问答是严格禁止的,一经发现立刻封号。是时候展现真正的技术了!
其他相关推荐
Python用setup.py安装没有反应

setuptools已经装好了,也切换到了对应的目录,但是输入python setup.py install没有反应,先输入python setup.py build也没有反应 ![图片说明](https://img-ask.csdn.net/upload/202002/03/1580711142_396111.png) setuptools已经安装![图片说明](https://img-ask.csdn.net/upload/202002/03/1580715630_624420.png)

py2exe 在powershell执行python setup.py py2exe,总是显示你要选择如何打开这个文件,

各位,我用win0系统的windows powershell最后执行命令python setup.py py2exe,总是显示你要选择如何打开这个文件,能麻烦告诉我一下如何解决吗

执行python setup.py install报警告,如何解决?

1、在服务器上安装某些软件,执行python setup.py install,打印UserWarning: Uknown distribution option: 'long_description_content_type'请问是什么原因导致的??该如何解决??

执行python setup.py build的时候出现的错误 请问怎么回事???

问题详情: ![这是在执行python setup.py build的时候出现的](https://img-ask.csdn.net/upload/201901/26/1548481629_759605.png) 请问怎么回事???

我给自己的Python程序写了一个setup.py文件,可以安装,但是无法import,执行可执行文件也报错怎么办?

我自己写了一个用于科学计算的Python程序,用于比较晶体结构相似性,对大批量的晶体结构自动分类,方法原理我在这篇文章里描述了[J. Phys. Condens. Matter 2017, 29, 165901]。现在我想做成一个Python egg,写了一个setup.py文件如下: ``` from setuptools import setup, find_packages setup( name='spap', version='0.3.0', packages=find_packages(), license='GPL', platforms="Independant", # install_requires=['numpy>=1.8.0', 'spglib>=1.10.0', 'ase>=3.13.0'], install_requires=['numpy', 'spglib', 'ase'], entry_points={ 'console_scripts': [ 'spap = src.spap:start_cli', ] } ) ``` 我用sudo python3 setup.py install能安装,安装包的目录如下所示: ``` ./ ├── build │   ├── bdist.linux-x86_64 │   └── lib │   └── src │   ├── ccf.py │   ├── __init__.py │   └── spap.py ├── dist │   └── spap-0.3.0-py3.6.egg ├── example │   └── run.py ├── setup.py ├── spap.egg-info │   ├── dependency_links.txt │   ├── entry_points.txt │   ├── PKG-INFO │   ├── requires.txt │   ├── SOURCES.txt │   └── top_level.txt └── src ├── ccf.py ├── __init__.py └── spap.py 8 directories, 15 files ``` 可以安装到系统上,pip3 list能显示出来,我执行spap -h命令就出错: ``` Traceback (most recent call last): File "/usr/local/bin/spap", line 11, in <module> load_entry_point('spap==0.3.0', 'console_scripts', 'spap')() File "/usr/lib/python3/dist-packages/pkg_resources/__init__.py", line 480, in load_entry_point return get_distribution(dist).load_entry_point(group, name) File "/usr/lib/python3/dist-packages/pkg_resources/__init__.py", line 2693, in load_entry_point return ep.load() File "/usr/lib/python3/dist-packages/pkg_resources/__init__.py", line 2324, in load return self.resolve() File "/usr/lib/python3/dist-packages/pkg_resources/__init__.py", line 2330, in resolve module = __import__(self.module_name, fromlist=['__name__'], level=0) File "/usr/local/lib/python3.6/dist-packages/spap-0.3.0-py3.6.egg/src/spap.py", line 70, in <module> ModuleNotFoundError: No module named 'ccf' ``` 而且在python3里import spap输出如下: ``` >>> import spap Traceback (most recent call last): File "<stdin>", line 1, in <module> ModuleNotFoundError: No module named 'spap' ``` 请问这个怎么办?

使用py2exe将多个python程序编译成exe文件,setup.py应该怎样写

使用py2exe将多个python程序编译成exe文件,这多个程序有一个主入口.py文件,那么这个setup.py应该怎样写?在着多个程序中还引入了很多python的包,需要写入setup.py文件中吗?

在安装robotframework的AutoItLibrary库的时候遇到一个报错File "setup.py", line 57,求教各位大神

按照别的大神的安装帖子安装,一共3个插件,后面2个都安装好了,就第一个报错,![按照别的大神的安装帖子安装,一共3个插件,后面2个都安装好了,就第一个报错,报错代码如下](https://img-ask.csdn.net/upload/201907/01/1561960546_853724.png) 报错代码如下 ``` C:\Users\Administrator\Downloads\AutoItLibrary-1.1.post1>python setup.py install File "setup.py", line 57 print "Don't think we need to unregister the old one..." ^ SyntaxError: Missing parentheses in call to 'print'. Did you mean print(print "D on't think we need to unregister the old one...")? ``` 安装电脑环境 win7旗舰版 64位 python是 64位的3.6.4

执行python manage.py migrate命令有问题

我在windows系统搭建了开发环境,使用的是pytohn2.7版本,在本地开发环境验证测试,执行python manage.py migrate命令有问题: 我在这个位置执行的命令: ![图片说明](https://img-ask.csdn.net/upload/201912/16/1576467780_425609.png) 报错如下: ![图片说明](https://img-ask.csdn.net/upload/201912/16/1576467889_633346.png) D:\python2.7\python2.7\Lib\site-packages\django\conf\project_template>python manage.py migrate Traceback (most recent call last): File "manage.py", line 10, in <module> execute_from_command_line(sys.argv) File "D:\python2.7\python2.7\lib\site-packages\django\core\management\__init__.py", line 338, in execute_from_command_line utility.execute() File "D:\python2.7\python2.7\lib\site-packages\django\core\management\__init__.py", line 303, in execute settings.INSTALLED_APPS File "D:\python2.7\python2.7\lib\site-packages\django\conf\__init__.py", line 48, in __getattr__ self._setup(name) File "D:\python2.7\python2.7\lib\site-packages\django\conf\__init__.py", line 44, in _setup self._wrapped = Settings(settings_module) File "D:\python2.7\python2.7\lib\site-packages\django\conf\__init__.py", line 92, in __init__ mod = importlib.import_module(self.SETTINGS_MODULE) File "D:\python2.7\python2.7\lib\importlib\__init__.py", line 37, in import_module __import__(name) ImportError: No module named {{ project_name }}.settings 求大神指教,是我执行的目录位置有问题吗?

Python使用setup.py封装出的Msi安装文件,安装后为什么会在两个地方同时安装?

我利用distutils.core的setup写了一个setup.py文件。 然后使用python setup.py bdist_msi生成了一个msi安装包。 使用这个msi安装包,安装后,会在C:\Lib和C:\Python27\Lib下都安装了一遍。 怎么才能只在C:\Python27\Lib下安装? ``` setup(name='XXX', version="1.0", description="XXX", author="XXX", author_email='XXX', packages=all_file, package_data={'': ['*.*']}, classifiers=[ 'Development Status :: 5 - Production/Stable', 'Operating System :: Microsoft :: Windows', 'Natural Language :: Chinese (Simplified)', 'Programming Language :: Python', 'Programming Language :: Python :: 2.7', 'Topic :: Software Development :: Libraries :: Python Modules' ], install_requires=[ 'pyserial==3.2.1' ], ) ```

为什么执行了python setup.py install,导入BS4库的语句还是灰色????

![图片说明](https://img-ask.csdn.net/upload/201807/15/1531641183_351793.png)

树莓派安装zbar运行setup.py时找不到python.h文件

运行setup.py后显示python.h点文件找不到,我查了下python2.7,确实无python.h文件,而python3.4却有,我通过该网上说安装python-dev的包,但由于原本版本太高,存在依赖关系,出现图中情况,求大神指点![](https://img-ask.csdn.net/upload/201609/13/1473768504_786494.jpg)

Django配置MySQL,运行python manage.py startapp myapp 报错!!

python manage.py startapp myapp Traceback (most recent call last): File "manage.py", line 21, in <module> main() File "manage.py", line 17, in main execute_from_command_line(sys.argv) File "C:\Users\Administrator\AppData\Local\Programs\Python\Python37\lib\site-packages\django\core\management\__init__.py", line 381, in execute_from_command_line utility.execute() File "C:\Users\Administrator\AppData\Local\Programs\Python\Python37\lib\site-packages\django\core\management\__init__.py", line 357, in execute django.setup() File "C:\Users\Administrator\AppData\Local\Programs\Python\Python37\lib\site-packages\django\__init__.py", line 24, in setup apps.populate(settings.INSTALLED_APPS) File "C:\Users\Administrator\AppData\Local\Programs\Python\Python37\lib\site-packages\django\apps\registry.py", line 114, in populate app_config.import_models() File "C:\Users\Administrator\AppData\Local\Programs\Python\Python37\lib\site-packages\django\apps\config.py", line 211, in import_models self.models_module = import_module(models_module_name) File "C:\Users\Administrator\AppData\Local\Programs\Python\Python37\lib\importlib\__init__.py", line 127, in import_module return _bootstrap._gcd_import(name[level:], package, level) File "<frozen importlib._bootstrap>", line 1006, in _gcd_import File "<frozen importlib._bootstrap>", line 983, in _find_and_load File "<frozen importlib._bootstrap>", line 967, in _find_and_load_unlocked File "<frozen importlib._bootstrap>", line 677, in _load_unlocked File "<frozen importlib._bootstrap_external>", line 728, in exec_module File "<frozen importlib._bootstrap>", line 219, in _call_with_frames_removed File "C:\Users\Administrator\AppData\Local\Programs\Python\Python37\lib\site-packages\django\contrib\auth\models.py", line 2, in <module> from django.contrib.auth.base_user import AbstractBaseUser, BaseUserManager File "C:\Users\Administrator\AppData\Local\Programs\Python\Python37\lib\site-packages\django\contrib\auth\base_user.py", line 47, in <module> class AbstractBaseUser(models.Model): File "C:\Users\Administrator\AppData\Local\Programs\Python\Python37\lib\site-packages\django\db\models\base.py", line 117, in __new__ new_class.add_to_class('_meta', Options(meta, app_label)) File "C:\Users\Administrator\AppData\Local\Programs\Python\Python37\lib\site-packages\django\db\models\base.py", line 321, in add_to_class value.contribute_to_class(cls, name) File "C:\Users\Administrator\AppData\Local\Programs\Python\Python37\lib\site-packages\django\db\models\options.py", line 204, in contribute_to_class self.db_table = truncate_name(self.db_table, connection.ops.max_name_length()) File "C:\Users\Administrator\AppData\Local\Programs\Python\Python37\lib\site-packages\django\db\__init__.py", line 28, in __getattr__ return getattr(connections[DEFAULT_DB_ALIAS], item) File "C:\Users\Administrator\AppData\Local\Programs\Python\Python37\lib\site-packages\django\db\utils.py", line 201, in __getitem__ backend = load_backend(db['ENGINE']) File "C:\Users\Administrator\AppData\Local\Programs\Python\Python37\lib\site-packages\django\db\utils.py", line 110, in load_backend return import_module('%s.base' % backend_name) File "C:\Users\Administrator\AppData\Local\Programs\Python\Python37\lib\importlib\__init__.py", line 127, in import_module return _bootstrap._gcd_import(name[level:], package, level) File "C:\Users\Administrator\AppData\Local\Programs\Python\Python37\lib\site-packages\django\db\backends\mysql\base.py", line 36, in <module> raise ImproperlyConfigured('mysqlclient 1.3.13 or newer is required; you have %s.' % Database.__version__) django.core.exceptions.ImproperlyConfigured: mysqlclient 1.3.13 or newer is required; you have 0.9.3. da

执行 python manage.py makemigrations 提示错误

Traceback (most recent call last): File "manage.py", line 23, in <module> main() File "manage.py", line 19, in main execute_from_command_line(sys.argv) File "D:\codeProgram\python3.7\lib\site-packages\django\core\management\__init__.py", line 381, in execute_from_command_line utility.execute() File "D:\codeProgram\python3.7\lib\site-packages\django\core\management\__init__.py", line 357, in execute django.setup() File "D:\codeProgram\python3.7\lib\site-packages\django\__init__.py", line 24, in setup apps.populate(settings.INSTALLED_APPS) File "D:\codeProgram\python3.7\lib\site-packages\django\apps\registry.py", line 114, in populate app_config.import_models() File "D:\codeProgram\python3.7\lib\site-packages\django\apps\config.py", line 211, in import_models self.models_module = import_module(models_module_name) File "D:\codeProgram\python3.7\lib\importlib\__init__.py", line 127, in import_module return _bootstrap._gcd_import(name[level:], package, level) File "<frozen importlib._bootstrap>", line 1006, in _gcd_import File "<frozen importlib._bootstrap>", line 983, in _find_and_load File "<frozen importlib._bootstrap>", line 967, in _find_and_load_unlocked File "<frozen importlib._bootstrap>", line 677, in _load_unlocked File "<frozen importlib._bootstrap_external>", line 728, in exec_module File "<frozen importlib._bootstrap>", line 219, in _call_with_frames_removed File "D:\codeStudy\django企业开发实战\typeidea\typeidea\blog\models.py", line 8, in <module> class Category(models.Model): File "D:\codeStudy\django企业开发实战\typeidea\typeidea\blog\models.py", line 20, in Category owner = models.ForeignKey(User, verbose_name="作者") TypeError: __init__() missing 1 required positional argument: 'on_delete' ``` # -*- coding: utf-8 -*- from __future__ import unicode_literals from django.contrib.auth.models import User from django.db import models class Category(models.Model): STATUS_NORMAL = 1 STATUS_DELETE = 0 STATUS_ITEMS = ( (STATUS_NORMAL, '正常'), (STATUS_DELETE, '删除'), ) name = models.CharField(max_length=50, verbose_name="名称") status = models.PositiveIntegerField( default=STATUS_NORMAL, choices=STATUS_ITEMS, verbose_name="状态") is_nav = models.BooleanField(default=False, verbose_name="是否为导航") owner = models.ForeignKey(User, verbose_name="作者") created_time = models.DateTimeField(auto_now_add=True, verbose_name="创建时间") class Meta: verbose_name = verbose_name_plural = '分类' class Tag(models.Model): STATUS_NORMAL = 1 STATUS_DELETE = 0 STATUS_ITEMS = ( (STATUS_NORMAL, '正常'), (STATUS_DELETE, '删除'), ) name = models.CharField(max_length=10, verbose_name="名称") status = models.PositiveIntegerField( default=STATUS_NORMAL, choices=STATUS_ITEMS, verbose_name="状态") owner = models.ForeignKey(User, verbose_name="作者") created_time = models.DateTimeField(auto_now_add=True, verbose_name="创建时间") class Meta: verbose_name = verbose_name_plural = '标签' class Post(models.Model): STATUS_NORMAL = 1 STATUS_DELETE = 0 STATUS_DRAFT = 2 STATUS_ITEMS = ( (STATUS_NORMAL, '正常'), (STATUS_DELETE, '删除'), (STATUS_DRAFT, '草稿'), ) title = models.CharField(max_length=255, verbose_name="标题") desc = models.CharField(max_length=1024, blank=True, verbose_name="摘要") content = models.TextField(verbose_name="正文", help_text="正文必须为MarkDown格式") status = models.PositiveIntegerField( default=STATUS_NORMAL, choices=STATUS_ITEMS, verbose_name="状态") category = models.ForeignKey(Category, verbose_name="分类") tag = models.ManyToManyField(Tag, verbose_name="标签") owner = models.ForeignKey(User, verbose_name="作者") created_time = models.DateTimeField(auto_now_add=True, verbose_name="创建时间") class Meta: verbose_name = verbose_name_plural = "文章" ```

如何把Python的.py文件转为DLL文件用于调用呢?

我是一枚Python新手,现在手上有一个python的Test.py文件,一个利用cython生成C的setup.py文件,通过命令行生成Test.c文件。 然后应该就可以使用.def文件生成dll文件了,但运行后,会有关于def文件中我方法名的报错:外部无法解析的外部符号。但方法名和我原py文件的方法名是一致的,为什么会报错呢? 或者有其他转dll的好办法吗?详细一些的,谢谢了。

用Boost.python把.cpp文件生成.py文件时,一直报错。

用Boost.python把.cpp文件生成.py文件时,一直报boost的错。 boost版本是1.70,平台上windows10. ![图片说明](https://img-ask.csdn.net/upload/201905/13/1557756166_850750.png) 出错代码(vs2017划红线): # define N BOOST_PP_RELATIVE_ITERATION(1) # define Q BOOST_PYTHON_CV_QUALIFIER(BOOST_PP_ITERATION()) template < class RT, class ClassT BOOST_PP_ENUM_TRAILING_PARAMS_Z(1, N, class T)> inline BOOST_PYTHON_LIST_INC(BOOST_PP_INC(N))< RT, ClassT& BOOST_PP_ENUM_TRAILING_PARAMS_Z(1, N, T)> get_signature(RT(BOOST_PYTHON_FN_CC ClassT::*)(BOOST_PP_ENUM_PARAMS_Z(1, N, T)) Q) { return BOOST_PYTHON_LIST_INC(BOOST_PP_INC(N))< RT, ClassT& BOOST_PP_ENUM_TRAILING_PARAMS_Z(1, N, T) >(); } ``` ![图片说明](https://img-ask.csdn.net/upload/201905/13/1557756593_911842.png) 求帮忙啊啊啊

Python手动安装包时语法错误求助。

在官网载了个包,解压到\Lib\site-package后在包里打开cmd,输入Python setup.py install后显示SyntaxError: invalid syntax该怎么办?

求帮助!在windows下安装reviewboard执行 setup.py install 时报错。

我是在Win7 32位下面操作的。 in CMD window C:\reviewBoard>setup.py install running install running bdist_egg running egg_info writing requirements to ReviewBoard.egg-info\requires.txt writing ReviewBoard.egg-info\PKG-INFO writing top-level names to ReviewBoard.egg-info\top_level.txt writing dependency_links to ReviewBoard.egg-info\dependency_links.txt writing entry points to ReviewBoard.egg-info\entry_points.txt reading manifest file 'ReviewBoard.egg-info\SOURCES.txt' reading manifest template 'MANIFEST.in' warning: no files found matching 'Makefile' under directory 'docs' warning: no files found matching '*' under directory 'locale' no previously-included directories found matching 'docs\*\_build' no previously-included directories found matching 'reviewboard\htdocs\media\uplo aded\images' writing manifest file 'ReviewBoard.egg-info\SOURCES.txt' installing library code to build\bdist.win32\egg running install_lib running build_py running build_media error: %1 不是有效的 Win3 --就在这里终止了安装过程。 前面的准备工作都很顺利,包括: 1. 安装 python 2.5 , 安装在 E:\Python25 2. 安 装 easy_install,是 setuptools 包里带的一个命令,可以很方便的下载、编译和安装 Python 包,类似于 Ruby 的 Gems,这里其实可以不需要 3.设置环境变量, PATH=E:\ Python25;E:\ Python25\Scripts 4. 安 装 patch 工 具 , 用 于 对 比 文 件 , 安 装 在 E:\GnuWin32 目 录 , 加 System 变 量 PATH=E:\GnuWin32\bin 5.安装 memcached①工具 , 运行 memcached.exe –d install 将其安装成服务,并在服务中将 其启动(这里我安装没成功,但是不影响,后续再研究) 6.安装 python-memcached,是一个*.tar.gz 的压缩文件,解压之后,可以用命令 setup.py install 来安装 7.安装 Python Imaging Library② 8.安装 Pycrypto③ 9.安装 reviewboard,是一个*.tar.gz 的压缩文件,解压之后,可以用命令 setup.py install 来安 装。这里会需要一些其他的包支持,最好可以联网安装④。 --就在step 9 这里卡住了! ( 我在Win7下使用 wsys2 启动一个bash shell可以做到解压*.tar.gz 的压缩文件 )

关于python安装pymssql报错,求大神指点,在ubuntu14.04下

报错内容: ``` (pyenvdata)lin@lin-ThinkPad:~$ pip install pymssql Downloading/unpacking pymssql Downloading pymssql-2.1.1.tar.gz (2.4MB): 2.4MB downloaded Running setup.py (path:/home/lin/pyenvdata/build/pymssql/setup.py) egg_info for package pymssql setup.py: platform.system() => 'Linux' setup.py: platform.architecture() => ('64bit', 'ELF') setup.py: platform.linux_distribution() => ('Ubuntu', '14.04', 'trusty') setup.py: platform.libc_ver() => ('glibc', '2.4') setup.py: Not using bundled FreeTDS setup.py: include_dirs = ['/usr/local/include'] setup.py: library_dirs = ['/usr/local/lib'] Installed /home/lin/pyenvdata/build/pymssql/setuptools_git-1.1-py2.7.egg Installing collected packages: pymssql Running setup.py install for pymssql setup.py: platform.system() => 'Linux' setup.py: platform.architecture() => ('64bit', 'ELF') setup.py: platform.linux_distribution() => ('Ubuntu', '14.04', 'trusty') setup.py: platform.libc_ver() => ('glibc', '2.4') setup.py: Not using bundled FreeTDS setup.py: include_dirs = ['/usr/local/include'] setup.py: library_dirs = ['/usr/local/lib'] building '_mssql' extension x86_64-linux-gnu-gcc -pthread -fno-strict-aliasing -DNDEBUG -g -fwrapv -O2 -Wall -Wstrict-prototypes -fPIC -I/usr/local/include -I/usr/include/python2.7 -c _mssql.c -o build/temp.linux-x86_64-2.7/_mssql.o -DMSDBLIB _mssql.c:314:22: fatal error: sqlfront.h: 没有那个文件或目录 #include "sqlfront.h" ^ compilation terminated. error: command 'x86_64-linux-gnu-gcc' failed with exit status 1 Complete output from command /home/lin/pyenvdata/bin/python -c "import setuptools, tokenize;__file__='/home/lin/pyenvdata/build/pymssql/setup.py';exec(compile(getattr(tokenize, 'open', open)(__file__).read().replace('\r\n', '\n'), __file__, 'exec'))" install --record /tmp/pip-c75p_h-record/install-record.txt --single-version-externally-managed --compile --install-headers /home/lin/pyenvdata/include/site/python2.7: setup.py: platform.system() => 'Linux' setup.py: platform.architecture() => ('64bit', 'ELF') setup.py: platform.linux_distribution() => ('Ubuntu', '14.04', 'trusty') setup.py: platform.libc_ver() => ('glibc', '2.4') setup.py: Not using bundled FreeTDS setup.py: include_dirs = ['/usr/local/include'] setup.py: library_dirs = ['/usr/local/lib'] running install running build running build_ext building '_mssql' extension creating build creating build/temp.linux-x86_64-2.7 x86_64-linux-gnu-gcc -pthread -fno-strict-aliasing -DNDEBUG -g -fwrapv -O2 -Wall -Wstrict-prototypes -fPIC -I/usr/local/include -I/usr/include/python2.7 -c _mssql.c -o build/temp.linux-x86_64-2.7/_mssql.o -DMSDBLIB _mssql.c:314:22: fatal error: sqlfront.h: 没有那个文件或目录 #include "sqlfront.h" ^ compilation terminated. error: command 'x86_64-linux-gnu-gcc' failed with exit status 1 ---------------------------------------- Cleaning up... Command /home/lin/pyenvdata/bin/python -c "import setuptools, tokenize;__file__='/home/lin/pyenvdata/build/pymssql/setup.py';exec(compile(getattr(tokenize, 'open', open)(__file__).read().replace('\r\n', '\n'), __file__, 'exec'))" install --record /tmp/pip-c75p_h-record/install-record.txt --single-version-externally-managed --compile --install-headers /home/lin/pyenvdata/include/site/python2.7 failed with error code 1 in /home/lin/pyenvdata/build/pymssql Traceback (most recent call last): File "/home/lin/pyenvdata/bin/pip", line 11, in <module> sys.exit(main()) File "/home/lin/pyenvdata/local/lib/python2.7/site-packages/pip/__init__.py", line 185, in main return command.main(cmd_args) File "/home/lin/pyenvdata/local/lib/python2.7/site-packages/pip/basecommand.py", line 161, in main text = '\n'.join(complete_log) UnicodeDecodeError: 'ascii' codec can't decode byte 0xe6 in position 46: ordinal not in range(128) ```

django安装后使用 mange.py错误,求解

在ubuntu下安装了django 1.9, 使用manage.py时有报错:(python版本为2.7和3.4) 比如./manage.py runserver 8888 ``` fenice@fenice:~/WorkSpace/django/mysite$ ./manage.py startapp blog Traceback (most recent call last): File "./manage.py", line 10, in <module> execute_from_command_line(sys.argv) File "/usr/local/lib/python2.7/dist-packages/Django-1.9.dev20150709131027-py2.7.egg/django/core/management/__init__.py", line 331, in execute_from_command_line utility.execute() File "/usr/local/lib/python2.7/dist-packages/Django-1.9.dev20150709131027-py2.7.egg/django/core/management/__init__.py", line 305, in execute django.setup() File "/usr/local/lib/python2.7/dist-packages/Django-1.9.dev20150709131027-py2.7.egg/django/__init__.py", line 18, in setup apps.populate(settings.INSTALLED_APPS) File "/usr/local/lib/python2.7/dist-packages/Django-1.9.dev20150709131027-py2.7.egg/django/apps/registry.py", line 115, in populate app_config.ready() File "/usr/local/lib/python2.7/dist-packages/Django-1.9.dev20150709131027-py2.7.egg/django/contrib/admin/apps.py", line 22, in ready self.module.autodiscover() File "/usr/local/lib/python2.7/dist-packages/Django-1.9.dev20150709131027-py2.7.egg/django/contrib/admin/__init__.py", line 26, in autodiscover autodiscover_modules('admin', register_to=site) File "/usr/local/lib/python2.7/dist-packages/Django-1.9.dev20150709131027-py2.7.egg/django/utils/module_loading.py", line 50, in autodiscover_modules import_module('%s.%s' % (app_config.name, module_to_search)) File "/usr/lib/python2.7/importlib/__init__.py", line 37, in import_module __import__(name) File "/usr/local/lib/python2.7/dist-packages/Django-1.9.dev20150709131027-py2.7.egg/django/contrib/auth/admin.py", line 7, in <module> from django.contrib.auth.forms import ( File "/usr/local/lib/python2.7/dist-packages/Django-1.9.dev20150709131027-py2.7.egg/django/contrib/auth/forms.py", line 259, in <module> class SetPasswordForm(forms.Form): File "/usr/local/lib/python2.7/dist-packages/Django-1.9.dev20150709131027-py2.7.egg/django/contrib/auth/forms.py", line 269, in SetPasswordForm help_text=password_validation.password_validators_help_text_html()) File "/usr/local/lib/python2.7/dist-packages/Django-1.9.dev20150709131027-py2.7.egg/django/contrib/auth/password_validation.py", line 85, in password_validators_help_text_html help_texts = password_validators_help_texts(password_validators) File "/usr/local/lib/python2.7/dist-packages/Django-1.9.dev20150709131027-py2.7.egg/django/contrib/auth/password_validation.py", line 74, in password_validators_help_texts password_validators = get_default_password_validators() File "/usr/local/lib/python2.7/dist-packages/Django-1.9.dev20150709131027-py2.7.egg/django/utils/lru_cache.py", line 101, in wrapper result = user_function(*args, **kwds) File "/usr/local/lib/python2.7/dist-packages/Django-1.9.dev20150709131027-py2.7.egg/django/contrib/auth/password_validation.py", line 21, in get_default_password_validators return get_password_validators(settings.AUTH_PASSWORD_VALIDATORS) File "/usr/local/lib/python2.7/dist-packages/Django-1.9.dev20150709131027-py2.7.egg/django/contrib/auth/password_validation.py", line 32, in get_password_validators validators.append(klass(**validator.get('OPTIONS', {}))) File "/usr/local/lib/python2.7/dist-packages/Django-1.9.dev20150709131027-py2.7.egg/django/contrib/auth/password_validation.py", line 164, in __init__ with open(password_list_path) as f: IOError: [Errno 2] No such file or directory: u'/usr/local/lib/python2.7/dist-packages/Django-1.9.dev20150709131027-py2.7.egg/django/contrib/auth/common-passwords.txt.gz' ```

2019 AI开发者大会

2019 AI开发者大会(AI ProCon 2019)是由中国IT社区CSDN主办的AI技术与产业年度盛会。多年经验淬炼,如今蓄势待发:2019年9月6-7日,大会将有近百位中美顶尖AI专家、知名企业代表以及千余名AI开发者齐聚北京,进行技术解读和产业论证。我们不空谈口号,只谈技术,诚挚邀请AI业内人士一起共铸人工智能新篇章!

实现简单的文件系统

实验内容: 通过对具体的文件存储空间的管理、文件的物理结构、目录结构和文件操作的实现,加深对文件系统内部功能和实现过程的理解。 要求: 1.在内存中开辟一个虚拟磁盘空间作为文件存储器,在其上实现一个简

MIPS单周期CPU-组成原理实验-华中科技大学

使用logisim布线完成的MIPS单周期CPU,可支持28条指令。跑马灯的代码已经装入了寄存器,可以直接开启时钟运行。

2019数学建模A题高压油管的压力控制 省一论文即代码

2019数学建模A题高压油管的压力控制省一完整论文即详细C++和Matlab代码,希望对同学们有所帮助

基于QT和OpenCV的五子棋实现源码

一个简单的五子棋应用,基于QT和OpenCV的实现源码,通过相邻棋子判断是否获胜,不包含人工智能算法,适合新手入门

Git 实用技巧

这几年越来越多的开发团队使用了Git,掌握Git的使用已经越来越重要,已经是一个开发者必备的一项技能;但很多人在刚开始学习Git的时候会遇到很多疑问,比如之前使用过SVN的开发者想不通Git提交代码为什么需要先commit然后再去push,而不是一条命令一次性搞定; 更多的开发者对Git已经入门,不过在遇到一些代码冲突、需要恢复Git代码时候就不知所措,这个时候哪些对 Git掌握得比较好的少数人,就像团队中的神一样,在队友遇到 Git 相关的问题的时候用各种流利的操作来帮助队友于水火。 我去年刚加入新团队,发现一些同事对Git的常规操作没太大问题,但对Git的理解还是比较生疏,比如说分支和分支之间的关联关系、合并代码时候的冲突解决、提交代码前未拉取新代码导致冲突问题的处理等,我在协助处理这些问题的时候也记录各种问题的解决办法,希望整理后通过教程帮助到更多对Git操作进阶的开发者。 本期教程学习方法分为“掌握基础——稳步进阶——熟悉协作”三个层次。从掌握基础的 Git的推送和拉取开始,以案例进行演示,分析每一个步骤的操作方式和原理,从理解Git 工具的操作到学会代码存储结构、演示不同场景下Git遇到问题的不同处理方案。循序渐进让同学们掌握Git工具在团队协作中的整体协作流程。 在教程中会通过大量案例进行分析,案例会模拟在工作中遇到的问题,从最基础的代码提交和拉取、代码冲突解决、代码仓库的数据维护、Git服务端搭建等。为了让同学们容易理解,对Git简单易懂,文章中详细记录了详细的操作步骤,提供大量演示截图和解析。在教程的最后部分,会从提升团队整体效率的角度对Git工具进行讲解,包括规范操作、Gitlab的搭建、钩子事件的应用等。 为了让同学们可以利用碎片化时间来灵活学习,在教程文章中大程度降低了上下文的依赖,让大家可以在工作之余进行学习与实战,并同时掌握里面涉及的Git不常见操作的相关知识,理解Git工具在工作遇到的问题解决思路和方法,相信一定会对大家的前端技能进阶大有帮助。

实用主义学Python(小白也容易上手的Python实用案例)

原价169,限时立减100元! 系统掌握Python核心语法16点,轻松应对工作中80%以上的Python使用场景! 69元=72讲+源码+社群答疑+讲师社群分享会&nbsp; 【哪些人适合学习这门课程?】 1)大学生,平时只学习了Python理论,并未接触Python实战问题; 2)对Python实用技能掌握薄弱的人,自动化、爬虫、数据分析能让你快速提高工作效率; 3)想学习新技术,如:人工智能、机器学习、深度学习等,这门课程是你的必修课程; 4)想修炼更好的编程内功,优秀的工程师肯定不能只会一门语言,Python语言功能强大、使用高效、简单易学。 【超实用技能】 从零开始 自动生成工作周报 职场升级 豆瓣电影数据爬取 实用案例 奥运冠军数据分析 自动化办公:通过Python自动化分析Excel数据并自动操作Word文档,最终获得一份基于Excel表格的数据分析报告。 豆瓣电影爬虫:通过Python自动爬取豆瓣电影信息并将电影图片保存到本地。 奥运会数据分析实战 简介:通过Python分析120年间奥运会的数据,从不同角度入手分析,从而得出一些有趣的结论。 【超人气老师】 二两 中国人工智能协会高级会员 生成对抗神经网络研究者 《深入浅出生成对抗网络:原理剖析与TensorFlow实现》一书作者 阿里云大学云学院导师 前大型游戏公司后端工程师 【超丰富实用案例】 0)图片背景去除案例 1)自动生成工作周报案例 2)豆瓣电影数据爬取案例 3)奥运会数据分析案例 4)自动处理邮件案例 5)github信息爬取/更新提醒案例 6)B站百大UP信息爬取与分析案例 7)构建自己的论文网站案例

深度学习原理+项目实战+算法详解+主流框架(套餐)

深度学习系列课程从深度学习基础知识点开始讲解一步步进入神经网络的世界再到卷积和递归神经网络,详解各大经典网络架构。实战部分选择当下最火爆深度学习框架PyTorch与Tensorflow/Keras,全程实战演示框架核心使用与建模方法。项目实战部分选择计算机视觉与自然语言处理领域经典项目,从零开始详解算法原理,debug模式逐行代码解读。适合准备就业和转行的同学们加入学习! 建议按照下列课程顺序来进行学习 (1)掌握深度学习必备经典网络架构 (2)深度框架实战方法 (3)计算机视觉与自然语言处理项目实战。(按照课程排列顺序即可)

C/C++跨平台研发从基础到高阶实战系列套餐

一 专题从基础的C语言核心到c++ 和stl完成基础强化; 二 再到数据结构,设计模式完成专业计算机技能强化; 三 通过跨平台网络编程,linux编程,qt界面编程,mfc编程,windows编程,c++与lua联合编程来完成应用强化 四 最后通过基于ffmpeg的音视频播放器,直播推流,屏幕录像,

三个项目玩转深度学习(附1G源码)

从事大数据与人工智能开发与实践约十年,钱老师亲自见证了大数据行业的发展与人工智能的从冷到热。事实证明,计算机技术的发展,算力突破,海量数据,机器人技术等,开启了第四次工业革命的序章。深度学习图像分类一直是人工智能的经典任务,是智慧零售、安防、无人驾驶等机器视觉应用领域的核心技术之一,掌握图像分类技术是机器视觉学习的重中之重。针对现有线上学习的特点与实际需求,我们开发了人工智能案例实战系列课程。打造:以项目案例实践为驱动的课程学习方式,覆盖了智能零售,智慧交通等常见领域,通过基础学习、项目案例实践、社群答疑,三维立体的方式,打造最好的学习效果。

Java基础知识面试题(2020最新版)

文章目录Java概述何为编程什么是Javajdk1.5之后的三大版本JVM、JRE和JDK的关系什么是跨平台性?原理是什么Java语言有哪些特点什么是字节码?采用字节码的最大好处是什么什么是Java程序的主类?应用程序和小程序的主类有何不同?Java应用程序与小程序之间有那些差别?Java和C++的区别Oracle JDK 和 OpenJDK 的对比基础语法数据类型Java有哪些数据类型switc...

Python界面版学生管理系统

前不久上传了一个控制台版本的学生管理系统,这个是Python界面版学生管理系统,这个是使用pycharm开发的一个有界面的学生管理系统,基本的增删改查,里面又演示视频和完整代码,有需要的伙伴可以自行下

Vue.js 2.0之全家桶系列视频课程

基于新的Vue.js 2.3版本, 目前新全的Vue.js教学视频,让你少走弯路,直达技术前沿! 1. 包含Vue.js全家桶(vue.js、vue-router、axios、vuex、vue-cli、webpack、ElementUI等) 2. 采用笔记+代码案例的形式讲解,通俗易懂

linux“开发工具三剑客”速成攻略

工欲善其事,必先利其器。Vim+Git+Makefile是Linux环境下嵌入式开发常用的工具。本专题主要面向初次接触Linux的新手,熟练掌握工作中常用的工具,在以后的学习和工作中提高效率。

JAVA初级工程师面试36问(完结)

第三十一问: 说一下线程中sleep()和wait()区别? 1 . sleep()是让正在执行的线程主动让出CPU,当时间到了,在回到自己的线程让程序运行。但是它并没有释放同步资源锁只是让出。 2.wait()是让当前线程暂时退让出同步资源锁,让其他线程来获取到这个同步资源在调用notify()方法,才会让其解除wait状态,再次参与抢资源。 3. sleep()方法可以在任何地方使用,而wait()只能在同步方法或同步块使用。 ...

java jdk 8 帮助文档 中文 文档 chm 谷歌翻译

JDK1.8 API 中文谷歌翻译版 java帮助文档 JDK API java 帮助文档 谷歌翻译 JDK1.8 API 中文 谷歌翻译版 java帮助文档 Java最新帮助文档 本帮助文档是使用谷

我以为我对Mysql事务很熟,直到我遇到了阿里面试官

太惨了,面试又被吊打

智鼎(附答案).zip

并不是完整题库,但是有智鼎在线2019年9、10、11三个月的试题,有十七套以上题目,普通的网申行测题足以对付,可以在做题时自己总结一些规律,都不是很难

Visual Assist X 破解补丁

vs a's'sixt插件 支持vs2008-vs2019 亲测可以破解,希望可以帮助到大家

150讲轻松搞定Python网络爬虫

【为什么学爬虫?】 &nbsp; &nbsp; &nbsp; &nbsp;1、爬虫入手容易,但是深入较难,如何写出高效率的爬虫,如何写出灵活性高可扩展的爬虫都是一项技术活。另外在爬虫过程中,经常容易遇到被反爬虫,比如字体反爬、IP识别、验证码等,如何层层攻克难点拿到想要的数据,这门课程,你都能学到! &nbsp; &nbsp; &nbsp; &nbsp;2、如果是作为一个其他行业的开发者,比如app开发,web开发,学习爬虫能让你加强对技术的认知,能够开发出更加安全的软件和网站 【课程设计】 一个完整的爬虫程序,无论大小,总体来说可以分成三个步骤,分别是: 网络请求:模拟浏览器的行为从网上抓取数据。 数据解析:将请求下来的数据进行过滤,提取我们想要的数据。 数据存储:将提取到的数据存储到硬盘或者内存中。比如用mysql数据库或者redis等。 那么本课程也是按照这几个步骤循序渐进的进行讲解,带领学生完整的掌握每个步骤的技术。另外,因为爬虫的多样性,在爬取的过程中可能会发生被反爬、效率低下等。因此我们又增加了两个章节用来提高爬虫程序的灵活性,分别是: 爬虫进阶:包括IP代理,多线程爬虫,图形验证码识别、JS加密解密、动态网页爬虫、字体反爬识别等。 Scrapy和分布式爬虫:Scrapy框架、Scrapy-redis组件、分布式爬虫等。 通过爬虫进阶的知识点我们能应付大量的反爬网站,而Scrapy框架作为一个专业的爬虫框架,使用他可以快速提高我们编写爬虫程序的效率和速度。另外如果一台机器不能满足你的需求,我们可以用分布式爬虫让多台机器帮助你快速爬取数据。 &nbsp; 从基础爬虫到商业化应用爬虫,本套课程满足您的所有需求! 【课程服务】 专属付费社群+每周三讨论会+1v1答疑

JavaWEB商城项目(包括数据库)

功能描述:包括用户的登录注册,以及个人资料的修改.商品的分类展示,详情,加入购物车,生成订单,到银行支付等!另外还有收货地址的和我的收藏等常用操作.环境(JDK 1.7 ,mysql 5.5,Ecli

Python数据挖掘简易入门

&nbsp; &nbsp; &nbsp; &nbsp; 本课程为Python数据挖掘方向的入门课程,课程主要以真实数据为基础,详细介绍数据挖掘入门的流程和使用Python实现pandas与numpy在数据挖掘方向的运用,并深入学习如何运用scikit-learn调用常用的数据挖掘算法解决数据挖掘问题,为进一步深入学习数据挖掘打下扎实的基础。

一学即懂的计算机视觉(第一季)

图像处理和计算机视觉的课程大家已经看过很多,但总有“听不透”,“用不了”的感觉。课程致力于创建人人都能听的懂的计算机视觉,通过生动、细腻的讲解配合实战演练,让学生真正学懂、用会。 【超实用课程内容】 课程内容分为三篇,包括视觉系统构成,图像处理基础,特征提取与描述,运动跟踪,位姿估计,三维重构等内容。课程理论与实战结合,注重教学内容的可视化和工程实践,为人工智能视觉研发及算法工程师等相关高薪职位就业打下坚实基础。 【课程如何观看?】 PC端:https://edu.csdn.net/course/detail/26281 移动端:CSDN 学院APP(注意不是CSDN APP哦) 本课程为录播课,课程2年有效观看时长,但是大家可以抓紧时间学习后一起讨论哦~ 【学员专享增值服务】 源码开放 课件、课程案例代码完全开放给你,你可以根据所学知识,自行修改、优化 下载方式:电脑登录https://edu.csdn.net/course/detail/26281,点击右下方课程资料、代码、课件等打包下载

软件测试2小时入门

本课程内容系统、全面、简洁、通俗易懂,通过2个多小时的介绍,让大家对软件测试有个系统的理解和认识,具备基本的软件测试理论基础。 主要内容分为5个部分: 1 软件测试概述,了解测试是什么、测试的对象、原则、流程、方法、模型;&nbsp; 2.常用的黑盒测试用例设计方法及示例演示;&nbsp; 3 常用白盒测试用例设计方法及示例演示;&nbsp; 4.自动化测试优缺点、使用范围及示例‘;&nbsp; 5.测试经验谈。

初级玩转Linux+Ubuntu(嵌入式开发基础课程)

课程主要面向嵌入式Linux初学者、工程师、学生 主要从一下几方面进行讲解: 1.linux学习路线、基本命令、高级命令 2.shell、vi及vim入门讲解 3.软件安装下载、NFS、Samba、FTP等服务器配置及使用

2019 Python开发者日-培训

本次活动将秉承“只讲技术,拒绝空谈”的理念,邀请十余位身处一线的Python技术专家,重点围绕Web开发、自动化运维、数据分析、人工智能等技术模块,分享真实生产环境中使用Python应对IT挑战的真知灼见。此外,针对不同层次的开发者,大会还安排了深度培训实操环节,为开发者们带来更多深度实战的机会。

快速入门Android开发 视频 教程 android studio

这是一门快速入门Android开发课程,顾名思义是让大家能快速入门Android开发。 学完能让你学会如下知识点: Android的发展历程 搭建Java开发环境 搭建Android开发环境 Android Studio基础使用方法 Android Studio创建项目 项目运行到模拟器 项目运行到真实手机 Android中常用控件 排查开发中的错误 Android中请求网络 常用Android开发命令 快速入门Gradle构建系统 项目实战:看美图 常用Android Studio使用技巧 项目签名打包 如何上架市场

机器学习初学者必会的案例精讲

通过六个实际的编码项目,带领同学入门人工智能。这些项目涉及机器学习(回归,分类,聚类),深度学习(神经网络),底层数学算法,Weka数据挖掘,利用Git开源项目实战等。

4小时玩转微信小程序——基础入门与微信支付实战

这是一个门针对零基础学员学习微信小程序开发的视频教学课程。课程采用腾讯官方文档作为教程的唯一技术资料来源。杜绝网络上质量良莠不齐的资料给学员学习带来的障碍。 视频课程按照开发工具的下载、安装、使用、程序结构、视图层、逻辑层、微信小程序等几个部分组织课程,详细讲解整个小程序的开发过程

相关热词 c#框体中的退出函数 c# 按钮透明背景 c# idl 混编出错 c#在位置0处没有任何行 c# 循环给数组插入数据 c# 多线程死锁的例子 c# 钉钉读取员工排班 c# label 不显示 c#裁剪影像 c#工作进程更新ui
立即提问