Error: Can't wait without a fiber?啥意思啊?

遇到了如下问题:
Error: Can't wait without a fiber?
啥意思啊?

web

3个回答

快速高效用:SET SQL_SAFE_UPDATES = 0;下面的就不要看了!
今日用MySQL Workbench进行数据库的管理更新时,执行一个更新的语句碰到以下错误提示:
Error Code: 1175
You are using safe update mode and you tried to update a table without a WHERE that uses a......
答案就在这里:Error Code: 1175 You are using safe update mode and you tried to update a table without a WHERE that
----------------------Hi,地球人,我是问答机器人小S,上面的内容就是我狂拽酷炫叼炸天的答案,除了赞同,你还有别的选择吗?

Csdn user default icon
上传中...
上传图片
插入图片
抄袭、复制答案,以达到刷声望分或其他目的的行为,在CSDN问答是严格禁止的,一经发现立刻封号。是时候展现真正的技术了!
其他相关推荐
Error:warning: Ignoring InnerClasses

Information:Gradle tasks [:app:clean, :app:generateDebugSources, :app:mockableAndroidJar, :app:prepareDebugUnitTestDependencies, :app:generateDebugAndroidTestSources, :app:assembleDebug] Error:warning: Ignoring InnerClasses attribute for an anonymous inner class Error:(com.tencent.mm.opensdk.diffdev.a.b) that doesn't come with an Error:associated EnclosingMethod attribute. This class was probably produced by a Error:compiler that did not target the modern .class file format. The recommended Error:solution is to recompile the class from source, using an up-to-date compiler Error:and without specifying any "-target" type options. The consequence of ignoring Error:this warning is that reflective operations on this class will incorrectly Error:indicate that it is *not* an inner class. Error:warning: Ignoring InnerClasses attribute for an anonymous inner class Error:(com.tencent.mm.opensdk.diffdev.a.c) that doesn't come with an Error:associated EnclosingMethod attribute. This class was probably produced by a Error:compiler that did not target the modern .class file format. The recommended Error:solution is to recompile the class from source, using an up-to-date compiler Error:and without specifying any "-target" type options. The consequence of ignoring Error:this warning is that reflective operations on this class will incorrectly Error:indicate that it is *not* an inner class. Error:warning: Ignoring InnerClasses attribute for an anonymous inner class Error:(com.tencent.mm.opensdk.openapi.WXApiImplV10$1) that doesn't come with an Error:associated EnclosingMethod attribute. This class was probably produced by a Error:compiler that did not target the modern .class file format. The recommended Error:solution is to recompile the class from source, using an up-to-date compiler Error:and without specifying any "-target" type options. The consequence of ignoring Error:this warning is that reflective operations on this class will incorrectly Error:indicate that it is *not* an inner class. Error:warning: Ignoring InnerClasses attribute for an anonymous inner class Error:(com.tencent.mm.opensdk.openapi.WXApiImplV10$ActivityLifecycleCb$1) that doesn't come with an Error:associated EnclosingMethod attribute. This class was probably produced by a Error:compiler that did not target the modern .class file format. The recommended Error:solution is to recompile the class from source, using an up-to-date compiler Error:and without specifying any "-target" type options. The consequence of ignoring Error:this warning is that reflective operations on this class will incorrectly Error:indicate that it is *not* an inner class. Error:warning: Ignoring InnerClasses attribute for an anonymous inner class Error:(com.tencent.mm.opensdk.openapi.WXApiImplV10$ActivityLifecycleCb$2) that doesn't come with an Error:associated EnclosingMethod attribute. This class was probably produced by a Error:compiler that did not target the modern .class file format. The recommended Error:solution is to recompile the class from source, using an up-to-date compiler Error:and without specifying any "-target" type options. The consequence of ignoring Error:this warning is that reflective operations on this class will incorrectly Error:indicate that it is *not* an inner class. Information:BUILD SUCCESSFUL Information:Total time: 36.571 secs Information:40 errors Information:0 warnings Information:See complete output in console 大神们看下这个怎么解决, multiDexEnabled true,这个我已经加上了,application也加上了,上面的错误有一个com.tencent.mm.opensdk.diffdev.a.b提示,我是之前做微信第三方登陆加了他们的库,不知道是不是这个原因

ERROR 2003 (HY000): Can't connect to MySQL server on 'localhost' (10013)

mysql登陆报这个错怎么办?,有没有大神帮一下啊。ERROR 2003 (HY000): Can't connect to MySQL server on 'localhost' (10013) mysql服务是运行的

General error: 1364 Field doesn't have a default v

**:(** **SQLSTATE[HY000]: General error: 1364 Field 'tiezi' doesn't have a default value 错误位置 FILE: E:\Webpage\ThinkPHP\Library\Think\Db\Driver.class.php  LINE: 217 TRACE** #0 E:\Webpage\ThinkPHP\Library\Think\Db\Driver.class.php(217): PDOStatement->execute() #1 E:\Webpage\ThinkPHP\Library\Think\Db\Driver.class.php(813): Think\Db\Driver->execute('INSERT INTO `tb...', false) #2 E:\Webpage\ThinkPHP\Library\Think\Model.class.php(320): Think\Db\Driver->insert(Array, Array, false) #3 E:\Webpage\Application\Home\Controller\IndexController.class.php(79): Think\Model->add(Array) #4 [internal function]: Home\Controller\IndexController->posts() #5 E:\Webpage\ThinkPHP\Library\Think\App.class.php(164): ReflectionMethod->invoke(Object(Home\Controller\IndexController)) #6 E:\Webpage\ThinkPHP\Library\Think\App.class.php(202): Think\App::exec() #7 E:\Webpage\ThinkPHP\Library\Think\Think.class.php(120): Think\App::run() #8 E:\Webpage\ThinkPHP\ThinkPHP.php(97): Think\Think::start() #9 E:\Webpage\index.php(13): require('E:\\Webpage\\Thin...') #10 {main}

mysql数据库连接问题:Can't connect to MySQL server on

我在远程服务器上的PHPmyadmin添加了任意主机的权限 ![图片说明](https://img-ask.csdn.net/upload/201811/07/1541560985_582055.jpg) 我在学校实验室主机上想连接那个数据库,然后出现了如下问题 C:\Users\Administrator>mysql -u root -p -h 我IP Enter password: ****** 然后:ERROR 2003 (HY000): Can't connect to MySQL server on '???(我那个ip)' (10060) 请问我可能在哪里出了问题,怎么解决

pygame error: couldn't open the ship.bmp

在pygame里练习一个游戏程序,遇到“pygame error: couldn't open the ship.bmp”在网上查了下错误的原因,主要是说要补全路径或把bmp图片放在.py文件相同的目录下,我各种方式都试了,但还是报错... 以下是代码: import sys import pygame from settings import Settings from ship import Ship def run_game(): #initialize game and create a window obj pygame.init() ai_settings = Settings() screen = pygame.display.set_mode( (ai_settings.screen_width,ai_settings.screen_height)) pygame.display.set_caption("Alien Invasion") #creat a ship ship = Ship(screen) #begin main cycle of game while True: #monitor key and shubiao for event in pygame.event.get(): if event.type == pygame.QUIT: sys.exit() #draw a new screen while a new cycle begin screen.fill(ai_settings.bg_color) ship.blitme() #show the near screen pygame.display.flip() run_game() 模块ship.py import pygame class Ship(): def __init__(self,screen): """initialize ship and set location of ship""" self.screen = screen #load image of ship and get the bounding box of the ship self.image = pygame.image.load(r'images\ship.bmp') self.rect = self.image.get_rect() self.screen_rect = screen.get_rect() #place each ship into center of bottom of screen self.rect.centerx = self.screen_rect.centerx self.rect.bottom = self.screen_rect.bottom def blitme(self): """drawing the ship in the specific place""" self.screen.blit(self.image,self.rect)

error C2059: syntax error : ']',怎么解决。

#include<iostream> using namespace std; class Person { private: char name[10]; char sex[5]; int age; public: Person(char a[],char b[],int c) { strcpy(name,a); strcpy(sex,b); age=c; } int x1(int a) { int x1; x1=2018-a; return x1; } void y1(int a) { cout<<a<<endl; } }; class Stu:public Person { int class1; int num; public: Stu(char a1[],char b1[],int c1,int d1,int e1):Person(a1[],b1[],c1) { class1=d1; num=e1; } }; int main() { Stu n1("s","boy",20,3,10) n1.y1(n1.x1); return 0; } Compiling... 1.cpp E:\C++作业\1219\1.cpp(34) : error C2059: syntax error : ']' E:\C++作业\1219\1.cpp(46) : fatal error C1004: unexpected end of file found 执行 cl.exe 时出错. 1.obj - 1 error(s), 0 warning(s)

import theano 时 'size_t' does not name a type

GC_Malloc' is marked 'dllimport' C:\Anaconda\include/objimpl.h:306:44: error: 'size_t' was not declared in cope In file included from C:\Anaconda\include/unicodeobject.h:120:0, from C:\Anaconda\include/Python.h:85, from C:\Users\Administrator.SDWM-20130918HA\AppData\Local o\compiledir_Windows-7-6.1.7601-SP1-x86_Family_6_Model_37_Stepping_5_Genui l-2.7.10-32\lazylinker_ext\mod.cpp:1: C:\Anaconda\include/wchar.h:299:1: error: 'size_t' does not name a type C:\Anaconda\include/wchar.h:301:1: error: 'size_t' does not name a type C:\Anaconda\include/wchar.h:303:1: error: 'size_t' does not name a type C:\Anaconda\include/wchar.h:305:1: error: 'size_t' does not name a type C:\Anaconda\include/wchar.h:307:1: error: 'size_t' does not name a type C:\Anaconda\include/wchar.h:321:62: error: 'size_t' has not been declared C:\Anaconda\include/wchar.h:322:67: error: 'size_t' has not been declared C:\Anaconda\include/wchar.h:323:46: error: 'size_t' has not been declared C:\Anaconda\include/wchar.h:326:5: error: 'size_t' has not been declared C:\Anaconda\include/wchar.h:327:73: error: 'size_t' has not been declared

Vue多页面打包dist报错Error: Child compilation failed: Entry module not found:...

Vue多页面开发,一个是index.html,一个是one.html,配置都是按照百度经验正常配置多页面开发,能在本地浏览器正常运行。 但运行npm run build 无法正常打包,主要是看原因主要是多页面中的one.html无法识别,报如图所示错误 ![图片说明](https://img-ask.csdn.net/upload/201906/03/1559530971_97561.jpg) 请各位大神帮看看~~~

使用ubuntu编译 ffmpeg 时报错:ERROR: x265 not found using pkg-config

config.log 如下:不知道怎么弄了,望大牛指导 usr/local/include/x264.h:40:4: warning: #warning You must include stdint.h or inttypes.h before x264.h [-Wcpp] # warning You must include stdint.h or inttypes.h before x264.h ^~~~~~~ /tmp/ffconf.hRcv9aEw/test.c:3:2: error: #error "unsatisfied condition: X264_MPEG2" #error "unsatisfied condition: X264_MPEG2" ^~~~~ require_pkg_config libx265 x265 x265.h x265_api_get check_pkg_config libx265 x265 x265.h x265_api_get test_pkg_config libx265 x265 x265.h x265_api_get pkg-config --exists --print-errors x265 check_func_headers x265.h x265_api_get -I/usr/local/include -L/usr/local/lib -lx265 test_ld cc -I/usr/local/include -L/usr/local/lib -lx265 test_cc -I/usr/local/include -L/usr/local/lib BEGIN /tmp/ffconf.hRcv9aEw/test.c 1 #include <x265.h> 2 #include <stdint.h> 3 long check_x265_api_get(void) { return (long) x265_api_get; } 4 int main(void) { int ret = 0; 5 ret |= ((intptr_t)check_x265_api_get) & 0xFFFF; 6 return ret; } END /tmp/ffconf.hRcv9aEw/test.c gcc -D_ISOC99_SOURCE -D_FILE_OFFSET_BITS=64 -D_LARGEFILE_SOURCE -D_POSIX_C_SOURCE=200112 -D_XOPEN_SOURCE=600 -DPIC -std=c11 -fPIC -pthread -I/usr/local/include -I/usr/local/include -L/usr/local/lib -c -o /tmp/ffconf.hRcv9aEw/test.o /tmp/ffconf.hRcv9aEw/test.c In file included from /tmp/ffconf.hRcv9aEw/test.c:1:0: /usr/local/include/x265.h:673:5: error: unknown type name 'x265_param' x265_param* zoneParam; ^~~~~~~~~~ ERROR: x265 not found using pkg-config

ACMoj报错Runtime Error:[ERROR] A Not allowed system call: runid:14130 callid:240

区间最大数: 给出一列数共N个,将其从1到N编号,进行M次查询[X, Y](X<=Y),给出第X个数到第Y个数间最大的数。 一组测试数据,第一行输入N,M(1<=N, M<=10^5),第二行N个数;之后M行,每行分别为X,Y。给出一列数共N个,将其从1到N编号,进行M次查询[X, Y](X<=Y),给出第X个数到第Y个数间最大的数。 对于每个[X, Y]输出编号在X和Y之间(包括X,Y)的最大值。每行输出一个结果。 样例输入 5 2 4 3 1 2 5 1 4 2 5 样例输出 4 5 我的代码: #include <stdio.h> int a[10010]; int main() { int x,y,m,n; int max=0; scanf("%d%d",&n,&m); for(int i=1;i<=n;i++) { scanf("%d",&a[i]); } for(int i=1;i<=m;i++) { scanf("%d%d",&x,&y); for(int j=x;j<=y;j++) { if(a[j]>=max) max=a[j]; } printf("%d\n",max); } return 0; } oj报错:Runtime Error:[ERROR] A Not allowed system call: runid:14130 callid:240。 为什吗?求解释,如何解决? 本人菜鸟一枚求各位大神帮忙解决

SQL Error: 1205, SQLState: 41000

[WARN ] 2015-04-19 09:00:00,760 method:org.hibernate.util.JDBCExceptionReporter.logExceptions(JDBCExceptionReporter.java:77) SQL Error: 1205, SQLState: 41000 [ERROR] 2015-04-19 09:00:00,764 method:org.hibernate.util.JDBCExceptionReporter.logExceptions(JDBCExceptionReporter.java:78) Lock wait timeout exceeded; try restarting transaction [ERROR] 2015-04-19 09:00:00,765 method:com.opensymphony.xwork2.util.logging.commons.CommonsLogger.error(CommonsLogger.java:38) Exception occurred during processing request: could not execute update query org.hibernate.exception.GenericJDBCException: could not execute update query at org.hibernate.exception.SQLStateConverter.handledNonSpecificException(SQLStateConverter.java:103) at org.hibernate.exception.SQLStateConverter.convert(SQLStateConverter.java:91) at org.hibernate.exception.JDBCExceptionHelper.convert(JDBCExceptionHelper.java:43) Caused by: java.sql.SQLException: Lock wait timeout exceeded; try restarting transaction at com.mysql.jdbc.SQLError.createSQLException(SQLError.java:1073) at com.mysql.jdbc.MysqlIO.checkErrorPacket(MysqlIO.java:4096) at com.mysql.jdbc.MysqlIO.checkErrorPacket(MysqlIO.java:4028) at com.mysql.jdbc.MysqlIO.sendCommand(MysqlIO.java:2490) at com.mysql.jdbc.MysqlIO.sqlQueryDirect(MysqlIO.java:2651) 当时网站不能访问,tomcat的进程还在,重启tomcat就好了,最近每礼拜周末都来一次 求助各位大大这是咋回事儿

关于HSDB的问题,Windbg Error: ReadVirtual failed!

本人刚刚学习jvm,水平很低,最近用HSDB查看内存对象 scanoops 0x00000000d5c00000 0x00000000d7c80000时报错 Error: sun.jvm.hotspot.debugger.DebuggerException: Windbg Error: ReadVirtual failed! 我用的是jdk1.8.0u20,我的系统是win8.1 哪位大神指导一下

请大神解决一下这个问题 php curl error:35 error:140770FC

cURL error 35: error:1408F10B:SSL routines:SSL3_GET_RECORD:wrong version number (see http://curl.haxx.se/libcurl/c/libcurl-errors.html) ![图片说明](https://img-ask.csdn.net/upload/201803/05/1520246872_229017.png) 各位大佬帮帮忙

linux下qt中opencv打开摄像头HIGHGUI ERROR:OpenCV Error:

我在Ubuntu下用qt结合opencv做一个人眼状态识别的程序,qt做界面,程序在vs控制台环境下已经可以运行,但是qt下出错。错误信息 如下: HIGHGUI ERROR: V4L/V4L2: VIDIOC_S_CROP OpenCV Error: Assertion failed (scn == 3 || scn == 4) in cvtColor, file /home/mkc/opencv/opencvinstallor/opencv-2.4.9/modules/imgproc/src/color.cpp, line 3737 Qt has caught an exception thrown from an event handler. Throwing exceptions from an event handler is not supported in Qt. You must reimplement QApplication::notify() and catch all exceptions there. 1. 我的程序思路是用opencv打开摄像头并捕捉每一帧,做完处理,最后在qt的label上显示,其间做了一个mat到QImage的转换, 2.用opencv官方程序圈出人脸。我单纯的将这一步写进qt运行没问题,能将摄像头显示在label上,但是将自己完整的一直到人眼状态识别代码写进去就报错。 3.中间用了opencv新版的Mat格式,也用了IplImage的图像格式,在Ubuntu下单纯编译也没错,但是到了qt下就闪退。 4.我百度得到的可能性是:如果有空帧的话,cvtColor会报错,后来我将 if( !frame.empty() )写在打开摄像头后还是报错。 我自己根本不太懂opencv和qt,所以一直没解决,会不会是是mat还有IplImage、QImage三种格式之间转换出了问题。 希望各位遇见过的各位能给与帮助,不甚感激。

自己用webpack构建vue项目报错,求帮助万分感谢

神烦怎么也解决不了问题,用localhost能访问到的是目录 用node:{ fs: 'empty', net: 'empty', tls: 'empty', child_process: 'empty' }能减少几个报错信息 以下是我的配置 ``` const path = require('path'); const HTMLPlugin = require('html-webpack-plugin'); const VueLoaderPlugin = require('vue-loader/lib/plugin'); const webpack = require('webpack'); const isDev = process.env.NODE_ENV === 'development'; //package.json设置的对象全部存在process.env里面 const config = { target: 'web', entry: path.join(__dirname, 'src/index.js'),//设置入口,__dirname代表本文件所在的地址,也就是根目录 output: { filename: 'bundle.js', //打包的名字 path: path.join(__dirname, 'dist') //打包路径 }, plugins: [ // make sure to include the plugin for the magic new VueLoaderPlugin(), new webpack.DefinePlugin({ 'process.env': { NODE_ENV: isDev ? '"development"' : '"production"' //调用process.env.NODE_ENV 可以获取 环境 } }), new HTMLPlugin() ], module: { rules: [ { test: /\.vue$/, loader: 'vue-loader' }, { test: /\.css$/, use: [ 'style-loader', 'css-loader' ] }, { test: /\.styl$/, use: [ 'style-loader', 'css-loader', 'stylus-loader' ] }, { test: /\.(jpg|gif|jpeg|png|svg)$/, use: [{ loader: 'url-loader', options: { limit: 1024,//可以帮小于1024的图片转换base-64代码直接写在js里面,减少http请求 name: '[name].[ext]' //重命名 name图片原来的名字 ext文件扩展名 } }] } ] } }; if (isDev) { config.devServer = { port: '8200', host: '0.0.0.0', overlay: { errors: true, } } } module.exports = config; ``` 下面是报错信息 ERROR in ./node_modules/_fsevents@1.2.4@fsevents/node_modules/node-pre-gyp/lib/testbinary.js Module not found: Error: Can't resolve 'child_process' in 'D:\java\JetBrains\module\vue-app\vue-todo\node_modules\_fsevents@1.2.4@fsevents\node_modules\node-pre-gyp\lib' @ ./node_modules/_fsevents@1.2.4@fsevents/node_modules/node-pre-gyp/lib/testbinary.js 10:9-33 @ ./node_modules/_fsevents@1.2.4@fsevents/node_modules/node-pre-gyp/lib sync ^\.\/.*$ @ ./node_modules/_fsevents@1.2.4@fsevents/node_modules/node-pre-gyp/lib/node-pre-gyp.js @ ./node_modules/_fsevents@1.2.4@fsevents/fsevents.js @ ./node_modules/_chokidar@2.0.4@chokidar/lib/fsevents-handler.js @ ./node_modules/_chokidar@2.0.4@chokidar/index.js @ ./node_modules/_watchpack@1.6.0@watchpack/lib/DirectoryWatcher.js @ ./node_modules/_watchpack@1.6.0@watchpack/lib/watcherManager.js @ ./node_modules/_watchpack@1.6.0@watchpack/lib/watchpack.js @ (webpack)/lib/node/NodeWatchFileSystem.js @ (webpack)/lib/node/NodeEnvironmentPlugin.js @ (webpack)/lib/webpack.js @ multi ./node_modules/_webpack-dev-server@3.1.9@webpack-dev-server/client?http://0.0.0.0:8200 webpack ERROR in ./node_modules/_fsevents@1.2.4@fsevents/node_modules/node-pre-gyp/lib/util/compile.js Module not found: Error: Can't resolve 'child_process' in 'D:\java\JetBrains\module\vue-app\vue-todo\node_modules\_fsevents@1.2.4@fsevents\node_modules\node-pre-gyp\lib\util' @ ./node_modules/_fsevents@1.2.4@fsevents/node_modules/node-pre-gyp/lib/util/compile.js 9:9-33 @ ./node_modules/_fsevents@1.2.4@fsevents/node_modules/node-pre-gyp/lib sync ^\.\/.*$ @ ./node_modules/_fsevents@1.2.4@fsevents/node_modules/node-pre-gyp/lib/node-pre-gyp.js @ ./node_modules/_fsevents@1.2.4@fsevents/fsevents.js @ ./node_modules/_chokidar@2.0.4@chokidar/lib/fsevents-handler.js @ ./node_modules/_chokidar@2.0.4@chokidar/index.js @ ./node_modules/_watchpack@1.6.0@watchpack/lib/DirectoryWatcher.js @ ./node_modules/_watchpack@1.6.0@watchpack/lib/watcherManager.js @ ./node_modules/_watchpack@1.6.0@watchpack/lib/watchpack.js @ (webpack)/lib/node/NodeWatchFileSystem.js @ (webpack)/lib/node/NodeEnvironmentPlugin.js @ (webpack)/lib/webpack.js @ multi ./node_modules/_webpack-dev-server@3.1.9@webpack-dev-server/client?http://0.0.0.0:8200 webpack ERROR in ./node_modules/_fsevents@1.2.4@fsevents/node_modules/osenv/osenv.js Module not found: Error: Can't resolve 'child_process' in 'D:\java\JetBrains\module\vue-app\vue-todo\node_modules\_fsevents@1.2.4@fsevents\node_modules\osenv' @ ./node_modules/_fsevents@1.2.4@fsevents/node_modules/osenv/osenv.js 3:11-35 @ ./node_modules/_fsevents@1.2.4@fsevents/node_modules/nopt/lib/nopt.js @ ./node_modules/_fsevents@1.2.4@fsevents/node_modules/node-pre-gyp/lib/node-pre-gyp.js @ ./node_modules/_fsevents@1.2.4@fsevents/fsevents.js @ ./node_modules/_chokidar@2.0.4@chokidar/lib/fsevents-handler.js @ ./node_modules/_chokidar@2.0.4@chokidar/index.js @ ./node_modules/_watchpack@1.6.0@watchpack/lib/DirectoryWatcher.js @ ./node_modules/_watchpack@1.6.0@watchpack/lib/watcherManager.js @ ./node_modules/_watchpack@1.6.0@watchpack/lib/watchpack.js @ (webpack)/lib/node/NodeWatchFileSystem.js @ (webpack)/lib/node/NodeEnvironmentPlugin.js @ (webpack)/lib/webpack.js @ multi ./node_modules/_webpack-dev-server@3.1.9@webpack-dev-server/client?http://0.0.0.0:8200 webpack ERROR in ./node_modules/_worker-farm@1.6.0@worker-farm/lib/fork.js Module not found: Error: Can't resolve 'child_process' in 'D:\java\JetBrains\module\vue-app\vue-todo\node_modules\_worker-farm@1.6.0@worker-farm\lib' @ ./node_modules/_worker-farm@1.6.0@worker-farm/lib/fork.js 3:21-45 @ ./node_modules/_worker-farm@1.6.0@worker-farm/lib/farm.js @ ./node_modules/_worker-farm@1.6.0@worker-farm/lib/index.js @ ./node_modules/_uglifyjs-webpack-plugin@1.3.0@uglifyjs-webpack-plugin/dist/uglify/Runner.js @ ./node_modules/_uglifyjs-webpack-plugin@1.3.0@uglifyjs-webpack-plugin/dist/index.js @ ./node_modules/_uglifyjs-webpack-plugin@1.3.0@uglifyjs-webpack-plugin/dist/cjs.js @ (webpack)/lib/WebpackOptionsDefaulter.js @ (webpack)/lib/webpack.js @ multi ./node_modules/_webpack-dev-server@3.1.9@webpack-dev-server/client?http://0.0.0.0:8200 webpack ERROR in ./node_modules/_cacache@10.0.4@cacache/get.js Module not found: Error: Can't resolve 'fs' in 'D:\java\JetBrains\module\vue-app\vue-todo\node_modules\_cacache@10.0.4@cacache' @ ./node_modules/_cacache@10.0.4@cacache/get.js 5:11-24 @ ./node_modules/_cacache@10.0.4@cacache/locales/en.js @ ./node_modules/_cacache@10.0.4@cacache/index.js @ ./node_modules/_uglifyjs-webpack-plugin@1.3.0@uglifyjs-webpack-plugin/dist/uglify/Runner.js @ ./node_modules/_uglifyjs-webpack-plugin@1.3.0@uglifyjs-webpack-plugin/dist/index.js @ ./node_modules/_uglifyjs-webpack-plugin@1.3.0@uglifyjs-webpack-plugin/dist/cjs.js @ (webpack)/lib/WebpackOptionsDefaulter.js @ (webpack)/lib/webpack.js @ multi ./node_modules/_webpack-dev-server@3.1.9@webpack-dev-server/client?http://0.0.0.0:8200 webpack ERROR in ./node_modules/_chokidar@2.0.4@chokidar/index.js Module not found: Error: Can't resolve 'fs' in 'D:\java\JetBrains\module\vue-app\vue-todo\node_modules\_chokidar@2.0.4@chokidar' @ ./node_modules/_chokidar@2.0.4@chokidar/index.js 3:9-22 @ ./node_modules/_watchpack@1.6.0@watchpack/lib/DirectoryWatcher.js @ ./node_modules/_watchpack@1.6.0@watchpack/lib/watcherManager.js @ ./node_modules/_watchpack@1.6.0@watchpack/lib/watchpack.js @ (webpack)/lib/node/NodeWatchFileSystem.js @ (webpack)/lib/node/NodeEnvironmentPlugin.js @ (webpack)/lib/webpack.js @ multi ./node_modules/_webpack-dev-server@3.1.9@webpack-dev-server/client?http://0.0.0.0:8200 webpack ERROR in ./node_modules/_chokidar@2.0.4@chokidar/lib/fsevents-handler.js Module not found: Error: Can't resolve 'fs' in 'D:\java\JetBrains\module\vue-app\vue-todo\node_modules\_chokidar@2.0.4@chokidar\lib' @ ./node_modules/_chokidar@2.0.4@chokidar/lib/fsevents-handler.js 3:9-22 @ ./node_modules/_chokidar@2.0.4@chokidar/index.js @ ./node_modules/_watchpack@1.6.0@watchpack/lib/DirectoryWatcher.js @ ./node_modules/_watchpack@1.6.0@watchpack/lib/watcherManager.js @ ./node_modules/_watchpack@1.6.0@watchpack/lib/watchpack.js @ (webpack)/lib/node/NodeWatchFileSystem.js @ (webpack)/lib/node/NodeEnvironmentPlugin.js @ (webpack)/lib/webpack.js @ multi ./node_modules/_webpack-dev-server@3.1.9@webpack-dev-server/client?http://0.0.0.0:8200 webpack ERROR in ./node_modules/_chokidar@2.0.4@chokidar/lib/nodefs-handler.js Module not found: Error: Can't resolve 'fs' in 'D:\java\JetBrains\module\vue-app\vue-todo\node_modules\_chokidar@2.0.4@chokidar\lib' @ ./node_modules/_chokidar@2.0.4@chokidar/lib/nodefs-handler.js 3:9-22 @ ./node_modules/_chokidar@2.0.4@chokidar/index.js @ ./node_modules/_watchpack@1.6.0@watchpack/lib/DirectoryWatcher.js @ ./node_modules/_watchpack@1.6.0@watchpack/lib/watcherManager.js @ ./node_modules/_watchpack@1.6.0@watchpack/lib/watchpack.js @ (webpack)/lib/node/NodeWatchFileSystem.js @ (webpack)/lib/node/NodeEnvironmentPlugin.js @ (webpack)/lib/webpack.js @ multi ./node_modules/_webpack-dev-server@3.1.9@webpack-dev-server/client?http://0.0.0.0:8200 webpack ERROR in ./node_modules/_chownr@1.1.1@chownr/chownr.js Module not found: Error: Can't resolve 'fs' in 'D:\java\JetBrains\module\vue-app\vue-todo\node_modules\_chownr@1.1.1@chownr' @ ./node_modules/_chownr@1.1.1@chownr/chownr.js 2:11-24 @ ./node_modules/_cacache@10.0.4@cacache/lib/util/fix-owner.js @ ./node_modules/_cacache@10.0.4@cacache/lib/util/tmp.js @ ./node_modules/_cacache@10.0.4@cacache/locales/en.js @ ./node_modules/_cacache@10.0.4@cacache/index.js @ ./node_modules/_uglifyjs-webpack-plugin@1.3.0@uglifyjs-webpack-plugin/dist/uglify/Runner.js @ ./node_modules/_uglifyjs-webpack-plugin@1.3.0@uglifyjs-webpack-plugin/dist/index.js @ ./node_modules/_uglifyjs-webpack-plugin@1.3.0@uglifyjs-webpack-plugin/dist/cjs.js @ (webpack)/lib/WebpackOptionsDefaulter.js @ (webpack)/lib/webpack.js @ multi ./node_modules/_webpack-dev-server@3.1.9@webpack-dev-server/client?http://0.0.0.0:8200 webpack ERROR in ./node_modules/_copy-concurrently@1.0.5@copy-concurrently/copy.js Module not found: Error: Can't resolve 'fs' in 'D:\java\JetBrains\module\vue-app\vue-todo\node_modules\_copy-concurrently@1.0.5@copy-concurrently' @ ./node_modules/_copy-concurrently@1.0.5@copy-concurrently/copy.js 8:13-26 @ ./node_modules/_move-concurrently@1.0.1@move-concurrently/move.js @ ./node_modules/_cacache@10.0.4@cacache/lib/util/move-file.js @ ./node_modules/_cacache@10.0.4@cacache/lib/content/write.js @ ./node_modules/_cacache@10.0.4@cacache/put.js @ ./node_modules/_cacache@10.0.4@cacache/locales/en.js @ ./node_modules/_cacache@10.0.4@cacache/index.js @ ./node_modules/_uglifyjs-webpack-plugin@1.3.0@uglifyjs-webpack-plugin/dist/uglify/Runner.js @ ./node_modules/_uglifyjs-webpack-plugin@1.3.0@uglifyjs-webpack-plugin/dist/index.js @ ./node_modules/_uglifyjs-webpack-plugin@1.3.0@uglifyjs-webpack-plugin/dist/cjs.js @ (webpack)/lib/WebpackOptionsDefaulter.js @ (webpack)/lib/webpack.js @ multi ./node_modules/_webpack-dev-server@3.1.9@webpack-dev-server/client?http://0.0.0.0:8200 webpack ERROR in ./node_modules/_fs.realpath@1.0.0@fs.realpath/old.js Module not found: Error: Can't resolve 'fs' in 'D:\java\JetBrains\module\vue-app\vue-todo\node_modules\_fs.realpath@1.0.0@fs.realpath' @ ./node_modules/_fs.realpath@1.0.0@fs.realpath/old.js 24:9-22 @ ./node_modules/_fs.realpath@1.0.0@fs.realpath/index.js @ ./node_modules/_glob@7.1.3@glob/glob.js @ ./node_modules/_cacache@10.0.4@cacache/lib/verify.js @ ./node_modules/_cacache@10.0.4@cacache/verify.js @ ./node_modules/_cacache@10.0.4@cacache/locales/en.js @ ./node_modules/_cacache@10.0.4@cacache/index.js @ ./node_modules/_uglifyjs-webpack-plugin@1.3.0@uglifyjs-webpack-plugin/dist/uglify/Runner.js @ ./node_modules/_uglifyjs-webpack-plugin@1.3.0@uglifyjs-webpack-plugin/dist/index.js @ ./node_modules/_uglifyjs-webpack-plugin@1.3.0@uglifyjs-webpack-plugin/dist/cjs.js @ (webpack)/lib/WebpackOptionsDefaulter.js @ (webpack)/lib/webpack.js @ multi ./node_modules/_webpack-dev-server@3.1.9@webpack-dev-server/client?http://0.0.0.0:8200 webpack ERROR in ./node_modules/_fs.realpath@1.0.0@fs.realpath/index.js Module not found: Error: Can't resolve 'fs' in 'D:\java\JetBrains\module\vue-app\vue-todo\node_modules\_fs.realpath@1.0.0@fs.realpath' @ ./node_modules/_fs.realpath@1.0.0@fs.realpath/index.js 8:9-22 @ ./node_modules/_glob@7.1.3@glob/glob.js @ ./node_modules/_cacache@10.0.4@cacache/lib/verify.js @ ./node_modules/_cacache@10.0.4@cacache/verify.js @ ./node_modules/_cacache@10.0.4@cacache/locales/en.js @ ./node_modules/_cacache@10.0.4@cacache/index.js @ ./node_modules/_uglifyjs-webpack-plugin@1.3.0@uglifyjs-webpack-plugin/dist/uglify/Runner.js @ ./node_modules/_uglifyjs-webpack-plugin@1.3.0@uglifyjs-webpack-plugin/dist/index.js @ ./node_modules/_uglifyjs-webpack-plugin@1.3.0@uglifyjs-webpack-plugin/dist/cjs.js @ (webpack)/lib/WebpackOptionsDefaulter.js @ (webpack)/lib/webpack.js @ multi ./node_modules/_webpack-dev-server@3.1.9@webpack-dev-server/client?http://0.0.0.0:8200 webpack ERROR in ./node_modules/_fsevents@1.2.4@fsevents/fsevents.js Module not found: Error: Can't resolve 'fs' in 'D:\java\JetBrains\module\vue-app\vue-todo\node_modules\_fsevents@1.2.4@fsevents' @ ./node_modules/_fsevents@1.2.4@fsevents/fsevents.js 17:9-22 @ ./node_modules/_chokidar@2.0.4@chokidar/lib/fsevents-handler.js @ ./node_modules/_chokidar@2.0.4@chokidar/index.js @ ./node_modules/_watchpack@1.6.0@watchpack/lib/DirectoryWatcher.js @ ./node_modules/_watchpack@1.6.0@watchpack/lib/watcherManager.js @ ./node_modules/_watchpack@1.6.0@watchpack/lib/watchpack.js @ (webpack)/lib/node/NodeWatchFileSystem.js @ (webpack)/lib/node/NodeEnvironmentPlugin.js @ (webpack)/lib/webpack.js @ multi ./node_modules/_webpack-dev-server@3.1.9@webpack-dev-server/client?http://0.0.0.0:8200 webpack ERROR in ./node_modules/_fsevents@1.2.4@fsevents/node_modules/chownr/chownr.js Module not found: Error: Can't resolve 'fs' in 'D:\java\JetBrains\module\vue-app\vue-todo\node_modules\_fsevents@1.2.4@fsevents\node_modules\chownr' @ ./node_modules/_fsevents@1.2.4@fsevents/node_modules/chownr/chownr.js 4:9-22 @ ./node_modules/_fsevents@1.2.4@fsevents/node_modules/tar/lib/mkdir.js @ ./node_modules/_fsevents@1.2.4@fsevents/node_modules/tar/lib/unpack.js @ ./node_modules/_fsevents@1.2.4@fsevents/node_modules/tar/index.js @ ./node_modules/_fsevents@1.2.4@fsevents/node_modules/node-pre-gyp/lib/package.js @ ./node_modules/_fsevents@1.2.4@fsevents/node_modules/node-pre-gyp/lib sync ^\.\/.*$ @ ./node_modules/_fsevents@1.2.4@fsevents/node_modules/node-pre-gyp/lib/node-pre-gyp.js @ ./node_modules/_fsevents@1.2.4@fsevents/fsevents.js @ ./node_modules/_chokidar@2.0.4@chokidar/lib/fsevents-handler.js @ ./node_modules/_chokidar@2.0.4@chokidar/index.js @ ./node_modules/_watchpack@1.6.0@watchpack/lib/DirectoryWatcher.js @ ./node_modules/_watchpack@1.6.0@watchpack/lib/watcherManager.js @ ./node_modules/_watchpack@1.6.0@watchpack/lib/watchpack.js @ (webpack)/lib/node/NodeWatchFileSystem.js @ (webpack)/lib/node/NodeEnvironmentPlugin.js @ (webpack)/lib/webpack.js @ multi ./node_modules/_webpack-dev-server@3.1.9@webpack-dev-server/client?http://0.0.0.0:8200 webpack ERROR in ./node_modules/_fsevents@1.2.4@fsevents/node_modules/detect-libc/lib/detect-libc.js Module not found: Error: Can't resolve 'fs' in 'D:\java\JetBrains\module\vue-app\vue-todo\node_modules\_fsevents@1.2.4@fsevents\node_modules\detect-libc\lib' @ ./node_modules/_fsevents@1.2.4@fsevents/node_modules/detect-libc/lib/detect-libc.js 5:18-31 @ ./node_modules/_fsevents@1.2.4@fsevents/node_modules/node-pre-gyp/lib/util/versioning.js @ ./node_modules/_fsevents@1.2.4@fsevents/node_modules/node-pre-gyp/lib sync ^\.\/.*$ @ ./node_modules/_fsevents@1.2.4@fsevents/node_modules/node-pre-gyp/lib/node-pre-gyp.js @ ./node_modules/_fsevents@1.2.4@fsevents/fsevents.js @ ./node_modules/_chokidar@2.0.4@chokidar/lib/fsevents-handler.js @ ./node_modules/_chokidar@2.0.4@chokidar/index.js @ ./node_modules/_watchpack@1.6.0@watchpack/lib/DirectoryWatcher.js @ ./node_modules/_watchpack@1.6.0@watchpack/lib/watcherManager.js @ ./node_modules/_watchpack@1.6.0@watchpack/lib/watchpack.js @ (webpack)/lib/node/NodeWatchFileSystem.js @ (webpack)/lib/node/NodeEnvironmentPlugin.js @ (webpack)/lib/webpack.js @ multi ./node_modules/_webpack-dev-server@3.1.9@webpack-dev-server/client?http://0.0.0.0:8200 webpack ERROR in ./node_modules/_fsevents@1.2.4@fsevents/node_modules/fs-minipass/index.js Module not found: Error: Can't resolve 'fs' in 'D:\java\JetBrains\module\vue-app\vue-todo\node_modules\_fsevents@1.2.4@fsevents\node_modules\fs-minipass' @ ./node_modules/_fsevents@1.2.4@fsevents/node_modules/fs-minipass/index.js 4:11-24 @ ./node_modules/_fsevents@1.2.4@fsevents/node_modules/tar/lib/create.js @ ./node_modules/_fsevents@1.2.4@fsevents/node_modules/tar/index.js @ ./node_modules/_fsevents@1.2.4@fsevents/node_modules/node-pre-gyp/lib/package.js @ ./node_modules/_fsevents@1.2.4@fsevents/node_modules/node-pre-gyp/lib sync ^\.\/.*$ @ ./node_modules/_fsevents@1.2.4@fsevents/node_modules/node-pre-gyp/lib/node-pre-gyp.js @ ./node_modules/_fsevents@1.2.4@fsevents/fsevents.js @ ./node_modules/_chokidar@2.0.4@chokidar/lib/fsevents-handler.js @ ./node_modules/_chokidar@2.0.4@chokidar/index.js @ ./node_modules/_watchpack@1.6.0@watchpack/lib/DirectoryWatcher.js @ ./node_modules/_watchpack@1.6.0@watchpack/lib/watcherManager.js @ ./node_modules/_watchpack@1.6.0@watchpack/lib/watchpack.js @ (webpack)/lib/node/NodeWatchFileSystem.js @ (webpack)/lib/node/NodeEnvironmentPlugin.js @ (webpack)/lib/webpack.js @ multi ./node_modules/_webpack-dev-server@3.1.9@webpack-dev-server/client?http://0.0.0.0:8200 webpack ERROR in ./node_modules/_fsevents@1.2.4@fsevents/node_modules/fs.realpath/old.js Module not found: Error: Can't resolve 'fs' in 'D:\java\JetBrains\module\vue-app\vue-todo\node_modules\_fsevents@1.2.4@fsevents\node_modules\fs.realpath' @ ./node_modules/_fsevents@1.2.4@fsevents/node_modules/fs.realpath/old.js 24:9-22 @ ./node_modules/_fsevents@1.2.4@fsevents/node_modules/fs.realpath/index.js @ ./node_modules/_fsevents@1.2.4@fsevents/node_modules/glob/glob.js @ ./node_modules/_fsevents@1.2.4@fsevents/node_modules/rimraf/rimraf.js @ ./node_modules/_fsevents@1.2.4@fsevents/node_modules/node-pre-gyp/lib/util/napi.js @ ./node_modules/_fsevents@1.2.4@fsevents/node_modules/node-pre-gyp/lib/node-pre-gyp.js @ ./node_modules/_fsevents@1.2.4@fsevents/fsevents.js @ ./node_modules/_chokidar@2.0.4@chokidar/lib/fsevents-handler.js @ ./node_modules/_chokidar@2.0.4@chokidar/index.js @ ./node_modules/_watchpack@1.6.0@watchpack/lib/DirectoryWatcher.js @ ./node_modules/_watchpack@1.6.0@watchpack/lib/watcherManager.js @ ./node_modules/_watchpack@1.6.0@watchpack/lib/watchpack.js @ (webpack)/lib/node/NodeWatchFileSystem.js @ (webpack)/lib/node/NodeEnvironmentPlugin.js @ (webpack)/lib/webpack.js @ multi ./node_modules/_webpack-dev-server@3.1.9@webpack-dev-server/client?http://0.0.0.0:8200 webpack ERROR in ./node_modules/_fsevents@1.2.4@fsevents/node_modules/fs.realpath/index.js Module not found: Error: Can't resolve 'fs' in 'D:\java\JetBrains\module\vue-app\vue-todo\node_modules\_fsevents@1.2.4@fsevents\node_modules\fs.realpath' @ ./node_modules/_fsevents@1.2.4@fsevents/node_modules/fs.realpath/index.js 8:9-22 @ ./node_modules/_fsevents@1.2.4@fsevents/node_modules/glob/glob.js @ ./node_modules/_fsevents@1.2.4@fsevents/node_modules/rimraf/rimraf.js @ ./node_modules/_fsevents@1.2.4@fsevents/node_modules/node-pre-gyp/lib/util/napi.js @ ./node_modules/_fsevents@1.2.4@fsevents/node_modules/node-pre-gyp/lib/node-pre-gyp.js @ ./node_modules/_fsevents@1.2.4@fsevents/fsevents.js @ ./node_modules/_chokidar@2.0.4@chokidar/lib/fsevents-handler.js @ ./node_modules/_chokidar@2.0.4@chokidar/index.js @ ./node_modules/_watchpack@1.6.0@watchpack/lib/DirectoryWatcher.js @ ./node_modules/_watchpack@1.6.0@watchpack/lib/watcherManager.js @ ./node_modules/_watchpack@1.6.0@watchpack/lib/watchpack.js @ (webpack)/lib/node/NodeWatchFileSystem.js @ (webpack)/lib/node/NodeEnvironmentPlugin.js @ (webpack)/lib/webpack.js @ multi ./node_modules/_webpack-dev-server@3.1.9@webpack-dev-server/client?http://0.0.0.0:8200 webpack ERROR in ./node_modules/_fsevents@1.2.4@fsevents/node_modules/glob/glob.js Module not found: Error: Can't resolve 'fs' in 'D:\java\JetBrains\module\vue-app\vue-todo\node_modules\_fsevents@1.2.4@fsevents\node_modules\glob' @ ./node_modules/_fsevents@1.2.4@fsevents/node_modules/glob/glob.js 43:9-22 @ ./node_modules/_fsevents@1.2.4@fsevents/node_modules/rimraf/rimraf.js @ ./node_modules/_fsevents@1.2.4@fsevents/node_modules/node-pre-gyp/lib/util/napi.js @ ./node_modules/_fsevents@1.2.4@fsevents/node_modules/node-pre-gyp/lib/node-pre-gyp.js @ ./node_modules/_fsevents@1.2.4@fsevents/fsevents.js @ ./node_modules/_chokidar@2.0.4@chokidar/lib/fsevents-handler.js @ ./node_modules/_chokidar@2.0.4@chokidar/index.js @ ./node_modules/_watchpack@1.6.0@watchpack/lib/DirectoryWatcher.js @ ./node_modules/_watchpack@1.6.0@watchpack/lib/watcherManager.js @ ./node_modules/_watchpack@1.6.0@watchpack/lib/watchpack.js @ (webpack)/lib/node/NodeWatchFileSystem.js @ (webpack)/lib/node/NodeEnvironmentPlugin.js @ (webpack)/lib/webpack.js @ multi ./node_modules/_webpack-dev-server@3.1.9@webpack-dev-server/client?http://0.0.0.0:8200 webpack ERROR in ./node_modules/_fsevents@1.2.4@fsevents/node_modules/glob/sync.js Module not found: Error: Can't resolve 'fs' in 'D:\java\JetBrains\module\vue-app\vue-todo\node_modules\_fsevents@1.2.4@fsevents\node_modules\glob' @ ./node_modules/_fsevents@1.2.4@fsevents/node_modules/glob/sync.js 4:9-22 @ ./node_modules/_fsevents@1.2.4@fsevents/node_modules/glob/glob.js @ ./node_modules/_fsevents@1.2.4@fsevents/node_modules/rimraf/rimraf.js @ ./node_modules/_fsevents@1.2.4@fsevents/node_modules/node-pre-gyp/lib/util/napi.js @ ./node_modules/_fsevents@1.2.4@fsevents/node_modules/node-pre-gyp/lib/node-pre-gyp.js @ ./node_modules/_fsevents@1.2.4@fsevents/fsevents.js @ ./node_modules/_chokidar@2.0.4@chokidar/lib/fsevents-handler.js @ ./node_modules/_chokidar@2.0.4@chokidar/index.js @ ./node_modules/_watchpack@1.6.0@watchpack/lib/DirectoryWatcher.js @ ./node_modules/_watchpack@1.6.0@watchpack/lib/watcherManager.js @ ./node_modules/_watchpack@1.6.0@watchpack/lib/watchpack.js @ (webpack)/lib/node/NodeWatchFileSystem.js @ (webpack)/lib/node/NodeEnvironmentPlugin.js @ (webpack)/lib/webpack.js @ multi ./node_modules/_webpack-dev-server@3.1.9@webpack-dev-server/client?http://0.0.0.0:8200 webpack ERROR in ./node_modules/_fsevents@1.2.4@fsevents/node_modules/ignore-walk/index.js Module not found: Error: Can't resolve 'fs' in 'D:\java\JetBrains\module\vue-app\vue-todo\node_modules\_fsevents@1.2.4@fsevents\node_modules\ignore-walk' @ ./node_modules/_fsevents@1.2.4@fsevents/node_modules/ignore-walk/index.js 3:11-24 @ ./node_modules/_fsevents@1.2.4@fsevents/node_modules/npm-packlist/index.js @ ./node_modules/_fsevents@1.2.4@fsevents/node_modules/node-pre-gyp/lib/package.js @ ./node_modules/_fsevents@1.2.4@fsevents/node_modules/node-pre-gyp/lib sync ^\.\/.*$ @ ./node_modules/_fsevents@1.2.4@fsevents/node_modules/node-pre-gyp/lib/node-pre-gyp.js @ ./node_modules/_fsevents@1.2.4@fsevents/fsevents.js @ ./node_modules/_chokidar@2.0.4@chokidar/lib/fsevents-handler.js @ ./node_modules/_chokidar@2.0.4@chokidar/index.js @ ./node_modules/_watchpack@1.6.0@watchpack/lib/DirectoryWatcher.js @ ./node_modules/_watchpack@1.6.0@watchpack/lib/watcherManager.js @ ./node_modules/_watchpack@1.6.0@watchpack/lib/watchpack.js @ (webpack)/lib/node/NodeWatchFileSystem.js @ (webpack)/lib/node/NodeEnvironmentPlugin.js @ (webpack)/lib/webpack.js @ multi ./node_modules/_webpack-dev-server@3.1.9@webpack-dev-server/client?http://0.0.0.0:8200 webpack ERROR in ./node_modules/_fsevents@1.2.4@fsevents/node_modules/mkdirp/index.js Module not found: Error: Can't resolve 'fs' in 'D:\java\JetBrains\module\vue-app\vue-todo\node_modules\_fsevents@1.2.4@fsevents\node_modules\mkdirp' @ ./node_modules/_fsevents@1.2.4@fsevents/node_modules/mkdirp/index.js 2:9-22 @ ./node_modules/_fsevents@1.2.4@fsevents/node_modules/node-pre-gyp/lib/testpackage.js @ ./node_modules/_fsevents@1.2.4@fsevents/node_modules/node-pre-gyp/lib sync ^\.\/.*$ @ ./node_modules/_fsevents@1.2.4@fsevents/node_modules/node-pre-gyp/lib/node-pre-gyp.js @ ./node_modules/_fsevents@1.2.4@fsevents/fsevents.js @ ./node_modules/_chokidar@2.0.4@chokidar/lib/fsevents-handler.js @ ./node_modules/_chokidar@2.0.4@chokidar/index.js @ ./node_modules/_watchpack@1.6.0@watchpack/lib/DirectoryWatcher.js @ ./node_modules/_watchpack@1.6.0@watchpack/lib/watcherManager.js @ ./node_modules/_watchpack@1.6.0@watchpack/lib/watchpack.js @ (webpack)/lib/node/NodeWatchFileSystem.js @ (webpack)/lib/node/NodeEnvironmentPlugin.js @ (webpack)/lib/webpack.js @ multi ./node_modules/_webpack-dev-server@3.1.9@webpack-dev-server/client?http://0.0.0.0:8200 webpack ERROR in ./node_modules/_fsevents@1.2.4@fsevents/node_modules/needle/lib/multipart.js Module not found: Error: Can't resolve 'fs' in 'D:\java\JetBrains\module\vue-app\vue-todo\node_modules\_fsevents@1.2.4@fsevents\node_modules\needle\lib' @ ./node_modules/_fsevents@1.2.4@fsevents/node_modules/needle/lib/multipart.js 1:15-28 @ ./node_modules/_fsevents@1.2.4@fsevents/node_modules/needle/lib/needle.js @ ./node_modules/_fsevents@1.2.4@fsevents/node_modules/node-pre-gyp/lib/install.js @ ./node_modules/_fsevents@1.2.4@fsevents/node_modules/node-pre-gyp/lib sync ^\.\/.*$ @ ./node_modules/_fsevents@1.2.4@fsevents/node_modules/node-pre-gyp/lib/node-pre-gyp.js @ ./node_modules/_fsevents@1.2.4@fsevents/fsevents.js @ ./node_modules/_chokidar@2.0.4@chokidar/lib/fsevents-handler.js @ ./node_modules/_chokidar@2.0.4@chokidar/index.js @ ./node_modules/_watchpack@1.6.0@watchpack/lib/DirectoryWatcher.js @ ./node_modules/_watchpack@1.6.0@watchpack/lib/watcherManager.js @ ./node_modules/_watchpack@1.6.0@watchpack/lib/watchpack.js @ (webpack)/lib/node/NodeWatchFileSystem.js @ (webpack)/lib/node/NodeEnvironmentPlugin.js @ (webpack)/lib/webpack.js @ multi ./node_modules/_webpack-dev-server@3.1.9@webpack-dev-server/client?http://0.0.0.0:8200 webpack ERROR in ./node_modules/_fsevents@1.2.4@fsevents/node_modules/needle/lib/needle.js Module not found: Error: Can't resolve 'fs' in 'D:\java\JetBrains\module\vue-app\vue-todo\node_modules\_fsevents@1.2.4@fsevents\node_modules\needle\lib' @ ./node_modules/_fsevents@1.2.4@fsevents/node_modules/needle/lib/needle.js 8:18-31 @ ./node_modules/_fsevents@1.2.4@fsevents/node_modules/node-pre-gyp/lib/install.js @ ./node_modules/_fsevents@1.2.4@fsevents/node_modules/node-pre-gyp/lib sync ^\.\/.*$ @ ./node_modules/_fsevents@1.2.4@fsevents/node_modules/node-pre-gyp/lib/node-pre-gyp.js @ ./node_modules/_fsevents@1.2.4@fsevents/fsevents.js @ ./node_modules/_chokidar@2.0.4@chokidar/lib/fsevents-handler.js @ ./node_modules/_chokidar@2.0.4@chokidar/index.js @ ./node_modules/_watchpack@1.6.0@watchpack/lib/DirectoryWatcher.js @ ./node_modules/_watchpack@1.6.0@watchpack/lib/watcherManager.js @ ./node_modules/_watchpack@1.6.0@watchpack/lib/watchpack.js @ (webpack)/lib/node/NodeWatchFileSystem.js @ (webpack)/lib/node/NodeEnvironmentPlugin.js @ (webpack)/lib/webpack.js @ multi ./node_modules/_webpack-dev-server@3.1.9@webpack-dev-server/client?http://0.0.0.0:8200 webpack ERROR in ./node_modules/_fsevents@1.2.4@fsevents/node_modules/node-pre-gyp/lib/testbinary.js Module not found: Error: Can't resolve 'fs' in 'D:\java\JetBrains\module\vue-app\vue-todo\node_modules\_fsevents@1.2.4@fsevents\node_modules\node-pre-gyp\lib' @ ./node_modules/_fsevents@1.2.4@fsevents/node_modules/node-pre-gyp/lib/testbinary.js 7:9-22 @ ./node_modules/_fsevents@1.2.4@fsevents/node_modules/node-pre-gyp/lib sync ^\.\/.*$ @ ./node_modules/_fsevents@1.2.4@fsevents/node_modules/node-pre-gyp/lib/node-pre-gyp.js @ ./node_modules/_fsevents@1.2.4@fsevents/fsevents.js @ ./node_modules/_chokidar@2.0.4@chokidar/lib/fsevents-handler.js @ ./node_modules/_chokidar@2.0.4@chokidar/index.js @ ./node_modules/_watchpack@1.6.0@watchpack/lib/DirectoryWatcher.js @ ./node_modules/_watchpack@1.6.0@watchpack/lib/watcherManager.js @ ./node_modules/_watchpack@1.6.0@watchpack/lib/watchpack.js @ (webpack)/lib/node/NodeWatchFileSystem.js @ (webpack)/lib/node/NodeEnvironmentPlugin.js @ (webpack)/lib/webpack.js @ multi ./node_modules/_webpack-dev-server@3.1.9@webpack-dev-server/client?http://0.0.0.0:8200 webpack ERROR in ./node_modules/_fsevents@1.2.4@fsevents/node_modules/node-pre-gyp/lib/testpackage.js Module not found: Error: Can't resolve 'fs' in 'D:\java\JetBrains\module\vue-app\vue-todo\node_modules\_fsevents@1.2.4@fsevents\node_modules\node-pre-gyp\lib' @ ./node_modules/_fsevents@1.2.4@fsevents/node_modules/node-pre-gyp/lib/testpackage.js 7:9-22 @ ./node_modules/_fsevents@1.2.4@fsevents/node_modules/node-pre-gyp/lib sync ^\.\/.*$ @ ./node_modules/_fsevents@1.2.4@fsevents/node_modules/node-pre-gyp/lib/node-pre-gyp.js @ ./node_modules/_fsevents@1.2.4@fsevents/fsevents.js @ ./node_modules/_chokidar@2.0.4@chokidar/lib/fsevents-handler.js @ ./node_modules/_chokidar@2.0.4@chokidar/index.js @ ./node_modules/_watchpack@1.6.0@watchpack/lib/DirectoryWatcher.js @ ./node_modules/_watchpack@1.6.0@watchpack/lib/watcherManager.js @ ./node_modules/_watchpack@1.6.0@watchpack/lib/watchpack.js @ (webpack)/lib/node/NodeWatchFileSystem.js @ (webpack)/lib/node/NodeEnvironmentPlugin.js @ (webpack)/lib/webpack.js @ multi ./node_modules/_webpack-dev-server@3.1.9@webpack-dev-server/client?http://0.0.0.0:8200 webpack ERROR in ./node_modules/_fsevents@1.2.4@fsevents/node_modules/node-pre-gyp/lib/node-pre-gyp.js Module not found: Error: Can't resolve 'fs' in 'D:\java\JetBrains\module\vue-app\vue-todo\node_modules\_fsevents@1.2.4@fsevents\node_modules\node-pre-gyp\lib' @ ./node_modules/_fsevents@1.2.4@fsevents/node_modules/node-pre-gyp/lib/node-pre-gyp.js 13:9-22 @ ./node_modules/_fsevents@1.2.4@fsevents/fsevents.js @ ./node_modules/_chokidar@2.0.4@chokidar/lib/fsevents-handler.js @ ./node_modules/_chokidar@2.0.4@chokidar/index.js @ ./node_modules/_watchpack@1.6.0@watchpack/lib/DirectoryWatcher.js @ ./node_modules/_watchpack@1.6.0@watchpack/lib/watcherManager.js @ ./node_modules/_watchpack@1.6.0@watchpack/lib/watchpack.js @ (webpack)/lib/node/NodeWatchFileSystem.js @ (webpack)/lib/node/NodeEnvironmentPlugin.js @ (webpack)/lib/webpack.js @ multi ./node_modules/_webpack-dev-server@3.1.9@webpack-dev-server/client?http://0.0.0.0:8200 webpack ERROR in ./node_modules/_fsevents@1.2.4@fsevents/node_modules/node-pre-gyp/lib/pre-binding.js Module not found: Error: Can't resolve 'fs' in 'D:\java\JetBrains\module\vue-app\vue-todo\node_modules\_fsevents@1.2.4@fsevents\node_modules\node-pre-gyp\lib' @ ./node_modules/_fsevents@1.2.4@fsevents/node_modules/node-pre-gyp/lib/pre-binding.js 5:17-30 @ ./node_modules/_fsevents@1.2.4@fsevents/node_modules/node-pre-gyp/lib/node-pre-gyp.js @ ./node_modules/_fsevents@1.2.4@fsevents/fsevents.js @ ./node_modules/_chokidar@2.0.4@chokidar/lib/fsevents-handler.js @ ./node_modules/_chokidar@2.0.4@chokidar/index.js @ ./node_modules/_watchpack@1.6.0@watchpack/lib/DirectoryWatcher.js @ ./node_modules/_watchpack@1.6.0@watchpack/lib/watcherManager.js @ ./node_modules/_watchpack@1.6.0@watchpack/lib/watchpack.js @ (webpack)/lib/node/NodeWatchFileSystem.js @ (webpack)/lib/node/NodeEnvironmentPlugin.js @ (webpack)/lib/webpack.js @ multi ./node_modules/_webpack-dev-server@3.1.9@webpack-dev-server/client?http://0.0.0.0:8200 webpack ERROR in ./node_modules/_fsevents@1.2.4@fsevents/node_modules/node-pre-gyp/lib/clean.js Module not found: Error: Can't resolve 'fs' in 'D:\java\JetBrains\module\vue-app\vue-todo\node_modules\_fsevents@1.2.4@fsevents\node_modules\node-pre-gyp\lib' @ ./node_modules/_fsevents@1.2.4@fsevents/node_modules/node-pre-gyp/lib/clean.js 7:9-22 9:13-26 @ ./node_modules/_fsevents@1.2.4@fsevents/node_modules/node-pre-gyp/lib sync ^\.\/.*$ @ ./node_modules/_fsevents@1.2.4@fsevents/node_modules/node-pre-gyp/lib/node-pre-gyp.js @ ./node_modules/_fsevents@1.2.4@fsevents/fsevents.js @ ./node_modules/_chokidar@2.0.4@chokidar/lib/fsevents-handler.js @ ./node_modules/_chokidar@2.0.4@chokidar/index.js @ ./node_modules/_watchpack@1.6.0@watchpack/lib/DirectoryWatcher.js @ ./node_modules/_watchpack@1.6.0@watchpack/lib/watcherManager.js @ ./node_modules/_watchpack@1.6.0@watchpack/lib/watchpack.js @ (webpack)/lib/node/NodeWatchFileSystem.js @ (webpack)/lib/node/NodeEnvironmentPlugin.js @ (webpack)/lib/webpack.js @ multi ./node_modules/_webpack-dev-server@3.1.9@webpack-dev-server/client?http://0.0.0.0:8200 webpack ERROR in ./node_modules/_fsevents@1.2.4@fsevents/node_modules/node-pre-gyp/lib/unpublish.js Module not found: Error: Can't resolve 'fs' in 'D:\java\JetBrains\module\vue-app\vue-todo\node_modules\_fsevents@1.2.4@fsevents\node_modules\node-pre-gyp\lib' @ ./node_modules/_fsevents@1.2.4@fsevents/node_modules/node-pre-gyp/lib/unpublish.js 7:9-22 @ ./node_modules/_fsevents@1.2.4@fsevents/node_modules/node-pre-gyp/lib sync ^\.\/.*$ @ ./node_modules/_fsevents@1.2.4@fsevents/node_modules/node-pre-gyp/lib/node-pre-gyp.js @ ./node_modules/_fsevents@1.2.4@fsevents/fsevents.js @ ./node_modules/_chokidar@2.0.4@chokidar/lib/fsevents-handler.js @ ./node_modules/_chokidar@2.0.4@chokidar/index.js @ ./node_modules/_watchpack@1.6.0@watchpack/lib/DirectoryWatcher.js @ ./node_modules/_watchpack@1.6.0@watchpack/lib/watcherManager.js @ ./node_modules/_watchpack@1.6.0@watchpack/lib/watchpack.js @ (webpack)/lib/node/NodeWatchFileSystem.js @ (webpack)/lib/node/NodeEnvironmentPlugin.js @ (webpack)/lib/webpack.js @ multi ./node_modules/_webpack-dev-server@3.1.9@webpack-dev-server/client?http://0.0.0.0:8200 webpack ERROR in ./node_modules/_fsevents@1.2.4@fsevents/node_modules/node-pre-gyp/lib/package.js Module not found: Error: Can't resolve 'fs' in 'D:\java\JetBrains\module\vue-app\vue-todo\node_modules\_fsevents@1.2.4@fsevents\node_modules\node-pre-gyp\lib' @ ./node_modules/_fsevents@1.2.4@fsevents/node_modules/node-pre-gyp/lib/package.js 7:9-22 12:12-25 @ ./node_modules/_fsevents@1.2.4@fsevents/node_modules/node-pre-gyp/lib sync ^\.\/.*$ @ ./node_modules/_fsevents@1.2.4@fsevents/node_modules/node-pre-gyp/lib/node-pre-gyp.js @ ./node_modules/_fsevents@1.2.4@fsevents/fsevents.js @ ./node_modules/_chokidar@2.0.4@chokidar/lib/fsevents-handler.js @ ./node_modules/_chokidar@2.0.4@chokidar/index.js @ ./node_modules/_watchpack@1.6.0@watchpack/lib/DirectoryWatcher.js @ ./node_modules/_watchpack@1.6.0@watchpack/lib/watcherManager.js @ ./node_modules/_watchpack@1.6.0@watchpack/lib/watchpack.js @ (webpack)/lib/node/NodeWatchFileSystem.js @ (webpack)/lib/node/NodeEnvironmentPlugin.js @ (webpack)/lib/webpack.js @ multi ./node_modules/_webpack-dev-server@3.1.9@webpack-dev-server/client?http://0.0.0.0:8200 webpack ERROR in ./node_modules/_fsevents@1.2.4@fsevents/node_modules/npm-bundled/index.js Module not found: Error: Can't resolve 'fs' in 'D:\java\JetBrains\module\vue-app\vue-todo\node_modules\_fsevents@1.2.4@fsevents\node_modules\npm-bundled' @ ./node_modules/_fsevents@1.2.4@fsevents/node_modules/npm-bundled/index.js 10:11-24 @ ./node_modules/_fsevents@1.2.4@fsevents/node_modules/npm-packlist/index.js @ ./node_modules/_fsevents@1.2.4@fsevents/node_modules/node-pre-gyp/lib/package.js @ ./node_modules/_fsevents@1.2.4@fsevents/node_modules/node-pre-gyp/lib sync ^\.\/.*$ @ ./node_modules/_fsevents@1.2.4@fsevents/node_modules/node-pre-gyp/lib/node-pre-gyp.js @ ./node_modules/_fsevents@1.2.4@fsevents/fsevents.js @ ./node_modules/_chokidar@2.0.4@chokidar/lib/fsevents-handler.js @ ./node_modules/_chokidar@2.0.4@chokidar/index.js @ ./node_modules/_watchpack@1.6.0@watchpack/lib/DirectoryWatcher.js @ ./node_modules/_watchpack@1.6.0@watchpack/lib/watcherManager.js @ ./node_modules/_watchpack@1.6.0@watchpack/lib/watchpack.js @ (webpack)/lib/node/NodeWatchFileSystem.js @ (webpack)/lib/node/NodeEnvironmentPlugin.js @ (webpack)/lib/webpack.js @ multi ./node_modules/_webpack-dev-server@3.1.9@webpack-dev-server/client?http://0.0.0.0:8200 webpack ERROR in ./node_modules/_fsevents@1.2.4@fsevents/node_modules/rimraf/rimraf.js Module not found: Error: Can't resolve 'fs' in 'D:\java\JetBrains\module\vue-app\vue-todo\node_modules\_fsevents@1.2.4@fsevents\node_modules\rimraf' @ ./node_modules/_fsevents@1.2.4@fsevents/node_modules/rimraf/rimraf.js 6:9-22 @ ./node_modules/_fsevents@1.2.4@fsevents/node_modules/node-pre-gyp/lib/util/napi.js @ ./node_modules/_fsevents@1.2.4@fsevents/node_modules/node-pre-gyp/lib/node-pre-gyp.js @ ./node_modules/_fsevents@1.2.4@fsevents/fsevents.js @ ./node_modules/_chokidar@2.0.4@chokidar/lib/fsevents-handler.js @ ./node_modules/_chokidar@2.0.4@chokidar/index.js @ ./node_modules/_watchpack@1.6.0@watchpack/lib/DirectoryWatcher.js @ ./node_modules/_watchpack@1.6.0@watchpack/lib/watcherManager.js @ ./node_modules/_watchpack@1.6.0@watchpack/lib/watchpack.js @ (webpack)/lib/node/NodeWatchFileSystem.js @ (webpack)/lib/node/NodeEnvironmentPlugin.js @ (webpack)/lib/webpack.js @ multi ./node_modules/_webpack-dev-server@3.1.9@webpack-dev-server/client?http://0.0.0.0:8200 webpack ERROR in ./node_modules/_fsevents@1.2.4@fsevents/node_modules/tar/lib/replace.js Module not found: Error: Can't resolve 'fs' in 'D:\java\JetBrains\module\vue-app\vue-todo\node_modules\_fsevents@1.2.4@fsevents\node_modules\tar\lib' @ ./node_modules/_fsevents@1.2.4@fsevents/node_modules/tar/lib/replace.js 8:11-24 @ ./node_modules/_fsevents@1.2.4@fsevents/node_modules/tar/index.js @ ./node_modules/_fsevents@1.2.4@fsevents/node_modules/node-pre-gyp/lib/package.js @ ./node_modules/_fsevents@1.2.4@fsevents/node_modules/node-pre-gyp/lib sync ^\.\/.*$ @ ./node_modules/_fsevents@1.2.4@fsevents/node_modules/node-pre-gyp/lib/node-pre-gyp.js @ ./node_modules/_fsevents@1.2.4@fsevents/fsevents.js @ ./node_modules/_chokidar@2.0.4@chokidar/lib/fsevents-handler.js @ ./node_modules/_chokidar@2.0.4@chokidar/index.js @ ./node_modules/_watchpack@1.6.0@watchpack/lib/DirectoryWatcher.js @ ./node_modules/_watchpack@1.6.0@watchpack/lib/watcherManager.js @ ./node_modules/_watchpack@1.6.0@watchpack/lib/watchpack.js @ (webpack)/lib/node/NodeWatchFileSystem.js @ (webpack)/lib/node/NodeEnvironmentPlugin.js @ (webpack)/lib/webpack.js @ multi ./node_modules/_webpack-dev-server@3.1.9@webpack-dev-server/client?http://0.0.0.0:8200 webpack ERROR in ./node_modules/_fsevents@1.2.4@fsevents/node_modules/tar/lib/mkdir.js Module not found: Error: Can't resolve 'fs' in 'D:\java\JetBrains\module\vue-app\vue-todo\node_modules\_fsevents@1.2.4@fsevents\node_modules\tar\lib' @ ./node_modules/_fsevents@1.2.4@fsevents/node_modules/tar/lib/mkdir.js 8:11-24 @ ./node_modules/_fsevents@1.2.4@fsevents/node_modules/tar/lib/unpack.js @ ./node_modules/_fsevents@1.2.4@fsevents/node_modules/tar/index.js @ ./node_modules/_fsevents@1.2.4@fsevents/node_modules/node-pre-gyp/lib/package.js @ ./node_modules/_fsevents@1.2.4@fsevents/node_modules/node-pre-gyp/lib sync ^\.\/.*$ @ ./node_modules/_fsevents@1.2.4@fsevents/node_modules/node-pre-gyp/lib/node-pre-gyp.js @ ./node_modules/_fsevents@1.2.4@fsevents/fsevents.js @ ./node_modules/_chokidar@2.0.4@chokidar/lib/fsevents-handler.js @ ./node_modules/_chokidar@2.0.4@chokidar/index.js @ ./node_modules/_watchpack@1.6.0@watchpack/lib/DirectoryWatcher.js @ ./node_modules/_watchpack@1.6.0@watchpack/lib/watcherManager.js @ ./node_modules/_watchpack@1.6.0@watchpack/lib/watchpack.js @ (webpack)/lib/node/NodeWatchFileSystem.js @ (webpack)/lib/node/NodeEnvironmentPlugin.js @ (webpack)/lib/webpack.js @ multi ./node_modules/_webpack-dev-server@3.1.9@webpack-dev-server/client?http://0.0.0.0:8200 webpack ERROR in ./node_modules/_fsevents@1.2.4@fsevents/node_modules/tar/lib/write-entry.js Module not found: Error: Can't resolve 'fs' in 'D:\java\JetBrains\module\vue-app\vue-todo\node_modules\_fsevents@1.2.4@fsevents\node_modules\tar\lib' @ ./node_modules/_fsevents@1.2.4@fsevents/node_modules/tar/lib/write-entry.js 7:11-24 @ ./node_modules/_fsevents@1.2.4@fsevents/node_modules/tar/index.js @ ./node_modules/_fsevents@1.2.4@fsevents/node_modules/node-pre-gyp/lib/package.js @ ./node_modules/_fsevents@1.2.4@fsevents/node_modules/node-pre-gyp/lib sync ^\.\/.*$ @ ./node_modules/_fsevents@1.2.4@fsevents/node_modules/node-pre-gyp/lib/node-pre-gyp.js @ ./node_modules/_fsevents@1.2.4@fsevents/fsevents.js @ ./node_modules/_chokidar@2.0.4@chokidar/lib/fsevents-handler.js @ ./node_modules/_chokidar@2.0.4@chokidar/index.js @ ./node_modules/_watchpack@1.6.0@watchpack/lib/DirectoryWatcher.js @ ./node_modules/_watchpack@1.6.0@watchpack/lib/watcherManager.js @ ./node_modules/_watchpack@1.6.0@watchpack/lib/watchpack.js @ (webpack)/lib/node/NodeWatchFileSystem.js @ (webpack)/lib/node/NodeEnvironmentPlugin.js @ (webpack)/lib/webpack.js @ multi ./node_modules/_webpack-dev-server@3.1.9@webpack-dev-server/client?http://0.0.0.0:8200 webpack ERROR in ./node_modules/_fsevents@1.2.4@fsevents/node_modules/tar/lib/unpack.js Module not found: Error: Can't resolve 'fs' in 'D:\java\JetBrains\module\vue-app\vue-todo\node_modules\_fsevents@1.2.4@fsevents\node_modules\tar\lib' @ ./node_modules/_fsevents@1.2.4@fsevents/node_modules/tar/lib/unpack.js 6:11-24 @ ./node_modules/_fsevents@1.2.4@fsevents/node_modules/tar/index.js @ ./node_modules/_fsevents@1.2.4@fsevents/node_modules/node-pre-gyp/lib/package.js @ ./node_modules/_fsevents@1.2.4@fsevents/node_modules/node-pre-gyp/lib sync ^\.\/.*$ @ ./node_modules/_fsevents@1.2.4@fsevents/node_modules/node-pre-gyp/lib/node-pre-gyp.js @ ./node_modules/_fsevents@1.2.4@fsevents/fsevents.js @ ./node_modules/_chokidar@2.0.4@chokidar/lib/fsevents-handler.js @ ./node_modules/_chokidar@2.0.4@chokidar/index.js @ ./node_modules/_watchpack@1.6.0@watchpack/lib/DirectoryWatcher.js @ ./node_modules/_watchpack@1.6.0@watchpack/lib/watcherManager.js @ ./node_modules/_watchpack@1.6.0@watchpack/lib/watchpack.js @ (webpack)/lib/node/NodeWatchFileSystem.js @ (webpack)/lib/node/NodeEnvironmentPlugin.js @ (webpack)/lib/webpack.js @ multi ./node_modules/_webpack-dev-server@3.1.9@webpack-dev-server/client?http://0.0.0.0:8200 webpack ERROR in ./node_modules/_fsevents@1.2.4@fsevents/node_modules/tar/lib/pack.js Module not found: Error: Can't resolve 'fs' in 'D:\java\JetBrains\module\vue-app\vue-todo\node_modules\_fsevents@1.2.4@fsevents\node_modules\tar\lib' @ ./node_modules/_fsevents@1.2.4@fsevents/node_modules/tar/lib/pack.js 56:11-24 @ ./node_modules/_fsevents@1.2.4@fsevents/node_modules/tar/index.js @ ./node_modules/_fsevents@1.2.4@fsevents/node_modules/node-pre-gyp/lib/package.js @ ./node_modules/_fsevents@1.2.4@fsevents/node_modules/node-pre-gyp/lib sync ^\.\/.*$ @ ./node_modules/_fsevents@1.2.4@fsevents/node_modules/node-pre-gyp/lib/node-pre-gyp.js @ ./node_modules/_fsevents@1.2.4@fsevents/fsevents.js @ ./node_modules/_chokidar@2.0.4@chokidar/lib/fsevents-handler.js @ ./node_modules/_chokidar@2.0.4@chokidar/index.js @ ./node_modules/_watchpack@1.6.0@watchpack/lib/DirectoryWatcher.js @ ./node_modules/_watchpack@1.6.0@watchpack/lib/watcherManager.js @ ./node_modules/_watchpack@1.6.0@watchpack/lib/watchpack.js @ (webpack)/lib/node/NodeWatchFileSystem.js @ (webpack)/lib/node/NodeEnvironmentPlugin.js @ (webpack)/lib/webpack.js @ multi ./node_modules/_webpack-dev-server@3.1.9@webpack-dev-server/client?http://0.0.0.0:8200 webpack ERROR in ./node_modules/_fsevents@1.2.4@fsevents/node_modules/tar/lib/extract.js Module not found: Error: Can't resolve 'fs' in 'D:\java\JetBrains\module\vue-app\vue-todo\node_modules\_fsevents@1.2.4@fsevents\node_modules\tar\lib' @ ./node_modules/_fsevents@1.2.4@fsevents/node_modules/tar/lib/extract.js 6:11-24 @ ./node_modules/_fsevents@1.2.4@fsevents/node_modules/tar/index.js @ ./node_modules/_fsevents@1.2.4@fsevents/node_modules/node-pre-gyp/lib/package.js @ ./node_modules/_fsevents@1.2.4@fsevents/node_modules/node-pre-gyp/lib sync ^\.\/.*$ @ ./node_modules/_fsevents@1.2.4@fsevents/node_modules/node-pre-gyp/lib/node-pre-gyp.js @ ./node_modules/_fsevents@1.2.4@fsevents/fsevents.js @ ./node_modules/_chokidar@2.0.4@chokidar/lib/fsevents-handler.js @ ./node_modules/_chokidar@2.0.4@chokidar/index.js @ ./node_modules/_watchpack@1.6.0@watchpack/lib/DirectoryWatcher.js @ ./node_modules/_watchpack@1.6.0@watchpack/lib/watcherManager.js @ ./node_modules/_watchpack@1.6.0@watchpack/lib/watchpack.js @ (webpack)/lib/node/NodeWatchFileSystem.js @ (webpack)/lib/node/NodeEnvironmentPlugin.js @ (webpack)/lib/webpack.js @ multi ./node_modules/_webpack-dev-server@3.1.9@webpack-dev-server/client?http://0.0.0.0:8200 webpack ERROR in ./node_modules/_fsevents@1.2.4@fsevents/node_modules/tar/lib/list.js Module not found: Error: Can't resolve 'fs' in 'D:\java\JetBrains\module\vue-app\vue-todo\node_modules\_fsevents@1.2.4@fsevents\node_modules\tar\lib' @ ./node_modules/_fsevents@1.2.4@fsevents/node_modules/tar/lib/list.js 11:11-24 @ ./node_modules/_fsevents@1.2.4@fsevents/node_modules/tar/index.js @ ./node_modules/_fsevents@1.2.4@fsevents/node_modules/node-pre-gyp/lib/package.js @ ./node_modules/_fsevents@1.2.4@fsevents/node_modules/node-pre-gyp/lib sync ^\.\/.*$ @ ./node_modules/_fsevents@1.2.4@fsevents/node_modules/node-pre-gyp/lib/node-pre-gyp.js @ ./node_modules/_fsevents@1.2.4@fsevents/fsevents.js @ ./node_modules/_chokidar@2.0.4@chokidar/lib/fsevents-handler.js @ ./node_modules/_chokidar@2.0.4@chokidar/index.js @ ./node_modules/_watchpack@1.6.0@watchpack/lib/DirectoryWatcher.js @ ./node_modules/_watchpack@1.6.0@watchpack/lib/watcherManager.js @ ./node_modules/_watchpack@1.6.0@watchpack/lib/watchpack.js @ (webpack)/lib/node/NodeWatchFileSystem.js @ (webpack)/lib/node/NodeEnvironmentPlugin.js @ (webpack)/lib/webpack.js @ multi ./node_modules/_webpack-dev-server@3.1.9@webpack-dev-server/client?http://0.0.0.0:8200 webpack ERROR in ./node_modules/_fsevents@1.2.4@fsevents/node_modules/tar/lib/create.js Module not found: Error: Can't resolve 'fs' in 'D:\java\JetBrains\module\vue-app\vue-todo\node_modules\_fsevents@1.2.4@fsevents\node_modules\tar\lib' @ ./node_modules/_fsevents@1.2.4@fsevents/node_modules/tar/lib/create.js 7:11-24 @ ./node_modules/_fsevents@1.2.4@fsevents/node_modules/tar/index.js @ ./node_modules/_fsevents@1.2.4@fsevents/node_modules/node-pre-gyp/lib/package.js @ ./node_modules/_fsevents@1.2.4@fsevents/node_modules/node-pre-gyp/lib sync ^\.\/.*$ @ ./node_modules/_fsevents@1.2.4@fsevents/node_modules/node-pre-gyp/lib/node-pre-gyp.js @ ./node_modules/_fsevents@1.2.4@fsevents/fsevents.js @ ./node_modules/_chokidar@2.0.4@chokidar/lib/fsevents-handler.js @ ./node_modules/_chokidar@2.0.4@chokidar/index.js @ ./node_modules/_watchpack@1.6.0@watchpack/lib/DirectoryWatcher.js @ ./node_modules/_watchpack@1.6.0@watchpack/lib/watcherManager.js @ ./node_modules/_watchpack@1.6.0@watchpack/lib/watchpack.js @ (webpack)/lib/node/NodeWatchFileSystem.js @ (webpack)/lib/node/NodeEnvironmentPlugin.js @ (webpack)/lib/webpack.js @ multi ./node_modules/_webpack-dev-server@3.1.9@webpack-dev-server/client?http://0.0.0.0:8200 webpack ERROR in ./node_modules/_glob@7.1.3@glob/sync.js Module not found: Error: Can't resolve 'fs' in 'D:\java\JetBrains\module\vue-app\vue-todo\node_modules\_glob@7.1.3@glob' @ ./node_modules/_glob@7.1.3@glob/sync.js 4:9-22 @ ./node_modules/_glob@7.1.3@glob/glob.js @ ./node_modules/_cacache@10.0.4@cacache/lib/verify.js @ ./node_modules/_cacache@10.0.4@cacache/verify.js @ ./node_modules/_cacache@10.0.4@cacache/locales/en.js @ ./node_modules/_cacache@10.0.4@cacache/index.js @ ./node_modules/_uglifyjs-webpack-plugin@1.3.0@uglifyjs-webpack-plugin/dist/uglify/Runner.js @ ./node_modules/_uglifyjs-webpack-plugin@1.3.0@uglifyjs-webpack-plugin/dist/index.js @ ./node_modules/_uglifyjs-webpack-plugin@1.3.0@uglifyjs-webpack-plugin/dist/cjs.js @ (webpack)/lib/WebpackOptionsDefaulter.js @ (webpack)/lib/webpack.js @ multi ./node_modules/_webpack-dev-server@3.1.9@webpack-dev-server/client?http://0.0.0.0:8200 webpack ERROR in ./node_modules/_glob@7.1.3@glob/glob.js Module not found: Error: Can't resolve 'fs' in 'D:\java\JetBrains\module\vue-app\vue-todo\node_modules\_glob@7.1.3@glob' @ ./node_modules/_glob@7.1.3@glob/glob.js 43:9-22 @ ./node_modules/_cacache@10.0.4@cacache/lib/verify.js @ ./node_modules/_cacache@10.0.4@cacache/verify.js @ ./node_modules/_cacache@10.0.4@cacache/locales/en.js @ ./node_modules/_cacache@10.0.4@cacache/index.js @ ./node_modules/_uglifyjs-webpack-plugin@1.3.0@uglifyjs-webpack-plugin/dist/uglify/Runner.js @ ./node_modules/_uglifyjs-webpack-plugin@1.3.0@uglifyjs-webpack-plugin/dist/index.js @ ./node_modules/_uglifyjs-webpack-plugin@1.3.0@uglifyjs-webpack-plugin/dist/cjs.js @ (webpack)/lib/WebpackOptionsDefaulter.js @ (webpack)/lib/webpack.js @ multi ./node_modules/_webpack-dev-server@3.1.9@webpack-dev-server/client?http://0.0.0.0:8200 webpack ERROR in ./node_modules/_graceful-fs@4.1.11@graceful-fs/graceful-fs.js Module not found: Error: Can't resolve 'fs' in 'D:\java\JetBrains\module\vue-app\vue-todo\node_modules\_graceful-fs@4.1.11@graceful-fs' @ ./node_modules/_graceful-fs@4.1.11@graceful-fs/graceful-fs.js 1:9-22 @ ./node_modules/_enhanced-resolve@4.1.0@enhanced-resolve/lib/NodeJsInputFileSystem.js @ (webpack)/lib/node/NodeEnvironmentPlugin.js @ (webpack)/lib/webpack.js @ multi ./node_modules/_webpack-dev-server@3.1.9@webpack-dev-server/client?http://0.0.0.0:8200 webpack ERROR in ./node_modules/_graceful-fs@4.1.11@graceful-fs/fs.js Module not found: Error: Can't resolve 'fs' in 'D:\java\JetBrains\module\vue-app\vue-todo\node_modules\_graceful-fs@4.1.11@graceful-fs' @ ./node_modules/_graceful-fs@4.1.11@graceful-fs/fs.js 3:9-22 @ ./node_modules/_graceful-fs@4.1.11@graceful-fs/graceful-fs.js @ ./node_modules/_enhanced-resolve@4.1.0@enhanced-resolve/lib/NodeJsInputFileSystem.js @ (webpack)/lib/node/NodeEnvironmentPlugin.js @ (webpack)/lib/webpack.js @ multi ./node_modules/_webpack-dev-server@3.1.9@webpack-dev-server/client?http://0.0.0.0:8200 webpack ERROR in ./node_modules/_loader-runner@2.3.1@loader-runner/lib/LoaderRunner.js Module not found: Error: Can't resolve 'fs' in 'D:\java\JetBrains\module\vue-app\vue-todo\node_modules\_loader-runner@2.3.1@loader-runner\lib' @ ./node_modules/_loader-runner@2.3.1@loader-runner/lib/LoaderRunner.js 5:9-22 @ (webpack)/lib/NormalModule.js @ (webpack)/lib/AutomaticPrefetchPlugin.js @ (webpack)/lib/webpack.js @ multi ./node_modules/_webpack-dev-server@3.1.9@webpack-dev-server/client?http://0.0.0.0:8200 webpack ERROR in ./node_modules/_make-dir@1.3.0@make-dir/index.js Module not found: Error: Can't resolve 'fs' in 'D:\java\JetBrains\module\vue-app\vue-todo\node_modules\_make-dir@1.3.0@make-dir' @ ./node_modules/_make-dir@1.3.0@make-dir/index.js 2:11-24 @ ./node_modules/_find-cache-dir@1.0.0@find-cache-dir/index.js @ ./node_modules/_uglifyjs-webpack-plugin@1.3.0@uglifyjs-webpack-plugin/dist/uglify/Runner.js @ ./node_modules/_uglifyjs-webpack-plugin@1.3.0@uglifyjs-webpack-plugin/dist/index.js @ ./node_modules/_uglifyjs-webpack-plugin@1.3.0@uglifyjs-webpack-plugin/dist/cjs.js @ (webpack)/lib/WebpackOptionsDefaulter.js @ (webpack)/lib/webpack.js @ multi ./node_modules/_webpack-dev-server@3.1.9@webpack-dev-server/client?http://0.0.0.0:8200 webpack ERROR in ./node_modules/_mkdirp@0.5.1@mkdirp/index.js Module not found: Error: Can't resolve 'fs' in 'D:\java\JetBrains\module\vue-app\vue-todo\node_modules\_mkdirp@0.5.1@mkdirp' @ ./node_modules/_mkdirp@0.5.1@mkdirp/index.js 2:9-22 @ (webpack)/lib/node/NodeOutputFileSystem.js @ (webpack)/lib/node/NodeEnvironmentPlugin.js @ (webpack)/lib/webpack.js @ multi ./node_modules/_webpack-dev-server@3.1.9@webpack-dev-server/client?http://0.0.0.0:8200 webpack ERROR in ./node_modules/_move-concurrently@1.0.1@move-concurrently/move.js Module not found: Error: Can't resolve 'fs' in 'D:\java\JetBrains\module\vue-app\vue-todo\node_modules\_move-concurrently@1.0.1@move-concurrently' @ ./node_modules/_move-concurrently@1.0.1@move-concurrently/move.js 4:13-26 @ ./node_modules/_cacache@10.0.4@cacache/lib/util/move-file.js @ ./node_modules/_cacache@10.0.4@cacache/lib/content/write.js @ ./node_modules/_cacache@10.0.4@cacache/put.js @ ./node_modules/_cacache@10.0.4@cacache/locales/en.js @ ./node_modules/_cacache@10.0.4@cacache/index.js @ ./node_modules/_uglifyjs-webpack-plugin@1.3.0@uglifyjs-webpack-plugin/dist/uglify/Runner.js @ ./node_modules/_uglifyjs-webpack-plugin@1.3.0@uglifyjs-webpack-plugin/dist/index.js @ ./node_modules/_uglifyjs-webpack-plugin@1.3.0@uglifyjs-webpack-plugin/dist/cjs.js @ (webpack)/lib/WebpackOptionsDefaulter.js @ (webpack)/lib/webpack.js @ multi ./node_modules/_webpack-dev-server@3.1.9@webpack-dev-server/client?http://0.0.0.0:8200 webpack ERROR in ./node_modules/_path-exists@3.0.0@path-exists/index.js Module not found: Error: Can't resolve 'fs' in 'D:\java\JetBrains\module\vue-app\vue-todo\node_modules\_path-exists@3.0.0@path-exists' @ ./node_modules/_path-exists@3.0.0@path-exists/index.js 2:11-24 @ ./node_modules/_locate-path@2.0.0@locate-path/index.js @ ./node_modules/_find-up@2.1.0@find-up/index.js @ ./node_modules/_pkg-dir@2.0.0@pkg-dir/index.js @ ./node_modules/_find-cache-dir@1.0.0@find-cache-dir/index.js @ ./node_modules/_uglifyjs-webpack-plugin@1.3.0@uglifyjs-webpack-plugin/dist/uglify/Runner.js @ ./node_modules/_uglifyjs-webpack-plugin@1.3.0@uglifyjs-webpack-plugin/dist/index.js @ ./node_modules/_uglifyjs-webpack-plugin@1.3.0@uglifyjs-webpack-plugin/dist/cjs.js @ (webpack)/lib/WebpackOptionsDefaulter.js @ (webpack)/lib/webpack.js @ multi ./node_modules/_webpack-dev-server@3.1.9@webpack-dev-server/client?http://0.0.0.0:8200 webpack ERROR in ./node_modules/_rimraf@2.6.2@rimraf/rimraf.js Module not found: Error: Can't resolve 'fs' in 'D:\java\JetBrains\module\vue-app\vue-todo\node_modules\_rimraf@2.6.2@rimraf' @ ./node_modules/_rimraf@2.6.2@rimraf/rimraf.js 6:9-22 @ ./node_modules/_cacache@10.0.4@cacache/lib/util/tmp.js @ ./node_modules/_cacache@10.0.4@cacache/locales/en.js @ ./node_modules/_cacache@10.0.4@cacache/index.js @ ./node_modules/_uglifyjs-webpack-plugin@1.3.0@uglifyjs-webpack-plugin/dist/uglify/Runner.js @ ./node_modules/_uglifyjs-webpack-plugin@1.3.0@uglifyjs-webpack-plugin/dist/index.js @ ./node_modules/_uglifyjs-webpack-plugin@1.3.0@uglifyjs-webpack-plugin/dist/cjs.js @ (webpack)/lib/WebpackOptionsDefaulter.js @ (webpack)/lib/webpack.js @ multi ./node_modules/_webpack-dev-server@3.1.9@webpack-dev-server/client?http://0.0.0.0:8200 webpack ERROR in ./node_modules/_schema-utils@0.4.7@schema-utils/src/validateOptions.js Module not found: Error: Can't resolve 'fs' in 'D:\java\JetBrains\module\vue-app\vue-todo\node_modules\_schema-utils@0.4.7@schema-utils\src' @ ./node_modules/_schema-utils@0.4.7@schema-utils/src/validateOptions.js 8:11-24 @ ./node_modules/_schema-utils@0.4.7@schema-utils/src/index.js @ (webpack)/lib/BannerPlugin.js @ (webpack)/lib/webpack.js @ multi ./node_modules/_webpack-dev-server@3.1.9@webpack-dev-server/client?http://0.0.0.0:8200 webpack ERROR in ./node_modules/_snapdragon@0.8.2@snapdragon/lib/source-maps.js Module not found: Error: Can't resolve 'fs' in 'D:\java\JetBrains\module\vue-app\vue-todo\node_modules\_snapdragon@0.8.2@snapdragon\lib' @ ./node_modules/_snapdragon@0.8.2@snapdragon/lib/source-maps.js 3:9-22 @ ./node_modules/_snapdragon@0.8.2@snapdragon/lib/compiler.js @ ./node_modules/_snapdragon@0.8.2@snapdragon/index.js @ ./node_modules/_micromatch@3.1.10@micromatch/lib/utils.js @ ./node_modules/_micromatch@3.1.10@micromatch/index.js @ (webpack)/lib/optimize/SideEffectsFlagPlugin.js @ (webpack)/lib/webpack.js @ multi ./node_modules/_webpack-dev-server@3.1.9@webpack-dev-server/client?http://0.0.0.0:8200 webpack ERROR in ./node_modules/_uglify-es@3.3.9@uglify-es/tools/node.js Module not found: Error: Can't resolve 'fs' in 'D:\java\JetBrains\module\vue-app\vue-todo\node_modules\_uglify-es@3.3.9@uglify-es\tools' @ ./node_modules/_uglify-es@3.3.9@uglify-es/tools/node.js 1:9-22 @ ./node_modules/_uglifyjs-webpack-plugin@1.3.0@uglifyjs-webpack-plugin/dist/uglify/minify.js @ ./node_modules/_uglifyjs-webpack-plugin@1.3.0@uglifyjs-webpack-plugin/dist/uglify/Runner.js @ ./node_modules/_uglifyjs-webpack-plugin@1.3.0@uglifyjs-webpack-plugin/dist/index.js @ ./node_modules/_uglifyjs-webpack-plugin@1.3.0@uglifyjs-webpack-plugin/dist/cjs.js @ (webpack)/lib/WebpackOptionsDefaulter.js @ (webpack)/lib/webpack.js @ multi ./node_modules/_webpack-dev-server@3.1.9@webpack-dev-server/client?http://0.0.0.0:8200 webpack ERROR in (webpack)/lib/debug/ProfilingPlugin.js Module not found: Error: Can't resolve 'fs' in 'D:\java\JetBrains\module\vue-app\vue-todo\node_modules\_webpack@4.20.2@webpack\lib\debug' @ (webpack)/lib/debug/ProfilingPlugin.js 1:11-24 @ (webpack)/lib/webpack.js @ multi ./node_modules/_webpack-dev-server@3.1.9@webpack-dev-server/client?http://0.0.0.0:8200 webpack ERROR in (webpack)/lib/node/NodeMainTemplateAsync.runtime.js Module not found: Error: Can't resolve 'fs' in 'D:\java\JetBrains\module\vue-app\vue-todo\node_modules\_webpack@4.20.2@webpack\lib\node' @ (webpack)/lib/node/NodeMainTemplateAsync.runtime.js 10:2-15 28:3-16 @ (webpack)/lib/node/NodeMainTemplatePlugin.js @ (webpack)/lib/node/NodeTemplatePlugin.js @ (webpack)/lib/webpack.js @ multi ./node_modules/_webpack-dev-server@3.1.9@webpack-dev-server/client?http://0.0.0.0:8200 webpack ERROR in (webpack)/lib/node/NodeOutputFileSystem.js Module not found: Error: Can't resolve 'fs' in 'D:\java\JetBrains\module\vue-app\vue-todo\node_modules\_webpack@4.20.2@webpack\lib\node' @ (webpack)/lib/node/NodeOutputFileSystem.js 7:11-24 @ (webpack)/lib/node/NodeEnvironmentPlugin.js @ (webpack)/lib/webpack.js @ multi ./node_modules/_webpack-dev-server@3.1.9@webpack-dev-server/client?http://0.0.0.0:8200 webpack ERROR in ./node_modules/_y18n@4.0.0@y18n/index.js Module not found: Error: Can't resolve 'fs' in 'D:\java\JetBrains\module\vue-app\vue-todo\node_modules\_y18n@4.0.0@y18n' @ ./node_modules/_y18n@4.0.0@y18n/index.js 1:9-22 @ ./node_modules/_cacache@10.0.4@cacache/lib/util/y.js @ ./node_modules/_cacache@10.0.4@cacache/locales/en.js @ ./node_modules/_cacache@10.0.4@cacache/index.js @ ./node_modules/_uglifyjs-webpack-plugin@1.3.0@uglifyjs-webpack-plugin/dist/uglify/Runner.js @ ./node_modules/_uglifyjs-webpack-plugin@1.3.0@uglifyjs-webpack-plugin/dist/index.js @ ./node_modules/_uglifyjs-webpack-plugin@1.3.0@uglifyjs-webpack-plugin/dist/cjs.js @ (webpack)/lib/WebpackOptionsDefaulter.js @ (webpack)/lib/webpack.js @ multi ./node_modules/_webpack-dev-server@3.1.9@webpack-dev-server/client?http://0.0.0.0:8200 webpack ERROR in (webpack)/lib/NormalModule.js Module not found: Error: Can't resolve 'module' in 'D:\java\JetBrains\module\vue-app\vue-todo\node_modules\_webpack@4.20.2@webpack\lib' @ (webpack)/lib/NormalModule.js 7:21-38 @ (webpack)/lib/AutomaticPrefetchPlugin.js @ (webpack)/lib/webpack.js @ multi ./node_modules/_webpack-dev-server@3.1.9@webpack-dev-server/client?http://0.0.0.0:8200 webpack ERROR in (webpack)/lib/node/NodeTargetPlugin.js Module not found: Error: Can't resolve 'module' in 'D:\java\JetBrains\module\vue-app\vue-todo\node_modules\_webpack@4.20.2@webpack\lib\node' @ (webpack)/lib/node/NodeTargetPlugin.js 11:1-18 @ (webpack)/lib/WebpackOptionsApply.js @ (webpack)/lib/webpack.js @ multi ./node_modules/_webpack-dev-server@3.1.9@webpack-dev-server/client?http://0.0.0.0:8200 webpack Child html-webpack-plugin for "index.html": 1 asset Entrypoint undefined = index.html [0] ./node_modules/_html-webpack-plugin@3.2.0@html-webpack-plugin/lib/loader.js!./node_modules/_html-webpack-plugin@3.2.0@html-webpack-plugin/default_index.ejs 392 bytes {0} [b uilt] [1] ./node_modules/_lodash@4.17.11@lodash/lodash.js 527 KiB {0} [built] [2] (webpack)/buildin/global.js 509 bytes {0} [built] [3] (webpack)/buildin/module.js 519 bytes {0} [built] i 「wdm」: Failed to compile.

IDEA运行报错:Error:Internal error: (java.net.MalformedURLException) unknown protocol:

Error:Internal error: (java.net.MalformedURLException) unknown protocol: jrt java.net.MalformedURLException: unknown protocol: jrt at java.net.URL.<init>(URL.java:421) at java.net.URL.<init>(URL.java:310) at java.net.URL.<init>(URL.java:333) at com.intellij.compiler.instrumentation.InstrumentationClassFinder.createJDKPlatformUrl(InstrumentationClassFinder.java:61) at org.jetbrains.jps.incremental.instrumentation.ClassProcessingBuilder.createInstrumentationClassFinder(ClassProcessingBuilder.java:125) at org.jetbrains.jps.incremental.instrumentation.ClassProcessingBuilder.build(ClassProcessingBuilder.java:93) at org.jetbrains.jps.incremental.IncProjectBuilder.runModuleLevelBuilders(IncProjectBuilder.java:1246) at org.jetbrains.jps.incremental.IncProjectBuilder.runBuildersForChunk(IncProjectBuilder.java:923) at org.jetbrains.jps.incremental.IncProjectBuilder.buildTargetsChunk(IncProjectBuilder.java:995) at org.jetbrains.jps.incremental.IncProjectBuilder.buildChunkIfAffected(IncProjectBuilder.java:886) at org.jetbrains.jps.incremental.IncProjectBuilder.buildChunks(IncProjectBuilder.java:719) at org.jetbrains.jps.incremental.IncProjectBuilder.runBuild(IncProjectBuilder.java:371) at org.jetbrains.jps.incremental.IncProjectBuilder.build(IncProjectBuilder.java:178) at org.jetbrains.jps.cmdline.BuildRunner.runBuild(BuildRunner.java:138) at org.jetbrains.jps.cmdline.BuildSession.runBuild(BuildSession.java:308) at org.jetbrains.jps.cmdline.BuildSession.run(BuildSession.java:138) at org.jetbrains.jps.cmdline.BuildMain$MyMessageHandler.lambda$channelRead0$0(BuildMain.java:235) at org.jetbrains.jps.service.impl.SharedThreadPoolImpl.lambda$executeOnPooledThread$0(SharedThreadPoolImpl.java:42) at java.util.concurrent.Executors$RunnableAdapter.call(Executors.java:511) at java.util.concurrent.FutureTask.run(FutureTask.java:266) at java.util.concurrent.ThreadPoolExecutor.runWorker(ThreadPoolExecutor.java:1142) at java.util.concurrent.ThreadPoolExecutor$Worker.run(ThreadPoolExecutor.java:617) at java.lang.Thread.run(Thread.java:745) Please perform full project rebuild (Build | Rebuild Project)

pygame.error: Couldn't open images\ship.bmp加了r和绝对路径还是报错,求大神指点

《python编程:从入门到实践》这本书中的《外星人入侵》的项目里有如下代码: #coding=utf-8 import sys import pygame from settings import Settings from ship import Ship def run_game(): # 初始化pygame、设置和屏幕对象 pygame.init() ai_settings = Settings() screen = pygame.display.set_mode( (ai_settings.screen_width, ai_settings.screen_height)) pygame.display.set_caption("Alien Invasion") # 创建一艘飞船 ship = Ship(screen) # 开始游戏的主循环 while True: # 监视键盘和鼠标事件 for event in pygame.event.get(): if event.type == pygame.QUIT: sys.exit() # 每次循环时都重绘屏幕 screen.fill(ai_settings.bg_color) ship.blitme() # 让最近绘制的屏幕可见 pygame.display.flip() run_game() 运行后报错: File "C:\Users\admin\Desktop\alien_invasion\ship.py", line 8, in __init__ self.image = pygame.image.load(r'C:\Users\admin\Desktop\alien_invasion\images\ship.bmp') pygame.error: Couldn't open C:\Users\admin\Desktop\alien_invasion\images\ship.bmp 我的是windows系统,也按照论坛上说的加了r、补全了路径,但仍然报错

Python下的pickle.PicklingError

["thread1", "thread2"]

android studio 报的错误

svn: E155013: Can't add 'D:\androidstudio\koalapass\code\trunk\koalapass\koalapass\.idea\libraries\pagerslidingtabstrip_1_0_1.xml' to a parent directory scheduled for deletion

在中国程序员是青春饭吗?

今年,我也32了 ,为了不给大家误导,咨询了猎头、圈内好友,以及年过35岁的几位老程序员……舍了老脸去揭人家伤疤……希望能给大家以帮助,记得帮我点赞哦。 目录: 你以为的人生 一次又一次的伤害 猎头界的真相 如何应对互联网行业的「中年危机」 一、你以为的人生 刚入行时,拿着傲人的工资,想着好好干,以为我们的人生是这样的: 等真到了那一天,你会发现,你的人生很可能是这样的: ...

程序员请照顾好自己,周末病魔差点一套带走我。

程序员在一个周末的时间,得了重病,差点当场去世,还好及时挽救回来了。

Java基础知识面试题(2020最新版)

文章目录Java概述何为编程什么是Javajdk1.5之后的三大版本JVM、JRE和JDK的关系什么是跨平台性?原理是什么Java语言有哪些特点什么是字节码?采用字节码的最大好处是什么什么是Java程序的主类?应用程序和小程序的主类有何不同?Java应用程序与小程序之间有那些差别?Java和C++的区别Oracle JDK 和 OpenJDK 的对比基础语法数据类型Java有哪些数据类型switc...

和黑客斗争的 6 天!

互联网公司工作,很难避免不和黑客们打交道,我呆过的两家互联网公司,几乎每月每天每分钟都有黑客在公司网站上扫描。有的是寻找 Sql 注入的缺口,有的是寻找线上服务器可能存在的漏洞,大部分都...

Intellij IDEA 实用插件安利

1. 前言从2020 年 JVM 生态报告解读 可以看出Intellij IDEA 目前已经稳坐 Java IDE 头把交椅。而且统计得出付费用户已经超过了八成(国外统计)。IDEA 的...

搜狗输入法也在挑战国人的智商!

故事总是一个接着一个到来...上周写完《鲁大师已经彻底沦为一款垃圾流氓软件!》这篇文章之后,鲁大师的市场工作人员就找到了我,希望把这篇文章删除掉。经过一番沟通我先把这篇文章从公号中删除了...

总结了 150 余个神奇网站,你不来瞅瞅吗?

原博客再更新,可能就没了,之后将持续更新本篇博客。

副业收入是我做程序媛的3倍,工作外的B面人生是怎样的?

提到“程序员”,多数人脑海里首先想到的大约是:为人木讷、薪水超高、工作枯燥…… 然而,当离开工作岗位,撕去层层标签,脱下“程序员”这身外套,有的人生动又有趣,马上展现出了完全不同的A/B面人生! 不论是简单的爱好,还是正经的副业,他们都干得同样出色。偶尔,还能和程序员的特质结合,产生奇妙的“化学反应”。 @Charlotte:平日素颜示人,周末美妆博主 大家都以为程序媛也个个不修边幅,但我们也许...

MySQL数据库面试题(2020最新版)

文章目录数据库基础知识为什么要使用数据库什么是SQL?什么是MySQL?数据库三大范式是什么mysql有关权限的表都有哪几个MySQL的binlog有有几种录入格式?分别有什么区别?数据类型mysql有哪些数据类型引擎MySQL存储引擎MyISAM与InnoDB区别MyISAM索引与InnoDB索引的区别?InnoDB引擎的4大特性存储引擎选择索引什么是索引?索引有哪些优缺点?索引使用场景(重点)...

如果你是老板,你会不会踢了这样的员工?

有个好朋友ZS,是技术总监,昨天问我:“有一个老下属,跟了我很多年,做事勤勤恳恳,主动性也很好。但随着公司的发展,他的进步速度,跟不上团队的步伐了,有点...

我入职阿里后,才知道原来简历这么写

私下里,有不少读者问我:“二哥,如何才能写出一份专业的技术简历呢?我总感觉自己写的简历太烂了,所以投了无数份,都石沉大海了。”说实话,我自己好多年没有写过简历了,但我认识的一个同行,他在阿里,给我说了一些他当年写简历的方法论,我感觉太牛逼了,实在是忍不住,就分享了出来,希望能够帮助到你。 01、简历的本质 作为简历的撰写者,你必须要搞清楚一点,简历的本质是什么,它就是为了来销售你的价值主张的。往深...

魂迁光刻,梦绕芯片,中芯国际终获ASML大型光刻机

据羊城晚报报道,近日中芯国际从荷兰进口的一台大型光刻机,顺利通过深圳出口加工区场站两道闸口进入厂区,中芯国际发表公告称该光刻机并非此前盛传的EUV光刻机,主要用于企业复工复产后的生产线扩容。 我们知道EUV主要用于7nm及以下制程的芯片制造,光刻机作为集成电路制造中最关键的设备,对芯片制作工艺有着决定性的影响,被誉为“超精密制造技术皇冠上的明珠”,根据之前中芯国际的公报,目...

优雅的替换if-else语句

场景 日常开发,if-else语句写的不少吧??当逻辑分支非常多的时候,if-else套了一层又一层,虽然业务功能倒是实现了,但是看起来是真的很不优雅,尤其是对于我这种有强迫症的程序"猿",看到这么多if-else,脑袋瓜子就嗡嗡的,总想着解锁新姿势:干掉过多的if-else!!!本文将介绍三板斧手段: 优先判断条件,条件不满足的,逻辑及时中断返回; 采用策略模式+工厂模式; 结合注解,锦...

离职半年了,老东家又发 offer,回不回?

有小伙伴问松哥这个问题,他在上海某公司,在离职了几个月后,前公司的领导联系到他,希望他能够返聘回去,他很纠结要不要回去? 俗话说好马不吃回头草,但是这个小伙伴既然感到纠结了,我觉得至少说明了两个问题:1.曾经的公司还不错;2.现在的日子也不是很如意。否则应该就不会纠结了。 老实说,松哥之前也有过类似的经历,今天就来和小伙伴们聊聊回头草到底吃不吃。 首先一个基本观点,就是离职了也没必要和老东家弄的苦...

2020阿里全球数学大赛:3万名高手、4道题、2天2夜未交卷

阿里巴巴全球数学竞赛( Alibaba Global Mathematics Competition)由马云发起,由中国科学技术协会、阿里巴巴基金会、阿里巴巴达摩院共同举办。大赛不设报名门槛,全世界爱好数学的人都可参与,不论是否出身数学专业、是否投身数学研究。 2020年阿里巴巴达摩院邀请北京大学、剑桥大学、浙江大学等高校的顶尖数学教师组建了出题组。中科院院士、美国艺术与科学院院士、北京国际数学...

为什么你不想学习?只想玩?人是如何一步一步废掉的

不知道是不是只有我这样子,还是你们也有过类似的经历。 上学的时候总有很多光辉历史,学年名列前茅,或者单科目大佬,但是虽然慢慢地长大了,你开始懈怠了,开始废掉了。。。 什么?你说不知道具体的情况是怎么样的? 我来告诉你: 你常常潜意识里或者心理觉得,自己真正的生活或者奋斗还没有开始。总是幻想着自己还拥有大把时间,还有无限的可能,自己还能逆风翻盘,只不是自己还没开始罢了,自己以后肯定会变得特别厉害...

百度工程师,获利10万,判刑3年!

所有一夜暴富的方法都写在刑法中,但总有人心存侥幸。这些年互联网犯罪高发,一些工程师高技术犯罪更是引发关注。这两天,一个百度运维工程师的案例传遍朋友圈。1...

程序员为什么千万不要瞎努力?

本文作者用对比非常鲜明的两个开发团队的故事,讲解了敏捷开发之道 —— 如果你的团队缺乏统一标准的环境,那么即使勤劳努力,不仅会极其耗时而且成果甚微,使用...

为什么程序员做外包会被瞧不起?

二哥,有个事想询问下您的意见,您觉得应届生值得去外包吗?公司虽然挺大的,中xx,但待遇感觉挺低,马上要报到,挺纠结的。

当HR压你价,说你只值7K,你该怎么回答?

当HR压你价,说你只值7K时,你可以流畅地回答,记住,是流畅,不能犹豫。 礼貌地说:“7K是吗?了解了。嗯~其实我对贵司的面试官印象很好。只不过,现在我的手头上已经有一份11K的offer。来面试,主要也是自己对贵司挺有兴趣的,所以过来看看……”(未完) 这段话主要是陪HR互诈的同时,从公司兴趣,公司职员印象上,都给予对方正面的肯定,既能提升HR的好感度,又能让谈判气氛融洽,为后面的发挥留足空间。...

面试:第十六章:Java中级开发(16k)

HashMap底层实现原理,红黑树,B+树,B树的结构原理 Spring的AOP和IOC是什么?它们常见的使用场景有哪些?Spring事务,事务的属性,传播行为,数据库隔离级别 Spring和SpringMVC,MyBatis以及SpringBoot的注解分别有哪些?SpringMVC的工作原理,SpringBoot框架的优点,MyBatis框架的优点 SpringCould组件有哪些,他们...

面试阿里p7,被按在地上摩擦,鬼知道我经历了什么?

面试阿里p7被问到的问题(当时我只知道第一个):@Conditional是做什么的?@Conditional多个条件是什么逻辑关系?条件判断在什么时候执...

无代码时代来临,程序员如何保住饭碗?

编程语言层出不穷,从最初的机器语言到如今2500种以上的高级语言,程序员们大呼“学到头秃”。程序员一边面临编程语言不断推陈出新,一边面临由于许多代码已存在,程序员编写新应用程序时存在重复“搬砖”的现象。 无代码/低代码编程应运而生。无代码/低代码是一种创建应用的方法,它可以让开发者使用最少的编码知识来快速开发应用程序。开发者通过图形界面中,可视化建模来组装和配置应用程序。这样一来,开发者直...

面试了一个 31 岁程序员,让我有所触动,30岁以上的程序员该何去何从?

最近面试了一个31岁8年经验的程序猿,让我有点感慨,大龄程序猿该何去何从。

大三实习生,字节跳动面经分享,已拿Offer

说实话,自己的算法,我一个不会,太难了吧

程序员垃圾简历长什么样?

已经连续五年参加大厂校招、社招的技术面试工作,简历看的不下于万份 这篇文章会用实例告诉你,什么是差的程序员简历! 疫情快要结束了,各个公司也都开始春招了,作为即将红遍大江南北的新晋UP主,那当然要为小伙伴们做点事(手动狗头)。 就在公众号里公开征简历,义务帮大家看,并一一点评。《启舰:春招在即,义务帮大家看看简历吧》 一石激起千层浪,三天收到两百多封简历。 花光了两个星期的所有空闲时...

《Oracle Java SE编程自学与面试指南》最佳学习路线图2020年最新版(进大厂必备)

正确选择比瞎努力更重要!

字节跳动面试官竟然问了我JDBC?

轻松等回家通知

面试官:你连SSO都不懂,就别来面试了

大厂竟然要考我SSO,卧槽。

实时更新:计算机编程语言排行榜—TIOBE世界编程语言排行榜(2020年6月份最新版)

内容导航: 1、TIOBE排行榜 2、总榜(2020年6月份) 3、本月前三名 3.1、C 3.2、Java 3.3、Python 4、学习路线图 5、参考地址 1、TIOBE排行榜 TIOBE排行榜是根据全世界互联网上有经验的程序员、课程和第三方厂商的数量,并使用搜索引擎(如Google、Bing、Yahoo!)以及Wikipedia、Amazon、YouTube统计出排名数据。

立即提问
相关内容推荐