ubuntu下使用wine1.6.2安装qq出错

在ubuntu下安装qq7.5.exe,错误提示,安装路径无效,没有权限在此目录下写入数据。目录权限都是可读可写可执行。换了linux的目录格式,它提示没有这个目录。什么情况,能解决吗?

1个回答

ubuntu1404可以安2011国际版

Csdn user default icon
上传中...
上传图片
插入图片
抄袭、复制答案,以达到刷声望分或其他目的的行为,在CSDN问答是严格禁止的,一经发现立刻封号。是时候展现真正的技术了!
其他相关推荐
Ubuntu 16.04安装opencv 3.4.1出错
Ubuntu16.04安装opencv 3.4.1出错,请求大佬帮忙看下是啥问题,百度也找不出问题。log记录如下: Determining if the include file sys/videoio.h exists failed with the following output: Change Dir: /home/whitejiang/opencv-3.4.1/my_build_dir/CMakeFiles/CMakeTmp Run Build Command:"/usr/bin/make" "cmTC_f508d/fast" /usr/bin/make -f CMakeFiles/cmTC_f508d.dir/build.make CMakeFiles/cmTC_f508d.dir/build make[1]: Entering directory '/home/whitejiang/opencv-3.4.1/my_build_dir/CMakeFiles/CMakeTmp' Building C object CMakeFiles/cmTC_f508d.dir/CheckIncludeFile.c.o /usr/bin/cc -fsigned-char -W -Wall -Werror=return-type -Werror=non-virtual-dtor -Werror=address -Werror=sequence-point -Wformat -Werror=format-security -Wmissing-declarations -Wmissing-prototypes -Wstrict-prototypes -Wundef -Winit-self -Wpointer-arith -Wshadow -Wuninitialized -Winit-self -Wno-narrowing -Wno-comment -fdiagnostics-show-option -Wno-long-long -pthread -fomit-frame-pointer -ffunction-sections -fdata-sections -msse -msse2 -msse3 -fvisibility=hidden -O3 -DNDEBUG -fPIE -o CMakeFiles/cmTC_f508d.dir/CheckIncludeFile.c.o -c /home/whitejiang/opencv-3.4.1/my_build_dir/CMakeFiles/CMakeTmp/CheckIncludeFile.c /home/whitejiang/opencv-3.4.1/my_build_dir/CMakeFiles/CMakeTmp/CheckIncludeFile.c:1:25: fatal error: sys/videoio.h: 没有那个文件或目录 compilation terminated. CMakeFiles/cmTC_f508d.dir/build.make:65: recipe for target 'CMakeFiles/cmTC_f508d.dir/CheckIncludeFile.c.o' failed make[1]: *** [CMakeFiles/cmTC_f508d.dir/CheckIncludeFile.c.o] Error 1 make[1]: Leaving directory '/home/whitejiang/opencv-3.4.1/my_build_dir/CMakeFiles/CMakeTmp' Makefile:126: recipe for target 'cmTC_f508d/fast' failed make: *** [cmTC_f508d/fast] Error 2
ubuntu18.04中安装了wine版本的QQ和微信后Wine System Tray总是悬浮在外面
系统:ubuntu18.04 wine版本:deepin-wine_2.18-19 微信版本:deepin.com.wechat_2.6.8.65deepin0_i386 QQ版本:deepin.com.qq.im_8.9.19983deepin23_i386 之前在ubuntu16.04中安装好像没有这个问题,直接就进入任务栏里面了。 我也在网上搜索了一些解决方案,很多都是说在“面板”上点击右键可以“添加到面板”然后选择通知区域。 但是我不知道这个面板指的是桌面上的任务栏吗?? 我在任务栏上点右键完全是没有反应的。 另外我现在是安装了gnome-tweak,然后用的是Dash to panel扩展 不过我把扩展关了,使用原生的任务栏也没用。 求助这个应该怎样来设置呢?谢谢各位
ubuntu:依赖: uno-libs3 (= 5.1.6~rc2-0ubuntu1~xenial3) 但是 5.1.6~rc2-0ubuntu1~xenial7 正要被安装
正在读取软件包列表... 完成 正在分析软件包的依赖关系树 正在读取状态信息... 完成 libstdc++6 已经是最新版 (5.4.0-6ubuntu1~16.04.11)。 您可能需要运行“apt-get -f install”来纠正下列错误: 下列软件包有未满足的依赖关系: ure : 依赖: uno-libs3 (= 5.1.6~rc2-0ubuntu1~xenial3) 但是 5.1.6~rc2-0ubuntu1~xenial7 正要被安装 小白看不懂啊 心里苦啊 百度谷歌了……求教大神
Ubuntu中关于Hadoop2.6.0的安装
求教: 1.我的程序运行到 bin/hadoop jar share/hadoop/mapreduce/sources/hadoop-mapreduce-examples-2.6.0-sources.jar 时, 发生错误:RunJar jarFile [mainClass] args..., 2.我的程序运行到 /usr/local/hadoop$ org.apache.hadoop.examples.WordCount input output 发生错误: org.apache.hadoop.examples.WordCount:未找到命令 我本来是想在hadoop没有对配置文件进行处理前,进行一下测试,但是出现这种情况,请问怎么处理,谢谢!
在win10子系统ubuntu18.04下安装mysql5.7尝试重新启动的时候出现以下报错
在win10子系统ubuntu18.04下安装mysql5.7尝试重新启动的时候出现以下报错 1.安装mysql-server ``` root@PC-5200:/home/tom# apt-get -y install mysql-server ``` ``` Reading package lists... Done Building dependency tree Reading state information... Done The following package was automatically installed and is no longer required: libfreetype6 Use 'apt autoremove' to remove it. The following additional packages will be installed: libaio1 libcgi-fast-perl libcgi-pm-perl libencode-locale-perl libevent-core-2.1-6 libfcgi-perl libhtml-parser-perl libhtml-tagset-perl libhtml-template-perl libhttp-date-perl libhttp-message-perl libio-html-perl liblwp-mediatypes-perl libssl1.1 libtimedate-perl liburi-perl mysql-client-5.7 mysql-client-core-5.7 mysql-common mysql-server-5.7 mysql-server-core-5.7 Suggested packages: libdata-dump-perl libipc-sharedcache-perl libwww-perl mailx tinyca The following NEW packages will be installed: libaio1 libcgi-fast-perl libcgi-pm-perl libencode-locale-perl libevent-core-2.1-6 libfcgi-perl libhtml-parser-perl libhtml-tagset-perl libhtml-template-perl libhttp-date-perl libhttp-message-perl libio-html-perl liblwp-mediatypes-perl libtimedate-perl liburi-perl mysql-client-5.7 mysql-client-core-5.7 mysql-common mysql-server mysql-server-5.7 mysql-server-core-5.7 The following packages will be upgraded: libssl1.1 1 upgraded, 21 newly installed, 0 to remove and 136 not upgraded. Need to get 21.0 MB of archives. After this operation, 157 MB of additional disk space will be used. Get:1 http://mirrors.aliyun.com/ubuntu bionic/main amd64 mysql-common all 5.8+1.0.4 [7308 B] Get:2 http://mirrors.aliyun.com/ubuntu bionic-updates/main amd64 libaio1 amd64 0.3.110-5ubuntu0.1 [6476 B] Get:3 http://mirrors.aliyun.com/ubuntu bionic-security/main amd64 libssl1.1 amd64 1.1.1-1ubuntu2.1~18.04.5 [1300 kB] Get:4 http://mirrors.aliyun.com/ubuntu bionic-security/main amd64 mysql-client-core-5.7 amd64 5.7.28-0ubuntu0.18.04.4 [6644 kB] Get:5 http://mirrors.aliyun.com/ubuntu bionic-security/main amd64 mysql-client-5.7 amd64 5.7.28-0ubuntu0.18.04.4 [1943 kB] Get:6 http://mirrors.aliyun.com/ubuntu bionic-security/main amd64 mysql-server-core-5.7 amd64 5.7.28-0ubuntu0.18.04.4 [7432 kB] Get:7 http://mirrors.aliyun.com/ubuntu bionic/main amd64 libevent-core-2.1-6 amd64 2.1.8-stable-4build1 [85.9 kB] Get:8 http://mirrors.aliyun.com/ubuntu bionic-security/main amd64 mysql-server-5.7 amd64 5.7.28-0ubuntu0.18.04.4 [2932 kB] Get:9 http://mirrors.aliyun.com/ubuntu bionic/main amd64 libhtml-tagset-perl all 3.20-3 [12.1 kB] Get:10 http://mirrors.aliyun.com/ubuntu bionic/main amd64 liburi-perl all 1.73-1 [77.2 kB] Get:11 http://mirrors.aliyun.com/ubuntu bionic/main amd64 libhtml-parser-perl amd64 3.72-3build1 [85.9 kB] Get:12 http://mirrors.aliyun.com/ubuntu bionic/main amd64 libcgi-pm-perl all 4.38-1 [185 kB] Get:13 http://mirrors.aliyun.com/ubuntu bionic/main amd64 libfcgi-perl amd64 0.78-2build1 [32.8 kB] Get:14 http://mirrors.aliyun.com/ubuntu bionic/main amd64 libcgi-fast-perl all 1:2.13-1 [9940 B] Get:15 http://mirrors.aliyun.com/ubuntu bionic/main amd64 libencode-locale-perl all 1.05-1 [12.3 kB] Get:16 http://mirrors.aliyun.com/ubuntu bionic/main amd64 libhtml-template-perl all 2.97-1 [59.0 kB] Get:17 http://mirrors.aliyun.com/ubuntu bionic/main amd64 libtimedate-perl all 2.3000-2 [37.5 kB] Get:18 http://mirrors.aliyun.com/ubuntu bionic/main amd64 libhttp-date-perl all 6.02-1 [10.4 kB] Get:19 http://mirrors.aliyun.com/ubuntu bionic/main amd64 libio-html-perl all 1.001-1 [14.9 kB] Get:20 http://mirrors.aliyun.com/ubuntu bionic/main amd64 liblwp-mediatypes-perl all 6.02-1 [21.7 kB] Get:21 http://mirrors.aliyun.com/ubuntu bionic/main amd64 libhttp-message-perl all 6.14-1 [72.1 kB] Get:22 http://mirrors.aliyun.com/ubuntu bionic-security/main amd64 mysql-server all 5.7.28-0ubuntu0.18.04.4 [9940 B] Fetched 21.0 MB in 9s (2376 kB/s) Preconfiguring packages ... Selecting previously unselected package mysql-common. (Reading database ... 28663 files and directories currently installed.) Preparing to unpack .../0-mysql-common_5.8+1.0.4_all.deb ... Unpacking mysql-common (5.8+1.0.4) ... Selecting previously unselected package libaio1:amd64. Preparing to unpack .../1-libaio1_0.3.110-5ubuntu0.1_amd64.deb ... Unpacking libaio1:amd64 (0.3.110-5ubuntu0.1) ... Preparing to unpack .../2-libssl1.1_1.1.1-1ubuntu2.1~18.04.5_amd64.deb ... Unpacking libssl1.1:amd64 (1.1.1-1ubuntu2.1~18.04.5) over (1.1.0g-2ubuntu4.3) ... Selecting previously unselected package mysql-client-core-5.7. Preparing to unpack .../3-mysql-client-core-5.7_5.7.28-0ubuntu0.18.04.4_amd64.deb ... Unpacking mysql-client-core-5.7 (5.7.28-0ubuntu0.18.04.4) ... Selecting previously unselected package mysql-client-5.7. Preparing to unpack .../4-mysql-client-5.7_5.7.28-0ubuntu0.18.04.4_amd64.deb ... Unpacking mysql-client-5.7 (5.7.28-0ubuntu0.18.04.4) ... Selecting previously unselected package mysql-server-core-5.7. Preparing to unpack .../5-mysql-server-core-5.7_5.7.28-0ubuntu0.18.04.4_amd64.deb ... Unpacking mysql-server-core-5.7 (5.7.28-0ubuntu0.18.04.4) ... Selecting previously unselected package libevent-core-2.1-6:amd64. Preparing to unpack .../6-libevent-core-2.1-6_2.1.8-stable-4build1_amd64.deb ... Unpacking libevent-core-2.1-6:amd64 (2.1.8-stable-4build1) ... Setting up mysql-common (5.8+1.0.4) ... update-alternatives: using /etc/mysql/my.cnf.fallback to provide /etc/mysql/my.cnf (my.cnf) in auto mode Selecting previously unselected package mysql-server-5.7. (Reading database ... 28832 files and directories currently installed.) Preparing to unpack .../00-mysql-server-5.7_5.7.28-0ubuntu0.18.04.4_amd64.deb ... Unpacking mysql-server-5.7 (5.7.28-0ubuntu0.18.04.4) ... Selecting previously unselected package libhtml-tagset-perl. Preparing to unpack .../01-libhtml-tagset-perl_3.20-3_all.deb ... Unpacking libhtml-tagset-perl (3.20-3) ... Selecting previously unselected package liburi-perl. Preparing to unpack .../02-liburi-perl_1.73-1_all.deb ... Unpacking liburi-perl (1.73-1) ... Selecting previously unselected package libhtml-parser-perl. Preparing to unpack .../03-libhtml-parser-perl_3.72-3build1_amd64.deb ... Unpacking libhtml-parser-perl (3.72-3build1) ... Selecting previously unselected package libcgi-pm-perl. Preparing to unpack .../04-libcgi-pm-perl_4.38-1_all.deb ... Unpacking libcgi-pm-perl (4.38-1) ... Selecting previously unselected package libfcgi-perl. Preparing to unpack .../05-libfcgi-perl_0.78-2build1_amd64.deb ... Unpacking libfcgi-perl (0.78-2build1) ... Selecting previously unselected package libcgi-fast-perl. Preparing to unpack .../06-libcgi-fast-perl_1%3a2.13-1_all.deb ... Unpacking libcgi-fast-perl (1:2.13-1) ... Selecting previously unselected package libencode-locale-perl. Preparing to unpack .../07-libencode-locale-perl_1.05-1_all.deb ... Unpacking libencode-locale-perl (1.05-1) ... Selecting previously unselected package libhtml-template-perl. Preparing to unpack .../08-libhtml-template-perl_2.97-1_all.deb ... Unpacking libhtml-template-perl (2.97-1) ... Selecting previously unselected package libtimedate-perl. Preparing to unpack .../09-libtimedate-perl_2.3000-2_all.deb ... Unpacking libtimedate-perl (2.3000-2) ... Selecting previously unselected package libhttp-date-perl. Preparing to unpack .../10-libhttp-date-perl_6.02-1_all.deb ... Unpacking libhttp-date-perl (6.02-1) ... Selecting previously unselected package libio-html-perl. Preparing to unpack .../11-libio-html-perl_1.001-1_all.deb ... Unpacking libio-html-perl (1.001-1) ... Selecting previously unselected package liblwp-mediatypes-perl. Preparing to unpack .../12-liblwp-mediatypes-perl_6.02-1_all.deb ... Unpacking liblwp-mediatypes-perl (6.02-1) ... Selecting previously unselected package libhttp-message-perl. Preparing to unpack .../13-libhttp-message-perl_6.14-1_all.deb ... Unpacking libhttp-message-perl (6.14-1) ... Selecting previously unselected package mysql-server. Preparing to unpack .../14-mysql-server_5.7.28-0ubuntu0.18.04.4_all.deb ... Unpacking mysql-server (5.7.28-0ubuntu0.18.04.4) ... Setting up libhtml-tagset-perl (3.20-3) ... Setting up libevent-core-2.1-6:amd64 (2.1.8-stable-4build1) ... Processing triggers for ureadahead (0.100.0-21) ... Setting up libencode-locale-perl (1.05-1) ... Setting up libtimedate-perl (2.3000-2) ... Setting up libio-html-perl (1.001-1) ... Setting up liblwp-mediatypes-perl (6.02-1) ... Processing triggers for libc-bin (2.27-3ubuntu1) ... Setting up libaio1:amd64 (0.3.110-5ubuntu0.1) ... Setting up liburi-perl (1.73-1) ... Setting up libssl1.1:amd64 (1.1.1-1ubuntu2.1~18.04.5) ... Checking for services that may need to be restarted...done. Checking for services that may need to be restarted...done. Checking init scripts... Restarting services possibly affected by the upgrade: invoke-rc.d: could not determine current runlevel Services restarted successfully. Processing triggers for systemd (237-3ubuntu10.21) ... Setting up libhtml-parser-perl (3.72-3build1) ... Setting up libcgi-pm-perl (4.38-1) ... Processing triggers for man-db (2.8.3-2ubuntu0.1) ... Setting up mysql-client-core-5.7 (5.7.28-0ubuntu0.18.04.4) ... Setting up libfcgi-perl (0.78-2build1) ... Setting up libhttp-date-perl (6.02-1) ... Setting up libhtml-template-perl (2.97-1) ... Setting up mysql-server-core-5.7 (5.7.28-0ubuntu0.18.04.4) ... Setting up libcgi-fast-perl (1:2.13-1) ... Setting up libhttp-message-perl (6.14-1) ... Setting up mysql-client-5.7 (5.7.28-0ubuntu0.18.04.4) ... Setting up mysql-server-5.7 (5.7.28-0ubuntu0.18.04.4) ... invoke-rc.d: could not determine current runlevel * Stopping MySQL database server mysqld [ OK ] update-alternatives: using /etc/mysql/mysql.cnf to provide /etc/mysql/my.cnf (my.cnf) in auto mode Renaming removed key_buffer and myisam-recover options (if present) Cannot open /proc/net/unix: No such file or directory Cannot stat file /proc/1/fd/5: Operation not permitted Cannot stat file /proc/1/fd/10: Operation not permitted Cannot stat file /proc/1/fd/6: Operation not permitted Cannot stat file /proc/7/fd/7: Operation not permitted Cannot stat file /proc/7/fd/10: Operation not permitted Cannot stat file /proc/7/fd/5: Operation not permitted Created symlink /etc/systemd/system/multi-user.target.wants/mysql.service → /lib/systemd/system/mysql.service. invoke-rc.d: could not determine current runlevel Setting up mysql-server (5.7.28-0ubuntu0.18.04.4) ... Processing triggers for libc-bin (2.27-3ubuntu1) ... Processing triggers for ureadahead (0.100.0-21) ... Processing triggers for systemd (237-3ubuntu10.21) ... ``` 2.启动mysql服务 ``` root@PC-5200:/home/tom# systemctl start mysql.service ``` 3.出现如下报错 ``` System has not been booted with systemd as init system (PID 1). Can't operate. ```
ubuntu下hadoop-2.6.0测试用例运行失败
Results : Failed tests: TestTableMapping.testClearingCachedMappings:144 expected:</[rack1]> but was:</[default-rack]> TestTableMapping.testTableCaching:79 expected:</[rack1]> but was:</[default-rack]> TestTableMapping.testResolve:56 expected:</[rack1]> but was:</[default-rack]> TestDecayRpcScheduler.testAccumulate:136 expected:<3> but was:<2> TestDecayRpcScheduler.testPriority:203 expected:<2> but was:<1> Tests run: 2723, Failures: 5, Errors: 0, Skipped: 91 [INFO] ------------------------------------------------------------------------ [INFO] Reactor Summary: [INFO] [INFO] Apache Hadoop Main ................................ SUCCESS [4.300s] [INFO] Apache Hadoop Project POM ......................... SUCCESS [2.250s] [INFO] Apache Hadoop Annotations ......................... SUCCESS [7.805s] [INFO] Apache Hadoop Assemblies .......................... SUCCESS [1.006s] [INFO] Apache Hadoop Project Dist POM .................... SUCCESS [8.227s] [INFO] Apache Hadoop Maven Plugins ....................... SUCCESS [9.390s] [INFO] Apache Hadoop MiniKDC ............................. SUCCESS [22.836s] [INFO] Apache Hadoop Auth ................................ SUCCESS [40.704s] [INFO] Apache Hadoop Auth Examples ....................... SUCCESS [4.181s] [INFO] Apache Hadoop Common .............................. FAILURE [27:26.889s] [INFO] Apache Hadoop NFS ................................. SKIPPED [INFO] Apache Hadoop KMS ................................. SKIPPED [INFO] Apache Hadoop Common Project ...................... SKIPPED [INFO] Apache Hadoop HDFS ................................ SKIPPED [INFO] Apache Hadoop HttpFS .............................. SKIPPED [INFO] Apache Hadoop HDFS BookKeeper Journal ............. SKIPPED [INFO] Apache Hadoop HDFS-NFS ............................ SKIPPED [INFO] Apache Hadoop HDFS Project ........................ SKIPPED [INFO] hadoop-yarn ....................................... SKIPPED [INFO] hadoop-yarn-api ................................... SKIPPED [INFO] hadoop-yarn-common ................................ SKIPPED [INFO] hadoop-yarn-server ................................ SKIPPED [INFO] hadoop-yarn-server-common ......................... SKIPPED [INFO] hadoop-yarn-server-nodemanager .................... SKIPPED [INFO] hadoop-yarn-server-web-proxy ...................... SKIPPED [INFO] hadoop-yarn-server-applicationhistoryservice ...... SKIPPED [INFO] hadoop-yarn-server-resourcemanager ................ SKIPPED [INFO] hadoop-yarn-server-tests .......................... SKIPPED [INFO] hadoop-yarn-client ................................ SKIPPED [INFO] hadoop-yarn-applications .......................... SKIPPED [INFO] hadoop-yarn-applications-distributedshell ......... SKIPPED [INFO] hadoop-yarn-applications-unmanaged-am-launcher .... SKIPPED [INFO] hadoop-yarn-site .................................. SKIPPED [INFO] hadoop-yarn-registry .............................. SKIPPED [INFO] hadoop-yarn-project ............................... SKIPPED [INFO] hadoop-mapreduce-client ........................... SKIPPED [INFO] hadoop-mapreduce-client-core ...................... SKIPPED [INFO] hadoop-mapreduce-client-common .................... SKIPPED [INFO] hadoop-mapreduce-client-shuffle ................... SKIPPED [INFO] hadoop-mapreduce-client-app ....................... SKIPPED [INFO] hadoop-mapreduce-client-hs ........................ SKIPPED [INFO] hadoop-mapreduce-client-jobclient ................. SKIPPED [INFO] hadoop-mapreduce-client-hs-plugins ................ SKIPPED [INFO] Apache Hadoop MapReduce Examples .................. SKIPPED [INFO] hadoop-mapreduce .................................. SKIPPED [INFO] Apache Hadoop MapReduce Streaming ................. SKIPPED [INFO] Apache Hadoop Distributed Copy .................... SKIPPED [INFO] Apache Hadoop Archives ............................ SKIPPED [INFO] Apache Hadoop Rumen ............................... SKIPPED [INFO] Apache Hadoop Gridmix ............................. SKIPPED [INFO] Apache Hadoop Data Join ........................... SKIPPED [INFO] Apache Hadoop Ant Tasks ........................... SKIPPED [INFO] Apache Hadoop Extras .............................. SKIPPED [INFO] Apache Hadoop Pipes ............................... SKIPPED [INFO] Apache Hadoop OpenStack support ................... SKIPPED [INFO] Apache Hadoop Amazon Web Services support ......... SKIPPED [INFO] Apache Hadoop Client .............................. SKIPPED [INFO] Apache Hadoop Mini-Cluster ........................ SKIPPED [INFO] Apache Hadoop Scheduler Load Simulator ............ SKIPPED [INFO] Apache Hadoop Tools Dist .......................... SKIPPED [INFO] Apache Hadoop Tools ............................... SKIPPED [INFO] Apache Hadoop Distribution ........................ SKIPPED [INFO] ------------------------------------------------------------------------ [INFO] BUILD FAILURE [INFO] ------------------------------------------------------------------------ [INFO] Total time: 29:15.906s [INFO] Finished at: Tue Jun 09 01:10:59 CST 2015 [INFO] Final Memory: 65M/202M [INFO] ------------------------------------------------------------------------ [ERROR] Failed to execute goal org.apache.maven.plugins:maven-surefire-plugin:2.16:test (default-test) on project hadoop-common: There are test failures. [ERROR] [ERROR] Please refer to /home/cj/workspace/hadoop-2.6.0-src/hadoop-common-project/hadoop-common/target/surefire-reports for the individual test results. [ERROR] -> [Help 1] [ERROR] [ERROR] To see the full stack trace of the errors, re-run Maven with the -e switch. [ERROR] Re-run Maven using the -X switch to enable full debug logging. [ERROR] [ERROR] For more information about the errors and possible solutions, please read the following articles: [ERROR] [Help 1] http://cwiki.apache.org/confluence/display/MAVEN/MojoFailureException [ERROR] [ERROR] After correcting the problems, you can resume the build with the command [ERROR] mvn <goals> -rf :hadoop-common
Ubuntu 下配置Ruby1.9.1,Rails2.3.3出错
安装一切正常 ruby -v; gem -v; rails -v都能出来正确的结果。 但用rails project时,就出错了,错误原因 $ rails hello /usr/local/ruby/lib/ruby/gems/1.9.1/gems/rails-2.3.3/lib/rails_generator/options.rb:32:in `default_options': [b][color=red]undefined method `write_inheritable_attribute' for Rails::Generator::Base:Class (NoMethodError)[/color][/b] from /usr/local/ruby/lib/ruby/gems/1.9.1/gems/rails-2.3.3/lib/rails_generator/base.rb:90:in `<class:Base>' from /usr/local/ruby/lib/ruby/gems/1.9.1/gems/rails-2.3.3/lib/rails_generator/base.rb:85:in `<module:Generator>' from /usr/local/ruby/lib/ruby/gems/1.9.1/gems/rails-2.3.3/lib/rails_generator/base.rb:48:in `<module:Rails>' from /usr/local/ruby/lib/ruby/gems/1.9.1/gems/rails-2.3.3/lib/rails_generator/base.rb:6:in `<top (required)>' from /usr/local/ruby/lib/ruby/gems/1.9.1/gems/rails-2.3.3/lib/rails_generator.rb:34:in `require' from /usr/local/ruby/lib/ruby/gems/1.9.1/gems/rails-2.3.3/lib/rails_generator.rb:34:in `<top (required)>' from /usr/local/ruby/lib/ruby/gems/1.9.1/gems/rails-2.3.3/bin/rails:14:in `require' from /usr/local/ruby/lib/ruby/gems/1.9.1/gems/rails-2.3.3/bin/rails:14:in `<top (required)>' from /usr/local/ruby/bin/rails:19:in `load' from /usr/local/ruby/bin/rails:19:in `<main>' 有很多关于这个问题的分析,全是英文 ,大意是[color=red]iconv.so未配置好[/color],已经一周了。实在搞不定,谁有办法,帮我一下啊。。第一次配环境。 [b]问题补充:[/b] 感谢night_stalker的回答,按你的提示,我去试了下 [code="sh"]require 'iconv' 返回 [color=red]=> true[/color][/code] [code="java"] sudo apt-get install iconv [color=red]E: Couldn't find package iconv[/color] [/code] 我试着用了你的 iconv-pure 后,还是不行,错误原因一样! [b]问题补充:[/b] [code="java"] irb(main):001:0> require 'activesupport' LoadError: no such file to load -- activesupport from (irb):1:in `require' from (irb):1 from /usr/local/ruby/bin/irb:12:in `<main>' [/code] 看来应该是这个问题了,我先自己找下解决方案,麻烦你也帮我看下怎么解决吧。 谢谢了! :D [b]问题补充:[/b] 再次感谢 night_stalker: 问题解决了,果然是activesupport引起的。 我运行了这个gem去安装 [code="java"] $ sudo gem install activesupport [/code] 安装完成后就好了,谢谢!
ubuntu14.04.3下安装cuda7.5的问题
我在ubuntu14.04.3下安装cuda7.5。 安装完成后我使用命令nvcc -V,结果显示: nvcc未安装,若要安装请使用sudo apt-get install nvidia-cuda-toolkit. 所以我按照提示使用上面的命令安装了nvcc。然后使用nvcc -V,显示; Cuda compilation tools release5.5 V5.5.0 怎么会是5.5?而不是7.5。不管怎样,能用了。但是在~/samples目录下,make之后,./deviceQuery,显示: cuda driver version is insufficient for cuda runtime verdion。 所以我执行了这个命令sudo apt-get install cuda-drivers。其中因为以来关系,还安装了opencl。反正安装好了之后,./deviceQuery的结果就正确了。 但是问题来了,nvcc又显示未安装。 怎么办啊?
Ubuntu Deepin Wine QQ安装出错,该怎么解决?
在根据网上的教程安装Deepin wine QQ。刚安装wine时要求卸载67个软件包,因为我之前确定了卸载,导致整个系统无法进入图形界面,只能靠startx进入,于是这次就没敢继续下去。该怎么解决这个问题?学校解答。 ![图片说明](https://img-ask.csdn.net/upload/201912/31/1577778165_336053.png) ![图片说明](https://img-ask.csdn.net/upload/201912/31/1577778334_259544.png)
Ubuntu18.04无法安装python2.7
Ubuntu18.04环境下需要安装python2.7 输入sudo apt insatll python2.7 无法安装 提示依赖项错误,请问该如何解决? ![图片说明](https://img-ask.csdn.net/upload/201910/06/1570346751_900166.jpg)
ubuntu jdk1.6 安装出现问题
我要在ubuntu系统上编译android源代码,编译的时候提示说要安装jdk1.6,可是安装 jdk1.6一直成功不了。我是按照网上的教程来的,按理说执行jdk-6u45-linux-x64.bin 文件应该在当前目录下出现jdk-6u45文件夹,可是我的是下面的内容: ![图片说明](https://img-ask.csdn.net/upload/201603/09/1457517559_423119.png) 这样就导致后面没有办法配置环境变量,求教大神这应该怎么解决呢
Ubuntu php5.3.0 安装包或安装指令
谁有Ubuntu php5.3的安装包,请共享一下, 现在apt-get intall都是直接安装最新版本的,再降下来会产生一些问题,希望能直接按钻杆5.3的版本。 谢谢
ubuntu10.04如何安装rpm安装包?
公司开发人员给了一个rpm的安装包,让我在ubuntu的系统下安装测试, 但是我使用rpm -ivh --debian xxx.rpm的命令进行安装时,就会弹出libc.so.6等被xxx.rpm所需要的提示 我已经安装了rpm,glibc等相关到安装包了,请问要怎么解决这些依赖关系? 不知道为什么不能上传图片,具体到错误如下: libc.so.6被xxx.rpm所需要 libc.so.6(GLIBC_2.0)被xxx.rpm所需要 libc.so.6(GLIBC_2.1)被xxx.rpm所需要 libc.so.6(GLIBC_2.1.3)被xxx.rpm所需要 libc.so.6(GLIBC_2.3)被xxx.rpm所需要 libc.so.6(GLIBC_2.8)被xxx.rpm所需要 libdl.so.2被xxx.rpm所需要 libdl.so.2(GLIBC_2.0)被xxx.rpm所需要 libdl.so.2(GLIBC_2.1)被xxx.rpm所需要 libm.so.6被xxx.rpm所需要 libm.so.6(GLIBC_2.0)被xxx.rpm所需要 libpthread.so.0被xxx.rpm所需要 libpthread.so.0(GLIBC_2.0)被xxx.rpm所需要 libpthread.so.0(GLIBC_2.1)被xxx.rpm所需要 libpthread.so.0(GLIBC_2.3.2)被xxx.rpm所需要 librt.so.1被xxx.rpm所需要 librt.so.1(GLIBC_2.2)被xxx.rpm所需要 rtld(GNU_HASH)被xxx.rpm所需要
ubuntu18.04 python3.6 pip安装mysqlclient报错
ubuntu18.04 python3.6 pip安装mysqlclient报错 求大佬解答 ``` Building wheels for collected packages: mysqlclient Running setup.py bdist_wheel for mysqlclient ... error Complete output from command /usr/bin/python3 -u -c "import setuptools, tokenize;__file__='/tmp/pip-build-njxuuzpo/mysqlclient/setup.py';f=getattr(tokenize, 'open', open)(__file__);code=f.read().replace('\r\n', '\n');f.close();exec(compile(code, __file__, 'exec'))" bdist_wheel -d /tmp/tmpzs54ny_2pip-wheel- --python-tag cp36: running bdist_wheel running build running build_py creating build creating build/lib.linux-x86_64-3.6 creating build/lib.linux-x86_64-3.6/MySQLdb copying MySQLdb/__init__.py -> build/lib.linux-x86_64-3.6/MySQLdb copying MySQLdb/_exceptions.py -> build/lib.linux-x86_64-3.6/MySQLdb copying MySQLdb/compat.py -> build/lib.linux-x86_64-3.6/MySQLdb copying MySQLdb/connections.py -> build/lib.linux-x86_64-3.6/MySQLdb copying MySQLdb/converters.py -> build/lib.linux-x86_64-3.6/MySQLdb copying MySQLdb/cursors.py -> build/lib.linux-x86_64-3.6/MySQLdb copying MySQLdb/release.py -> build/lib.linux-x86_64-3.6/MySQLdb copying MySQLdb/times.py -> build/lib.linux-x86_64-3.6/MySQLdb creating build/lib.linux-x86_64-3.6/MySQLdb/constants copying MySQLdb/constants/__init__.py -> build/lib.linux-x86_64-3.6/MySQLdb/constants copying MySQLdb/constants/CLIENT.py -> build/lib.linux-x86_64-3.6/MySQLdb/constants copying MySQLdb/constants/CR.py -> build/lib.linux-x86_64-3.6/MySQLdb/constants copying MySQLdb/constants/ER.py -> build/lib.linux-x86_64-3.6/MySQLdb/constants copying MySQLdb/constants/FIELD_TYPE.py -> build/lib.linux-x86_64-3.6/MySQLdb/constants copying MySQLdb/constants/FLAG.py -> build/lib.linux-x86_64-3.6/MySQLdb/constants running build_ext building 'MySQLdb._mysql' extension creating build/temp.linux-x86_64-3.6 creating build/temp.linux-x86_64-3.6/MySQLdb x86_64-linux-gnu-gcc -pthread -DNDEBUG -g -fwrapv -O2 -Wall -g -fstack-protector-strong -Wformat -Werror=format-security -Wdate-time -D_FORTIFY_SOURCE=2 -fPIC -Dversion_info=(1,4,5,'final',0) -D__version__=1.4.5 -I/usr/include/mysql -I/usr/include/python3.6m -c MySQLdb/_mysql.c -o build/temp.linux-x86_64-3.6/MySQLdb/_mysql.o x86_64-linux-gnu-gcc -pthread -shared -Wl,-O1 -Wl,-Bsymbolic-functions -Wl,-Bsymbolic-functions -Wl,-z,relro -Wl,-Bsymbolic-functions -Wl,-z,relro -g -fstack-protector-strong -Wformat -Werror=format-security -Wdate-time -D_FORTIFY_SOURCE=2 build/temp.linux-x86_64-3.6/MySQLdb/_mysql.o -lmysqlclient -lpthread -lz -lm -lrt -latomic -lssl -lcrypto -ldl -o build/lib.linux-x86_64-3.6/MySQLdb/_mysql.cpython-36m-x86_64-linux-gnu.so /usr/bin/ld: cannot find -lssl /usr/bin/ld: cannot find -lcrypto collect2: error: ld returned 1 exit status error: command 'x86_64-linux-gnu-gcc' failed with exit status 1 ---------------------------------------- Failed building wheel for mysqlclient Running setup.py clean for mysqlclient Failed to build mysqlclient Installing collected packages: mysqlclient Running setup.py install for mysqlclient ... error Complete output from command /usr/bin/python3 -u -c "import setuptools, tokenize;__file__='/tmp/pip-build-njxuuzpo/mysqlclient/setup.py';f=getattr(tokenize, 'open', open)(__file__);code=f.read().replace('\r\n', '\n');f.close();exec(compile(code, __file__, 'exec'))" install --record /tmp/pip-ldoqhl56-record/install-record.txt --single-version-externally-managed --compile --user --prefix=: running install running build running build_py creating build creating build/lib.linux-x86_64-3.6 creating build/lib.linux-x86_64-3.6/MySQLdb copying MySQLdb/__init__.py -> build/lib.linux-x86_64-3.6/MySQLdb copying MySQLdb/_exceptions.py -> build/lib.linux-x86_64-3.6/MySQLdb copying MySQLdb/compat.py -> build/lib.linux-x86_64-3.6/MySQLdb copying MySQLdb/connections.py -> build/lib.linux-x86_64-3.6/MySQLdb copying MySQLdb/converters.py -> build/lib.linux-x86_64-3.6/MySQLdb copying MySQLdb/cursors.py -> build/lib.linux-x86_64-3.6/MySQLdb copying MySQLdb/release.py -> build/lib.linux-x86_64-3.6/MySQLdb copying MySQLdb/times.py -> build/lib.linux-x86_64-3.6/MySQLdb creating build/lib.linux-x86_64-3.6/MySQLdb/constants copying MySQLdb/constants/__init__.py -> build/lib.linux-x86_64-3.6/MySQLdb/constants copying MySQLdb/constants/CLIENT.py -> build/lib.linux-x86_64-3.6/MySQLdb/constants copying MySQLdb/constants/CR.py -> build/lib.linux-x86_64-3.6/MySQLdb/constants copying MySQLdb/constants/ER.py -> build/lib.linux-x86_64-3.6/MySQLdb/constants copying MySQLdb/constants/FIELD_TYPE.py -> build/lib.linux-x86_64-3.6/MySQLdb/constants copying MySQLdb/constants/FLAG.py -> build/lib.linux-x86_64-3.6/MySQLdb/constants running build_ext building 'MySQLdb._mysql' extension creating build/temp.linux-x86_64-3.6 creating build/temp.linux-x86_64-3.6/MySQLdb x86_64-linux-gnu-gcc -pthread -DNDEBUG -g -fwrapv -O2 -Wall -g -fstack-protector-strong -Wformat -Werror=format-security -Wdate-time -D_FORTIFY_SOURCE=2 -fPIC -Dversion_info=(1,4,5,'final',0) -D__version__=1.4.5 -I/usr/include/mysql -I/usr/include/python3.6m -c MySQLdb/_mysql.c -o build/temp.linux-x86_64-3.6/MySQLdb/_mysql.o x86_64-linux-gnu-gcc -pthread -shared -Wl,-O1 -Wl,-Bsymbolic-functions -Wl,-Bsymbolic-functions -Wl,-z,relro -Wl,-Bsymbolic-functions -Wl,-z,relro -g -fstack-protector-strong -Wformat -Werror=format-security -Wdate-time -D_FORTIFY_SOURCE=2 build/temp.linux-x86_64-3.6/MySQLdb/_mysql.o -lmysqlclient -lpthread -lz -lm -lrt -latomic -lssl -lcrypto -ldl -o build/lib.linux-x86_64-3.6/MySQLdb/_mysql.cpython-36m-x86_64-linux-gnu.so /usr/bin/ld: cannot find -lssl /usr/bin/ld: cannot find -lcrypto collect2: error: ld returned 1 exit status error: command 'x86_64-linux-gnu-gcc' failed with exit status 1 ---------------------------------------- Command "/usr/bin/python3 -u -c "import setuptools, tokenize;__file__='/tmp/pip-build-njxuuzpo/mysqlclient/setup.py';f=getattr(tokenize, 'open', open)(__file__);code=f.read().replace('\r\n', '\n');f.close();exec(compile(code, __file__, 'exec'))" install --record /tmp/pip-ldoqhl56-record/install-record.txt --single-version-externally-managed --compile --user --prefix=" failed with error code 1 in /tmp/pip-build-njxuuzpo/mysqlclient/ ```
Ubuntu19.04 安装 libpng12-0 出错
在安装xfce桌面时,出现缺少依赖问题. ``` yh@yh-virtual-machine:~$ sudo apt install xfce4 正在读取软件包列表... 完成 正在分析软件包的依赖关系树 正在读取状态信息... 完成 xfce4 已经是最新版 (4.12.2)。 您也许需要运行“apt --fix-broken install”来修正上面的错误。 下列软件包有未满足的依赖关系: tumbler : 依赖: libpng12-0 (>= 1.2.13-4) 但是它将不会被安装 E: 有未能满足的依赖关系。请尝试不指明软件包的名字来运行“apt --fix-broken install”(也可以指定一个解决办法)。 ``` 然而当我尝试安装这个包时。。。 ``` yh@yh-virtual-machine:~$ sudo apt-get install libpng12-0 正在读取软件包列表... 完成 正在分析软件包的依赖关系树 正在读取状态信息... 完成 下列【新】软件包将被安装: libpng12-0 升级了 0 个软件包,新安装了 1 个软件包,要卸载 0 个软件包,有 3 个软件包未被升级。 有 4 个软件包没有被完全安装或卸载。 需要下载 0 B/116 kB 的归档。 解压缩后会消耗 285 kB 的额外空间。 (正在读取数据库 ... 系统当前共安装有 156022 个文件和目录。) 准备解压 .../libpng12-0_1.2.54-1ubuntu1.1_amd64.deb ... 正在解压 libpng12-0:amd64 (1.2.54-1ubuntu1.1) ... dpkg: 处理归档 /var/cache/apt/archives/libpng12-0_1.2.54-1ubuntu1.1_amd64.deb (--unpack)时出错: 无法安装 /lib/x86_64-linux-gnu/libpng12.so.0 的新版本: 没有那个文件或目录 错误信息显示本地系统有一些问题,因此没有写入 apport 报告 在处理时有错误发生: /var/cache/apt/archives/libpng12-0_1.2.54-1ubuntu1.1_amd64.deb E: Sub-process /usr/bin/dpkg returned an error code (1) ``` 有没有大佬提示一下,如何解决这个问题
我用ubuntu-12.04.3-server-i386.iso安装问题
我用UUI使用ubuntu-12.04.3-server-i386.iso做了一个启动U盘,安装时提示:归档镜像 错误,然后就进行不下去了,想问Ubuntu服务器版安装要联网吗?为什么会出现归档镜像 错误问题??求大牛解答
ubuntu 19.04 遇到了libpng12.so.0 导致无法apt 更新
我用的是ubuntu 19.04 遇到了libpng12.so.0 的问题 ``` sudo dpkg -i libpng12-0_1.2.54-1ubuntu1.1_amd64.deb (正在读取数据库 ... 系统当前共安装有 176372 个文件和目录。) 准备解压 libpng12-0_1.2.54-1ubuntu1.1_amd64.deb ... 正在解压 libpng12-0:amd64 (1.2.54-1ubuntu1.1) ... dpkg: 处理归档 libpng12-0_1.2.54-1ubuntu1.1_amd64.deb (--install)时出错: 无法安装 /lib/x86_64-linux-gnu/libpng12.so.0 的新版本: 没有那个文件或目录 正在处理用于 libc-bin (2.29-0ubuntu2) 的触发器 ... 在处理时有错误发生: libpng12-0_1.2.54-1ubuntu1.1_amd64.deb ``` 于是我便下载了一下个 ``` sudo cp out/lib/x86_64-linux-gnu/libpng12.so.0 /lib/x86_64-linux-gnu/ ``` 确定目录下面有 ``` ls -alh /lib/x86_64-linux-gnu/libpng1* -rw-r--r-- 1 root root 147K Oct 10 13:56 /lib/x86_64-linux-gnu/libpng12.so.0 lrwxrwxrwx 1 root root 19 Jul 30 01:29 /lib/x86_64-linux-gnu/libpng16.so.16 -> libpng16.so.16.36.0 -rw-r--r-- 1 root root 214K Apr 8 2019 /lib/x86_64-linux-gnu/libpng16.so.16.36.0 ``` 然后我再运行 ``` sudo apt --fix-broken install 正在读取软件包列表... 完成 正在分析软件包的依赖关系树 正在读取状态信息... 完成 正在修复依赖关系... 完成 将会同时安装下列软件: libpng12-0 下列【新】软件包将被安装: libpng12-0 升级了 0 个软件包,新安装了 1 个软件包,要卸载 0 个软件包,有 0 个软件包未被升级。 有 3 个软件包没有被完全安装或卸载。 需要下载 0 B/118 kB 的归档。 解压缩后会消耗 313 kB 的额外空间。 您希望继续执行吗? [Y/n] y (正在读取数据库 ... 系统当前共安装有 176372 个文件和目录。) 准备解压 .../libpng12-0_1.2.50-1ubuntu2.14.04.3_amd64.deb ... 正在解压 libpng12-0:amd64 (1.2.50-1ubuntu2.14.04.3) ... dpkg: 处理归档 /var/cache/apt/archives/libpng12-0_1.2.50-1ubuntu2.14.04.3_amd64.deb (--unpack)时出错: 无法安装 /lib/x86_64-linux-gnu/libpng12.so.0 的新版本: 没有那个文件或目录 错误信息显示本地系统有一些问题,因此没有写入 apport 报告 在处理时有错误发生: /var/cache/apt/archives/libpng12-0_1.2.50-1ubuntu2.14.04.3_amd64.deb E: Sub-process /usr/bin/dpkg returned an error code (1) ``` 然后还是报了没有 /lib/x86_64-linux-gnu/libpng12.so.0 这个文件 然后我就不知道为什么会被自动删除 > ``` ls -alh /lib/x86_64-linux-gnu/libpng1* lrwxrwxrwx 1 root root 19 Jul 30 01:29 /lib/x86_64-linux-gnu/libpng16.so.16 -> libpng16.so.16.36.0 -rw-r--r-- 1 root root 214K Apr 8 2019 /lib/x86_64-linux-gnu/libpng16.so.16.36.0 ``` 这是服务端的信息 ``` uname -a Linux itanzi-OptiPlex-7060 5.0.0-21-generic #22-Ubuntu SMP Tue Jul 2 13:27:33 UTC 2019 x86_64 x86_64 x86_64 GNU/Linux lsb_release -a No LSB modules are available. Distributor ID: Ubuntu Description: Ubuntu 19.04 Release: 19.04 Codename: disco ```
ubuntu 安装mysql .......
lines 1-10/10(END)出现在ubuntu安装mysql过程中,不知道怎么解决,请大神帮助
ubuntu18.04各种安装wine方法都失败
由于没有公钥,无法验证下列签名: NO_PUBKEY 76F1A20FF987672F c@cc:~$ sudo apt-get update 获取:1 http://dl.winehq.org/wine-builds/ubuntu xenial InRelease [6,242 B] 错误:1 http://dl.winehq.org/wine-builds/ubuntu xenial InRelease 由于没有公钥,无法验证下列签名: NO_PUBKEY 76F1A20FF987672F 命中:2 http://archive.ubuntukylin.com:10006/ubuntukylin xenial InRelease 获取:3 https://dl.winehq.org/wine-builds/ubuntu bionic InRelease [6,242 B] 错误:3 https://dl.winehq.org/wine-builds/ubuntu bionic InRelease 由于没有公钥,无法验证下列签名: NO_PUBKEY 76F1A20FF987672F 命中:4 http://mirrors.cqu.edu.cn/ubuntu bionic InRelease 获取:5 http://mirrors.cqu.edu.cn/ubuntu bionic-updates InRelease [88.7 kB] 获取:6 http://mirrors.cqu.edu.cn/ubuntu bionic-backports InRelease [74.6 kB] 获取:7 http://mirrors.cqu.edu.cn/ubuntu bionic-security InRelease [83.2 kB] 正在读取软件包列表… 完成 W: GPG 错误:http://dl.winehq.org/wine-builds/ubuntu xenial InRelease: 由于没有公钥,无法验证下列签名: NO_PUBKEY 76F1A20FF987672F E: 仓库 “http://dl.winehq.org/wine-builds/ubuntu xenial InRelease” 没有数字签名。 N: 无法安全地用该源进行更新,所以默认禁用该源。 N: 参见 apt-secure(8) 手册以了解仓库创建和用户配置方面的细节。 W: GPG 错误:https://dl.winehq.org/wine-builds/ubuntu bionic InRelease: 由于没有公钥,无法验证下列签名: NO_PUBKEY 76F1A20FF987672F E: 仓库 “https://dl.winehq.org/wine-builds/ubuntu bionic InRelease” 没有数字签名。 N: 无法安全地用该源进行更新,所以默认禁用该源。 N: 参见 apt-secure(8) 手册以了解仓库创建和用户配置方面的细节。
终于明白阿里百度这样的大公司,为什么面试经常拿ThreadLocal考验求职者了
点击上面↑「爱开发」关注我们每晚10点,捕获技术思考和创业资源洞察什么是ThreadLocalThreadLocal是一个本地线程副本变量工具类,各个线程都拥有一份线程私有的数
程序员必须掌握的核心算法有哪些?
由于我之前一直强调数据结构以及算法学习的重要性,所以就有一些读者经常问我,数据结构与算法应该要学习到哪个程度呢?,说实话,这个问题我不知道要怎么回答你,主要取决于你想学习到哪些程度,不过针对这个问题,我稍微总结一下我学过的算法知识点,以及我觉得值得学习的算法。这些算法与数据结构的学习大多数是零散的,并没有一本把他们全部覆盖的书籍。下面是我觉得值得学习的一些算法以及数据结构,当然,我也会整理一些看过...
《奇巧淫技》系列-python!!每天早上八点自动发送天气预报邮件到QQ邮箱
此博客仅为我业余记录文章所用,发布到此,仅供网友阅读参考,如有侵权,请通知我,我会删掉。 补充 有不少读者留言说本文章没有用,因为天气预报直接打开手机就可以收到了,为何要多此一举发送到邮箱呢!!!那我在这里只能说:因为你没用,所以你没用!!! 这里主要介绍的是思路,不是天气预报!不是天气预报!!不是天气预报!!!天气预报只是用于举例。请各位不要再刚了!!! 下面是我会用到的两个场景: 每日下
面试官问我:什么是消息队列?什么场景需要他?用了会出现什么问题?
你知道的越多,你不知道的越多 点赞再看,养成习惯 GitHub上已经开源 https://github.com/JavaFamily 有一线大厂面试点脑图、个人联系方式,欢迎Star和完善 前言 消息队列在互联网技术存储方面使用如此广泛,几乎所有的后端技术面试官都要在消息队列的使用和原理方面对小伙伴们进行360°的刁难。 作为一个在互联网公司面一次拿一次Offer的面霸,打败了无数
8年经验面试官详解 Java 面试秘诀
    作者 | 胡书敏 责编 | 刘静 出品 | CSDN(ID:CSDNnews) 本人目前在一家知名外企担任架构师,而且最近八年来,在多家外企和互联网公司担任Java技术面试官,前后累计面试了有两三百位候选人。在本文里,就将结合本人的面试经验,针对Java初学者、Java初级开发和Java开发,给出若干准备简历和准备面试的建议。   Java程序员准备和投递简历的实
究竟你适不适合买Mac?
我清晰的记得,刚买的macbook pro回到家,开机后第一件事情,就是上了淘宝网,花了500元钱,找了一个上门维修电脑的师傅,上门给我装了一个windows系统。。。。。。 表砍我。。。 当时买mac的初衷,只是想要个固态硬盘的笔记本,用来运行一些复杂的扑克软件。而看了当时所有的SSD笔记本后,最终决定,还是买个好(xiong)看(da)的。 已经有好几个朋友问我mba怎么样了,所以今天尽量客观
程序员一般通过什么途径接私活?
二哥,你好,我想知道一般程序猿都如何接私活,我也想接,能告诉我一些方法吗? 上面是一个读者“烦不烦”问我的一个问题。其实不止是“烦不烦”,还有很多读者问过我类似这样的问题。 我接的私活不算多,挣到的钱也没有多少,加起来不到 20W。说实话,这个数目说出来我是有点心虚的,毕竟太少了,大家轻喷。但我想,恰好配得上“一般程序员”这个称号啊。毕竟苍蝇再小也是肉,我也算是有经验的人了。 唾弃接私活、做外
大学四年自学走来,这些珍藏的「实用工具/学习网站」我全贡献出来了
知乎高赞:文中列举了互联网一线大厂程序员都在用的工具集合,涉及面非常广,小白和老手都可以进来看看,或许有新收获。
《阿里巴巴开发手册》读书笔记-编程规约
Java编程规约命名风格 命名风格 类名使用UpperCamelCase风格 方法名,参数名,成员变量,局部变量都统一使用lowerCamelcase风格 常量命名全部大写,单词间用下划线隔开, 力求语义表达完整清楚,不要嫌名字长 ...
Python爬虫爬取淘宝,京东商品信息
小编是一个理科生,不善长说一些废话。简单介绍下原理然后直接上代码。 使用的工具(Python+pycharm2019.3+selenium+xpath+chromedriver)其中要使用pycharm也可以私聊我selenium是一个框架可以通过pip下载 pip install selenium -i https://pypi.tuna.tsinghua.edu.cn/simple/ 
阿里程序员写了一个新手都写不出的低级bug,被骂惨了。
你知道的越多,你不知道的越多 点赞再看,养成习惯 本文 GitHub https://github.com/JavaFamily 已收录,有一线大厂面试点思维导图,也整理了很多我的文档,欢迎Star和完善,大家面试可以参照考点复习,希望我们一起有点东西。 前前言 为啥今天有个前前言呢? 因为你们的丙丙啊,昨天有牌面了哟,直接被微信官方推荐,知乎推荐,也就仅仅是还行吧(心里乐开花)
Java工作4年来应聘要16K最后没要,细节如下。。。
前奏: 今天2B哥和大家分享一位前几天面试的一位应聘者,工作4年26岁,统招本科。 以下就是他的简历和面试情况。 基本情况: 专业技能: 1、&nbsp;熟悉Sping了解SpringMVC、SpringBoot、Mybatis等框架、了解SpringCloud微服务 2、&nbsp;熟悉常用项目管理工具:SVN、GIT、MAVEN、Jenkins 3、&nbsp;熟悉Nginx、tomca
Python爬虫精简步骤1 获取数据
爬虫的工作分为四步: 1.获取数据。爬虫程序会根据我们提供的网址,向服务器发起请求,然后返回数据。 2.解析数据。爬虫程序会把服务器返回的数据解析成我们能读懂的格式。 3.提取数据。爬虫程序再从中提取出我们需要的数据。 4.储存数据。爬虫程序把这些有用的数据保存起来,便于你日后的使用和分析。 这一篇的内容就是:获取数据。 首先,我们将会利用一个强大的库——requests来获取数据。 在电脑上安装
Python绘图,圣诞树,花,爱心 | Turtle篇
1.画圣诞树 import turtle screen = turtle.Screen() screen.setup(800,600) circle = turtle.Turtle() circle.shape('circle') circle.color('red') circle.speed('fastest') circle.up() square = turtle.Turtle()
作为一个程序员,CPU的这些硬核知识你必须会!
CPU对每个程序员来说,是个既熟悉又陌生的东西? 如果你只知道CPU是中央处理器的话,那可能对你并没有什么用,那么作为程序员的我们,必须要搞懂的就是CPU这家伙是如何运行的,尤其要搞懂它里面的寄存器是怎么一回事,因为这将让你从底层明白程序的运行机制。 随我一起,来好好认识下CPU这货吧 把CPU掰开来看 对于CPU来说,我们首先就要搞明白它是怎么回事,也就是它的内部构造,当然,CPU那么牛的一个东
破14亿,Python分析我国存在哪些人口危机!
2020年1月17日,国家统计局发布了2019年国民经济报告,报告中指出我国人口突破14亿。 猪哥的朋友圈被14亿人口刷屏,但是很多人并没有看到我国复杂的人口问题:老龄化、男女比例失衡、生育率下降、人口红利下降等。 今天我们就来分析一下我们国家的人口数据吧! 更多有趣分析教程,扫描下方二维码关注vx公号「裸睡的猪」 即可查看! 一、背景 1.人口突破14亿 2020年1月17日,国家统计局发布
听说想当黑客的都玩过这个Monyer游戏(1~14攻略)
第零关 进入传送门开始第0关(游戏链接) 请点击链接进入第1关: 连接在左边→ ←连接在右边 看不到啊。。。。(只能看到一堆大佬做完的留名,也能看到菜鸡的我,在后面~~) 直接fn+f12吧 &lt;span&gt;连接在左边→&lt;/span&gt; &lt;a href="first.php"&gt;&lt;/a&gt; &lt;span&gt;←连接在右边&lt;/span&gt; o
在家远程办公效率低?那你一定要收好这个「在家办公」神器!
相信大家都已经收到国务院延长春节假期的消息,接下来,在家远程办公可能将会持续一段时间。 但是问题来了。远程办公不是人在电脑前就当坐班了,相反,对于沟通效率,文件协作,以及信息安全都有着极高的要求。有着非常多的挑战,比如: 1在异地互相不见面的会议上,如何提高沟通效率? 2文件之间的来往反馈如何做到及时性?如何保证信息安全? 3如何规划安排每天工作,以及如何进行成果验收? ......
作为一个程序员,内存和磁盘的这些事情,你不得不知道啊!!!
截止目前,我已经分享了如下几篇文章: 一个程序在计算机中是如何运行的?超级干货!!! 作为一个程序员,CPU的这些硬核知识你必须会! 作为一个程序员,内存的这些硬核知识你必须懂! 这些知识可以说是我们之前都不太重视的基础知识,可能大家在上大学的时候都学习过了,但是嘞,当时由于老师讲解的没那么有趣,又加上这些知识本身就比较枯燥,所以嘞,大家当初几乎等于没学。 再说啦,学习这些,也看不出来有什么用啊!
别低估自己的直觉,也别高估自己的智商
所有群全部吵翻天,朋友圈全部沦陷,公众号疯狂转发。这两周没怎么发原创,只发新闻,可能有人注意到了。我不是懒,是文章写了却没发,因为大家的关注力始终在这次的疫情上面,发了也没人看。当然,我...
这个世界上人真的分三六九等,你信吗?
偶然间,在知乎上看到一个问题 一时间,勾起了我深深的回忆。 以前在厂里打过两次工,做过家教,干过辅导班,做过中介。零下几度的晚上,贴过广告,满脸、满手地长冻疮。   再回首那段岁月,虽然苦,但让我学会了坚持和忍耐。让我明白了,在这个世界上,无论环境多么的恶劣,只要心存希望,星星之火,亦可燎原。   下文是原回答,希望能对你能有所启发。   如果我说,这个世界上人真的分三六九等,
为什么听过很多道理,依然过不好这一生?
记录学习笔记是一个重要的习惯,不希望学习过的东西成为过眼云烟。做总结的同时也是一次复盘思考的过程。 本文是根据阅读得到 App上《万维钢·精英日课》部分文章后所做的一点笔记和思考。学习是一个系统的过程,思维模型的建立需要相对完整的学习和思考过程。以下观点是在碎片化阅读后总结的一点心得总结。
B 站上有哪些很好的学习资源?
哇说起B站,在小九眼里就是宝藏般的存在,放年假宅在家时一天刷6、7个小时不在话下,更别提今年的跨年晚会,我简直是跪着看完的!! 最早大家聚在在B站是为了追番,再后来我在上面刷欧美新歌和漂亮小姐姐的舞蹈视频,最近两年我和周围的朋友们已经把B站当作学习教室了,而且学习成本还免费,真是个励志的好平台ヽ(.◕ฺˇд ˇ◕ฺ;)ノ 下面我们就来盘点一下B站上优质的学习资源: 综合类 Oeasy: 综合
如何优雅地打印一个Java对象?
你好呀,我是沉默王二,一个和黄家驹一样身高,和刘德华一样颜值的程序员。虽然已经写了十多年的 Java 代码,但仍然觉得自己是个菜鸟(请允许我惭愧一下)。 在一个月黑风高的夜晚,我思前想后,觉得再也不能这么蹉跎下去了。于是痛下决心,准备通过输出的方式倒逼输入,以此来修炼自己的内功,从而进阶成为一名真正意义上的大神。与此同时,希望这些文章能够帮助到更多的读者,让大家在学习的路上不再寂寞、空虚和冷。 ...
雷火神山直播超两亿,Web播放器事件监听是怎么实现的?
Web播放器解决了在手机浏览器和PC浏览器上播放音视频数据的问题,让视音频内容可以不依赖用户安装App,就能进行播放以及在社交平台进行传播。在视频业务大数据平台中,播放数据的统计分析非常重要,所以Web播放器在使用过程中,需要对其内部的数据进行收集并上报至服务端,此时,就需要对发生在其内部的一些播放行为进行事件监听。 那么Web播放器事件监听是怎么实现的呢? 01 监听事件明细表 名
3万字总结,Mysql优化之精髓
本文知识点较多,篇幅较长,请耐心学习 MySQL已经成为时下关系型数据库产品的中坚力量,备受互联网大厂的青睐,出门面试想进BAT,想拿高工资,不会点MySQL优化知识,拿offer的成功率会大大下降。 为什么要优化 系统的吞吐量瓶颈往往出现在数据库的访问速度上 随着应用程序的运行,数据库的中的数据会越来越多,处理时间会相应变慢 数据是存放在磁盘上的,读写速度无法和内存相比 如何优化 设计
Linux 命令(122)—— watch 命令
1.命令简介 2.命令格式 3.选项说明 4.常用示例 参考文献 [1] watch(1) manual
Linux 命令(121)—— cal 命令
1.命令简介 2.命令格式 3.选项说明 4.常用示例 参考文献 [1] cal(1) manual
记jsp+servlet+jdbc实现的新闻管理系统
1.工具:eclipse+SQLyog 2.介绍:实现的内容就是显示新闻的基本信息,然后一个增删改查的操作。 3.数据库表设计 列名 中文名称 数据类型 长度 非空 newsId 文章ID int 11 √ newsTitle 文章标题 varchar 20 √ newsContent 文章内容 text newsStatus 是否审核 varchar 10 news...
Python新型冠状病毒疫情数据自动爬取+统计+发送报告+数据屏幕(三)发送篇
今天介绍的项目是使用 Itchat 发送统计报告 项目功能设计: 定时爬取疫情数据存入Mysql 进行数据分析制作疫情报告 使用itchat给亲人朋友发送分析报告(本文) 基于Django做数据屏幕 使用Tableau做数据分析 来看看最终效果 目前已经完成,预计2月12日前更新 使用 itchat 发送数据统计报告 itchat 是一个基于 web微信的一个框架,但微信官方并不允
相关热词 c#怎么获得线程名 c# usb 采集器 c# csv 读取 c# sort() c# 关闭io流 c# 响应函数 插入 c#面对对象的三大特性 c# 打印 等比缩放 c#弹出右键菜单 c#1如何搞成01
立即提问