android clean时出现错误

项目没有问题,项目用过引用过了4个库, 求解???

Errors occurred during the build.
Errors running builder 'Android Package Builder' on project 'android-support-v7-appcompat'.
Problems encountered while deleting resources.
Could not delete 'D:\workspace\android-support-v7-appcompat\bin\android-support-v7-appcompat.jar'.
Problems encountered while deleting files.
Could not delete: D:\workspace\android-support-v7-appcompat\bin\android-support-v7-appcompat.jar.
Problems encountered while deleting resources.
Could not delete 'D:\workspace\android-support-v7-appcompat\bin\android-support-v7-appcompat.jar'.
Problems encountered while deleting files.
Could not delete: D:\workspace\android-support-v7-appcompat\bin\android-support-v7-appcompat.jar.
Errors running builder 'Android Package Builder' on project 'cardview'.
Problems encountered while deleting resources.
Could not delete 'D:\workspace\cardview\bin\cardview.jar'.
Problems encountered while deleting files.
Could not delete: D:\workspace\cardview\bin\cardview.jar.
Problems encountered while deleting resources.
Could not delete 'D:\workspace\cardview\bin\cardview.jar'.
Problems encountered while deleting files.
Could not delete: D:\workspace\cardview\bin\cardview.jar.
Errors running builder 'Android Package Builder' on project 'design'.
Problems encountered while deleting resources.
Could not delete 'D:\novabd\design\bin\design.jar'.
Problems encountered while deleting files.
Could not delete: D:\novabd\design\bin\design.jar.
Problems encountered while deleting resources.
Could not delete 'D:\novabd\design\bin\design.jar'.
Problems encountered while deleting files.
Could not delete: D:\novabd\design\bin\design.jar.
Errors running builder 'Android Package Builder' on project 'percent'.
Problems encountered while deleting resources.
Could not delete 'D:\novabd\percent\bin\percent.jar'.
Problems encountered while deleting files.
Could not delete: D:\novabd\percent\bin\percent.jar.
Problems encountered while deleting resources.
Could not delete 'D:\novabd\percent\bin\percent.jar'.
Problems encountered while deleting files.
Could not delete: D:\novabd\percent\bin\percent.jar.

0

4个回答

问题找到了。原因是。项目引入一个库B,同时引入了一个库A,然后库A也引入了一个库B,,导致库B被引入了两次,,,然后调整了一下,直接让项目引入库A 就好了

0

貌似那几个jar文件正在被使用,所以不能删除,你可以试试把开发软件关了,在工作空间中去删除你要删除的文件

0

把bin文件下的class文件删了,重新编译一下试试。

0

引入一个库B,同时引入了一个库A,然后库A也引入了一个库B,,导致库B被引入了两次,,,然后调整了一下,直接让项目引入库A 就好了 我也是醉了

0
Csdn user default icon
上传中...
上传图片
插入图片
抄袭、复制答案,以达到刷声望分或其他目的的行为,在CSDN问答是严格禁止的,一经发现立刻封号。是时候展现真正的技术了!
其他相关推荐
配置错误:clean时,出现错误MSB4044
错误:error MSB4044: The "CppClean" task was not given a value for the required parameter "FoldersToClean".   修改方式:工程右键-----》Properties ---->configration properties--->general------>intermediate direct
clean sysgen时出现的error
SMDK6410\SRC\WHIMORY\FIL\SMDK6410.MLC\.\S3C6410_FIL.c(808) : warning C4554: '>>' : check operator precedence for possible error; use parentheses to clarify precedencernBUILD: [01:0000000195:ERRORE] C:\WINCE600\PLATFORM\SMDK6410\SRC\WHIMORY\FIL\SMDK6410.MLC\.\S3C6410_FIL.c(1166) : error C2039: 'NFM8ECC0' : is not a member of 'S3C6410_NAND_REG'rnBUILD: [01:0000000197:ERRORE] C:\WINCE600\PLATFORM\SMDK6410\SRC\WHIMORY\FIL\SMDK6410.MLC\.\S3C6410_FIL.c(1167) : error C2039: 'NFM8ECC1' : is not a member of 'S3C6410_NAND_REG'rnBUILD: [01:0000000199:ERRORE] C:\WINCE600\PLATFORM\SMDK6410\SRC\WHIMORY\FIL\SMDK6410.MLC\.\S3C6410_FIL.c(1168) : error C2039: 'NFM8ECC2' : is not a member of 'S3C6410_NAND_REG'rnBUILD: [01:0000000201:ERRORE] C:\WINCE600\PLATFORM\SMDK6410\SRC\WHIMORY\FIL\SMDK6410.MLC\.\S3C6410_FIL.c(1169) : error C2039: 'NFM8ECC3' : is not a member of 'S3C6410_NAND_REG'rnBUILD: [01:0000000203:ERRORE] C:\WINCE600\PLATFORM\SMDK6410\SRC\WHIMORY\FIL\SMDK6410.MLC\.\S3C6410_FIL.c(1365) : error C2039: 'NFM8ECC0' : is not a member of 'S3C6410_NAND_REG'rnBUILD: [01:0000000205:ERRORE] C:\WINCE600\PLATFORM\SMDK6410\SRC\WHIMORY\FIL\SMDK6410.MLC\.\S3C6410_FIL.c(1366) : error C2039: 'NFM8ECC1' : is not a member of 'S3C6410_NAND_REG'rnBUILD: [01:0000000207:ERRORE] C:\WINCE600\PLATFORM\SMDK6410\SRC\WHIMORY\FIL\SMDK6410.MLC\.\S3C6410_FIL.c(1367) : error C2039: 'NFM8ECC2' : is not a member of 'S3C6410_NAND_REG'rnBUILD: [01:0000000209:ERRORE] C:\WINCE600\PLATFORM\SMDK6410\SRC\WHIMORY\FIL\SMDK6410.MLC\.\S3C6410_FIL.c(1368) : error C2039: 'NFM8ECC3' : is not a member of 'S3C6410_NAND_REG'rnBUILD: [01:0000000211:WARNN ] C:\WINCE600\PLATFORM\SMDK6410\SRC\WHIMORY\FIL\SMDK6410.MLC\.\S3C6410_FIL.c(1928) : warning C4090: 'function' : different 'volatile' qualifiersrnBUILD: [01:0000000212:ERRORE] C:\WINCE600\PLATFORM\SMDK6410\SRC\WHIMORY\FIL\SMDK6410.MLC\.\S3C6410_FIL.c(2098) : error C2039: 'NF8ECCERR0' : is not a member of 'S3C6410_NAND_REG'rnBUILD: [01:0000000214:WARNN ] C:\WINCE600\PLATFORM\SMDK6410\SRC\WHIMORY\FIL\SMDK6410.MLC\.\S3C6410_FIL.c(2286) : warning C4090: 'function' : different 'volatile' qualifiersrnBUILD: [01:0000000215:WARNN ] C:\WINCE600\PLATFORM\SMDK6410\SRC\WHIMORY\FIL\SMDK6410.MLC\.\S3C6410_FIL.c(2469) : warning C4090: 'function' : different 'volatile' qualifiersrnBUILD: [01:0000000216:ERRORE] C:\WINCE600\PLATFORM\SMDK6410\SRC\WHIMORY\FIL\SMDK6410.MLC\.\S3C6410_FIL.c(2696) : error C2039: 'NF8ECCERR0' : is not a member of 'S3C6410_NAND_REG'rnBUILD: [01:0000000218:ERRORE] C:\WINCE600\PLATFORM\SMDK6410\SRC\WHIMORY\FIL\SMDK6410.MLC\.\S3C6410_FIL.c(2832) : error C2039: 'NF8ECCERR0' : is not a member of 'S3C6410_NAND_REG'rnBUILD: [01:0000000220:ERRORE] C:\WINCE600\PLATFORM\SMDK6410\SRC\WHIMORY\FIL\SMDK6410.MLC\.\S3C6410_FIL.c(3119) : error C2039: 'NF8ECCERR0' : is not a member of 'S3C6410_NAND_REG'rnBUILD: [01:0000000222:ERRORE] C:\WINCE600\PLATFORM\SMDK6410\SRC\WHIMORY\FIL\SMDK6410.MLC\.\S3C6410_FIL.c(3739) : error C2039: 'NFM8ECC0' : is not a member of 'S3C6410_NAND_REG'rnBUILD: [01:0000000224:ERRORE] C:\WINCE600\PLATFORM\SMDK6410\SRC\WHIMORY\FIL\SMDK6410.MLC\.\S3C6410_FIL.c(3740) : error C2039: 'NFM8ECC1' : is not a member of 'S3C6410_NAND_REG'rnBUILD: [01:0000000226:ERRORE] C:\WINCE600\PLATFORM\SMDK6410\SRC\WHIMORY\FIL\SMDK6410.MLC\.\S3C6410_FIL.c(3741) : error C2039: 'NFM8ECC2' : is not a member of 'S3C6410_NAND_REG'rnBUILD: [01:0000000228:ERRORE] C:\WINCE600\PLATFORM\SMDK6410\SRC\WHIMORY\FIL\SMDK6410.MLC\.\S3C6410_FIL.c(3742) : error C2039: 'NFM8ECC3' : is not a member of 'S3C6410_NAND_REG'rnBUILD: [01:0000000230:ERRORE] C:\WINCE600\PLATFORM\SMDK6410\SRC\WHIMORY\FIL\SMDK6410.MLC\.\S3C6410_FIL.c(3812) : error C2039: 'NFM8ECC0' : is not a member of 'S3C6410_NAND_REG'rnBUILD: [01:0000000232:ERRORE] C:\WINCE600\PLATFORM\SMDK6410\SRC\WHIMORY\FIL\SMDK6410.MLC\.\S3C6410_FIL.c(3813) : error C2039: 'NFM8ECC1' : is not a member of 'S3C6410_NAND_REG'rnBUILD: [01:0000000234:ERRORE] C:\WINCE600\PLATFORM\SMDK6410\SRC\WHIMORY\FIL\SMDK6410.MLC\.\S3C6410_FIL.c(3814) : error C2039: 'NFM8ECC2' : is not a member of 'S3C6410_NAND_REG'rnBUILD: [01:0000000236:ERRORE] C:\WINCE600\PLATFORM\SMDK6410\SRC\WHIMORY\FIL\SMDK6410.MLC\.\S3C6410_FIL.c(3815) : error C2039: 'NFM8ECC3' : is not a member of 'S3C6410_NAND_REG'rnBUILD: [01:0000000238:ERRORE] C:\WINCE600\PLATFORM\SMDK6410\SRC\WHIMORY\FIL\SMDK6410.MLC\.\S3C6410_FIL.c(3946) : error C2039: 'NFM8ECC0' : is not a member of 'S3C6410_NAND_REG'rnBUILD: [01:0000000240:ERRORE] C:\WINCE600\PLATFORM\SMDK6410\SRC\WHIMORY\FIL\SMDK6410.MLC\.\S3C6410_FIL.c(3947) : error C2039: 'NFM8ECC1' : is not a member of 'S3C6410_NAND_REG'rnBUILD: [01:0000000242:ERRORE] C:\WINCE600\PLATFORM\SMDK6410\SRC\WHIMORY\FIL\SMDK6410.MLC\.\S3C6410_FIL.c(3948) : error C2039: 'NFM8ECC2' : is not a member of 'S3C6410_NAND_REG'rnBUILD: [01:0000000244:ERRORE] C:\WINCE600\PLATFORM\SMDK6410\SRC\WHIMORY\FIL\SMDK6410.MLC\.\S3C6410_FIL.c(3949) : error C2039: 'NFM8ECC3' : is not a member of 'S3C6410_NAND_REG'rnBUILD: [01:0000000246:ERRORE] C:\WINCE600\PLATFORM\SMDK6410\SRC\WHIMORY\FIL\SMDK6410.MLC\.\S3C6410_FIL.c(3950) : error C2039: 'NFM8ECC0' : is not a member of 'S3C6410_NAND_REG'rnBUILD: [01:0000000248:ERRORE] C:\WINCE600\PLATFORM\SMDK6410\SRC\WHIMORY\FIL\SMDK6410.MLC\.\S3C6410_FIL.c(3951) : error C2039: 'NFM8ECC1' : is not a member of 'S3C6410_NAND_REG'rnBUILD: [01:0000000250:ERRORE] C:\WINCE600\PLATFORM\SMDK6410\SRC\WHIMORY\FIL\SMDK6410.MLC\.\S3C6410_FIL.c(3952) : error C2039: 'NFM8ECC2' : is not a member of 'S3C6410_NAND_REG'rnBUILD: [01:0000000252:ERRORE] C:\WINCE600\PLATFORM\SMDK6410\SRC\WHIMORY\FIL\SMDK6410.MLC\.\S3C6410_FIL.c(3953) : error C2039: 'NFM8ECC3' : is not a member of 'S3C6410_NAND_REG'rnBUILD: [01:0000000254:ERRORE] C:\WINCE600\PLATFORM\SMDK6410\SRC\WHIMORY\FIL\SMDK6410.MLC\.\S3C6410_FIL.c(4083) : error C2039: 'NF8ECCERR0' : is not a member of 'S3C6410_NAND_REG'rnBUILD: [01:0000000256:ERRORE] C:\WINCE600\PLATFORM\SMDK6410\SRC\WHIMORY\FIL\SMDK6410.MLC\.\S3C6410_FIL.c(4084) : error C2039: 'NF8ECCERR1' : is not a member of 'S3C6410_NAND_REG'rnBUILD: [01:0000000258:ERRORE] C:\WINCE600\PLATFORM\SMDK6410\SRC\WHIMORY\FIL\SMDK6410.MLC\.\S3C6410_FIL.c(4085) : error C2039: 'NF8ECCERR2' : is not a member of 'S3C6410_NAND_REG'rnBUILD: [01:0000000260:ERRORE] C:\WINCE600\PLATFORM\SMDK6410\SRC\WHIMORY\FIL\SMDK6410.MLC\.\S3C6410_FIL.c(4102) : error C2039: 'NFMLC8BITPT0' : is not a member of 'S3C6410_NAND_REG'rnBUILD: [01:0000000262:ERRORE] C:\WINCE600\PLATFORM\SMDK6410\SRC\WHIMORY\FIL\SMDK6410.MLC\.\S3C6410_FIL.c(4103) : error C2039: 'NFMLC8BITPT1' : is not a member of 'S3C6410_NAND_REG'rnBUILD: [01:0000000264:ERRORE] C:\WINCE600\PLATFORM\SMDK6410\SRC\WHIMORY\FIL\SMDK6410.MLC\.\S3C6410_FIL.c(4318) : error C2039: 'NF8ECCERR0' : is not a member of 'S3C6410_NAND_REG'rnBUILD: [01:0000000266:ERRORE] C:\WINCE600\PLATFORM\SMDK6410\SRC\WHIMORY\FIL\SMDK6410.MLC\.\S3C6410_FIL.c(4319) : error C2039: 'NF8ECCERR1' : is not a member of 'S3C6410_NAND_REG'rnBUILD: [01:0000000268:ERRORE] C:\WINCE600\PLATFORM\SMDK6410\SRC\WHIMORY\FIL\SMDK6410.MLC\.\S3C6410_FIL.c(4320) : error C2039: 'NF8ECCERR2' : is not a member of 'S3C6410_NAND_REG'rnBUILD: [01:0000000270:ERRORE] C:\WINCE600\PLATFORM\SMDK6410\SRC\WHIMORY\FIL\SMDK6410.MLC\.\S3C6410_FIL.c(4339) : error C2039: 'NFMLC8BITPT0' : is not a member of 'S3C6410_NAND_REG'rnBUILD: [01:0000000272:ERRORE] C:\WINCE600\PLATFORM\SMDK6410\SRC\WHIMORY\FIL\SMDK6410.MLC\.\S3C6410_FIL.c(4340) : error C2039: 'NFMLC8BITPT1' : is not a member of 'S3C6410_NAND_REG'rnBUILD: [01:0000000274:PROGC ] Compiling .\FIL.c
android 创建工程时出现的错误
刚刚在公司建立一个android工程,竟然有错,android SDK 都已经装好了,rnADT也装好了,rnrn错误信息如下:rnrnrnPreject "HelloWorld" is missing required foider "gen"rnrnrn为什么呢,gen文件夹确实已经有了的,rnrn希望有经验的指导下
android:通过clean和rebuild可以解决的错误
错误1Error:Execution failed for task ':app:buildInfoDebugLoader'. Source H:\xx\xx\xx\xx\app\build\intermediates\builds\debug\9000268691570\classes.dex and destination H:\xx\xx\xx\xx\app\build\intermediat
maven2 clean 错误的解决
错误信息:[ERROR] BUILD ERROR[INFO] ------------------------------------------------------------------------[INFO] The plugin org.apache.maven.plugins:maven-clean-plugin does not exist or no valid ve
clean sysgen出现的问题
[img=https://img-bbs.csdn.net/upload/201404/09/1397034233_196164.png][/img]rnrn我在C:\WINCE600\PLATFORM\DEVICEEMULATOR\SRC\DRIVERS\USB\USBFN\CONTROLLER\NET2280rn文件夹里找到net2280.def,然后复制过去,clean sysgen 还是这个错误rnrn题外话——在source,bib等那些文本里 ;和# 相当于注释吗?
AS clean 出现的问题
AS出现以下错误 错误:Execution failed for task ':app:clean'. > Unable to delete directory: D:\hai**\child***\app\build\intermediates\exploded-aar\com.android.support\appcompat-v7 此时伴随一点APP就退出闪退,错误提示是找
解决Android Studio2.3打包时出现的错误
当Android Studio升级到2.3时 打包生成apk会出现如下错误 要解决如上错误 只需要在主module的build.gradle中做如下配置 android {     lintOptions { checkReleaseBuilds false abortOnError false } } 忽略因为在strings.xml直接定义中文 而导致打包出现的错误
安装Android SDK时出现的错误
出现错误:Failed to fetch URL https://dl-ssl.google.com/android/repository-6.xml.reason:connection to https://dl-ssl.google.com refused错误 解决方法:在SDK Manager下Tools->Options 打开了SDK Manager的Settings,选中“Force
android使用Toast时出现的错误
前不久在做android项目的时候遇到的问题,分享出来希望能帮到大家。错误代码如下: 解决方法1:在调用Toast(或者AlertDialog)的地方的前面加上Looper.prepare(),后边加上Looper.loop()即可解决问题 解决方法2:使用Handler(处理者),把Toast放在Handler中实现,具体步骤如下: Handler handler = new
Android编译源码时出现的错误: “_FORTIFY_SOURCE”重定义
我的编译环境是ubuntu11.10 32位,解决办法:http://code.google.com/p/android/issues/detail?id=20795http://android-ooss.diandian.com/?tag=build%20android 第一次发现baidu上有技术的解决方法。http://zhidao.baidu.com/question...
Android 导入项目时出现的各类错误(红色感叹号)
转自:http://m.oschina.net/blog/128809 如果发现导入工程的时候,出现”No projects are found to import” 的提示,首先查看项目目录中是否有隐藏文件.project,还有目录结构也还要有一个隐藏文件.classpath, 如果没有的解决办法。 方法1:最直接的操作,可以把其它项目的.project, .classpath文件拷贝过
Android Studio导入工程时出现的几种错误
Android Studio Failure[INSTALL_FAILED_OLDER_SDK]
android邮件收发时出现账号密码错误
在实现android用javamail实现邮件收发的功能时,代码已经完善很好了。。就是不能登录账号,实现不了发送功能。最后找到了解决办法,如下: (对于126.163邮箱亲测有效,qq邮箱没有试过。) 首先邮箱不能是新注册不久的,官方没有给相应的权限,所以不能进行发送。 其次,我们再来说说第二个原因。
Android 测试OCR时出现错误
java.lang.UnsatisfiedLinkError: Couldn't load lept from loader dalvik.system.PathClassLoaderrnrn12-02 17:15:36.320: rnE/AndroidRuntime(20104):rn Caused by: java.lang.UnsatisfiedLinkError:rn Couldn't load lept from loader dalvik.system.PathClassLoader[dexPath=/data/app/com.pjottersstuff.ocr_demo-1.apk,libraryPath=/data/app-lib/com.pjottersstuff.ocr_demo-1]: findLibrary returned nullrnrnrn问题大概知道是so文件未加载到 但是我的项目目录libs文件夹下面有相应的so文件,请教大神指点三克油 [img=https://img-bbs.csdn.net/upload/201412/02/1417513186_461141.png][/img]~~rn
android之解析包时出现错误(二)
为什么是二呢,之前遇到过一次了,详见http://blog.csdn.net/jason0539/article/details/12222173 这次的原因不同,再记录下 public class DownloadTask { /** * @param path下载地址 * @param filePath存储路径 * @param progressDialog进度
Eclipse编译Android项目时出现的错误
<br />1. 错误信息为:Unable to execute dex: wrapper was not properly loaded first<br /> <br />解决方法:<br />找到Eclipse目录下eclipse.ini文件,将最后两句改为<br />-Xms128m<br />-Xmx512m<br />重启eclipse<br />然后project->clean一下就OK了
Android 使用ImageView控件时出现错误
08-10 10:08:42.701 21576-21612/com.example.uiwidgettest E/libEGL: load_driver(/system/lib/egl/libGLES_emulation.so): dlopen failed: library "/system/lib/egl/libGLES_emulation.so" not foundn 请问这是什么问题啊 我觉得好像是图片资源的问题,但是不知道该怎么解决
Redhat Linux编译Android时出现错误
.......rn/usr/lib/gcc/x86_64-redhat-linux/4.4.7/../../../../include/c++/4.4.7/ostream:510: undefined reference to `std::basic_ostream >& std::__ostream_insert >(std::basic_ostream >&, char const*, int)'rnout/host/linux-x86/obj/SHARED_LIBRARIES/libfst_intermediates/compat.o: In function `operator<< , std::allocator >':rn/usr/lib/gcc/x86_64-redhat-linux/4.4.7/../../../../include/c++/4.4.7/bits/basic_string.h:2503: undefined reference to `std::basic_ostream >& std::__ostream_insert >(std::basic_ostream >&, char const*, int)'rnout/host/linux-x86/obj/SHARED_LIBRARIES/libfst_intermediates/compat.o:/usr/lib/gcc/x86_64-redhat-linux/4.4.7/../../../../include/c++/4.4.7/ostream:510: more undefined references to `std::basic_ostream >& std::__ostream_insert >(std::basic_ostream >&, char const*, int)' followrncollect2: ld 返回 1rnmake: *** [out/host/linux-x86/obj/lib/libfst.so] 错误 1rnrn请高手指点!rn
求助,android页面跳转时出现空指针错误。
[img=https://img-bbs.csdn.net/upload/201606/16/1466083774_530230.png][/img][code=text][/code]rn[img=https://img-bbs.csdn.net/upload/201606/16/1466083868_62216.png][/img]
android之解析包时出现错误
今天碰到这个问题,因为是后台打包,所以得反编译看看哪有问题,发现是包名错误。以后发现这种问题首先检查mainfest文件是否正确吧,记录下,怕以后忘了
android stuido 安装时出现的错误
因为第一次接触android stuido  在安装过程中,没有注意Windows的管理员权限的问题,因此在打开安装的时候就出现下面的错误,这次长知识了,Windows权限导致的错误 Config path ‘C:\Users\Administrator\.AndroidStudioPreview\config’ is invalid. If you have modified t
使用eclipse创建Android时出现的错误
在导入项目时出现如上的错误,原因是因为版本问题所导致的,解决方法如下: 打开图中红色标注的文件,进入下图: 将红色区域的数字改为与sdk manager中的tools列表下,如下图所示的数字,此时错误解决。 ...
安装Android studio时出现下图错误
安装Android studio时出现下图错误,为什么会这样?rn[img=https://img-bbs.csdn.net/upload/201809/24/1537797235_419184.png][/img]
打包时出现错误
C:\Users\xuhf60\PycharmProjects\zhanhao&amp;gt;pyinstaller -D tongji.py --hidden-import =pandas._libs.tslibs.np_datetime --hidden-import=pandas._libs.tslibs.nattype --h idden-import=pandas._libs.skiplist ...
重装系统时出现错误
我的机器原来装的是windows 98 ,后来系统损坏,不能正常启动,我想把C盘重新格式化装windows 2000。在用2000光盘启动后,系统读完盘后提示:BOIS设置有错误,我重新进入BIOS设置,把它全改为默认值,再重新安装结果还是提示:BIOS设置有错误。该怎么办呢?
commit时出现错误?
往一表里面插入数据,rnINSERT后我查看了SQLCA.SQLERRTEXT是没有错误的,rn但是COMMIT出现如下图中的错误,请帮忙看看是什么问题?rn[img=http://hi.csdn.net/attachment/201109/2/5516229_1314951682H4n0.jpg][/img]
调试时出现错误
在调试时出现以下提示,怎么回事啊?rnrn“/Client”应用程序中的服务器错误。rn--------------------------------------------------------------------------------rnrn对路径“D:\WINDOWS\Microsoft.NET\Framework\v1.1.4322\Temporary ASP.NET Files\client\2396b281\bd666721”的访问被拒绝。 rn说明: 执行当前 Web 请求期间,出现未处理的异常。请检查堆栈跟踪信息,以了解有关该错误以及代码中导致错误的出处的详细信息。 rnrn异常详细信息: System.UnauthorizedAccessException: 对路径“D:\WINDOWS\Microsoft.NET\Framework\v1.1.4322\Temporary ASP.NET Files\client\2396b281\bd666721”的访问被拒绝。 rnrnASP.NET 未被授权访问所请求的资源。请考虑授予 ASP.NET 请求标识访问此资源的权限。ASP.NET 有一个在应用程序没有模拟时使用的基进程标识(通常,在 IIS 5 上为 MACHINE\ASPNET,在 IIS 6 上为网络服务)。如果应用程序正在通过 模拟,则标识将为匿名用户(通常为 IUSR_MACHINENAME)或经过身份验证的请求用户。 rnrn若要授予 ASP.NET 对文件的写访问权,请在资源管理器中右击该文件,选择“属性”,然后选择“安全”选项卡。单击“添加”添加适当的用户或组。突出显示 ASP.NET 帐户,选中所需访问权限对应的框。rnrn源错误: rnrn执行当前 Web 请求期间生成了未处理的异常。可以使用下面的异常堆栈跟踪信息确定有关异常原因和发生位置的信息。 rnrn堆栈跟踪: rnrnrn[UnauthorizedAccessException: 对路径“D:\WINDOWS\Microsoft.NET\Framework\v1.1.4322\Temporary ASP.NET Files\client\2396b281\bd666721”的访问被拒绝。]rn System.IO.__Error.WinIOError(Int32 errorCode, String str) +393rn System.IO.Directory.InternalCreateDirectory(String fullPath, String path) +632rn System.IO.Directory.CreateDirectory(String path) +195rn System.Web.Compilation.PreservedAssemblyEntry.DoFirstTimeInit(HttpContext context) +85rn System.Web.Compilation.PreservedAssemblyEntry.EnsureFirstTimeInit(HttpContext context) +97rn System.Web.Compilation.PreservedAssemblyEntry.GetPreservedAssemblyEntry(HttpContext context, String virtualPath, Boolean fApplicationFile) +29rn System.Web.UI.TemplateParser.GetParserCacheItemFromPreservedCompilation() +91rn System.Web.UI.TemplateParser.GetParserCacheItemInternal(Boolean fCreateIfNotFound) +148rn System.Web.UI.TemplateParser.GetParserCacheItemWithNewConfigPath() +125rn System.Web.UI.TemplateParser.GetParserCacheItem() +88rn System.Web.UI.ApplicationFileParser.GetCompiledApplicationType(String inputFile, HttpContext context, ApplicationFileParser& parser) +171rn System.Web.HttpApplicationFactory.CompileApplication(HttpContext context) +43rn System.Web.HttpApplicationFactory.Init(HttpContext context) +485rn System.Web.HttpApplicationFactory.GetApplicationInstance(HttpContext context) +170rn System.Web.HttpRuntime.ProcessRequestInternal(HttpWorkerRequest wr) +414rnrn rnrnrn--------------------------------------------------------------------------------rn版本信息: Microsoft .NET Framework 版本:1.1.4322.573; ASP.NET 版本:1.1.4322.573
上传文件时出现的错误
在上传文件时出现这样的错误,不知道怎么解决,请看一下,谢谢 com.opensymphony.webwork.interceptor.FileUploadInterceptor intercept 严重: Class: jakarta not found.
在pull时出现错误:
rn错误号:28574rnAn internal error occurred.rnparamenters:rnP0:IDrnerror:rnSSCE_M_INTERNALERROR rn请教这是哪里出问题了?
连接数据库时出现的错误
运行时提示:首先为"灾难性故障" 接着"连接无法用于执行此操作 在此上下文中它可能已被关闭或rnrn无效"rn 然后是"Runtime error rnabnormal progrtam termination" rnrn连接代码如下:(本来运行没有问题的,突然出现这种情况)rntryrnrnm_pConnection.CreateInstance(_uuidof(Connection));rnrn_bstr_t rnrnstrConnection="Provider=SQLOLEDB;Server=legend\\sqlserver2000;database=Stock;uid=lmn;pwd=lrnrnmnbelock";rnrnm_pConnection->Open(strConnection,"","",adModeUnknown);rnrnrncatch (_com_error e)rnrnAfxMessageBox(e.Description());rn
上传时,出现的错误
[code=Assembly]rnexception rnrnjavax.servlet.ServletException: There is no statement named createFile in this SqlMap.rn org.apache.struts2.dispatcher.Dispatcher.serviceAction(Dispatcher.java:515)rn org.apache.struts2.dispatcher.FilterDispatcher.doFilter(FilterDispatcher.java:419)rn org.apache.struts2.dispatcher.ActionContextCleanUp.doFilter(ActionContextCleanUp.java:99)rnrnrnroot cause rnrncom.ibatis.sqlmap.client.SqlMapException: There is no statement named createFile in this SqlMap.rn com.ibatis.sqlmap.engine.impl.SqlMapExecutorDelegate.getMappedStatement(SqlMapExecutorDelegate.java:293)rn com.ibatis.sqlmap.engine.impl.SqlMapExecutorDelegate.update(SqlMapExecutorDelegate.java:496)rn com.ibatis.sqlmap.engine.impl.SqlMapSessionImpl.update(SqlMapSessionImpl.java:90)rn org.springframework.orm.ibatis.SqlMapClientTemplate$10.doInSqlMapClient(SqlMapClientTemplate.java:383)rn org.springframework.orm.ibatis.SqlMapClientTemplate.execute(SqlMapClientTemplate.java:193)rn org.springframework.orm.ibatis.SqlMapClientTemplate.update(SqlMapClientTemplate.java:381)rn com.daewoobrenic.jcf.dao.BaseSqlMapClientDAO.executeUpdate(BaseSqlMapClientDAO.java:119)rn com.daewoobrenic.jcf.file.dao.FileDAOiBatis.createFile(FileDAOiBatis.java:24)rn client.service.ClientService.addClient(ClientService.java:20)rn client.action.ClientAction.addClient(ClientAction.java:25)rn sun.reflect.NativeMethodAccessorImpl.invoke0(Native Method)rn sun.reflect.NativeMethodAccessorImpl.invoke(NativeMethodAccessorImpl.java:39)rn sun.reflect.DelegatingMethodAccessorImpl.invoke(DelegatingMethodAccessorImpl.java:25)rn java.lang.reflect.Method.invoke(Method.java:597)rn com.opensymphony.xwork2.DefaultActionInvocation.invokeAction(DefaultActionInvocation.java:404)rn[/code]rnrn其实出现这个错的代码是在这rn[code=Java]fileDao.createFile(fileInfo);[/code]rn可是这个代码fileDao这个类,我只能看见class文件,class文件的内容是下面这些rnrn能看见的也就是这些 rn// Compiled from IFileDAO.java (version 1.5 : 49.0, no super bit) rnpublic abstract interface com.daewoobrenic.jcf.file.dao.IFileDAO rn rn // Method descriptor #6 (Lcom/daewoobrenic/jcf/file/FileInfo;)I rn public abstract int createFile(com.daewoobrenic.jcf.file.FileInfo arg0); rn rn // Method descriptor #6 (Lcom/daewoobrenic/jcf/file/FileInfo;)I rn public abstract int deleteFile(com.daewoobrenic.jcf.file.FileInfo arg0); rn rn // Method descriptor #9 (Ljava/lang/String;)I rn public abstract int deleteFileById(java.lang.String arg0); rn rn // Method descriptor #11 (Ljava/lang/String;)Ljava/util/List; rn public abstract java.util.List findFilesById(java.lang.String arg0); rn rnrnstrits2+ibatis+spring的一个框架 rnrn不知道怎么解决,,,,不知道问题是什么地方啊
调试时出现错误!
.net 调试时出现错误如下:rn 无法在web服务器上启动调试。发送调试http请求时发生服务器端错误。rn确保服务器操作正确。rn然后我通过执行 “调试” ->“开始执行(不调试)”验证web.config出现如下rn提示:“/lf2004”应用程序中的服务器错误 C:\INETPUB\WWWROOT\LF2004目录的访问被拒绝。未能开始监视目录更改。rn 我在启动时发现“asp.net state server”出现了错误:2147942402:系统找不到指定的文件,我想是不是这个原因造成了不能调试?如果是该如何解决?
查询时出现错误
Spring+Hibernate+Struts在进行数据查找时出现的错误rnrnorg.springframework.beans.PropertyAccessExceptionsException: PropertyAccessExceptionsExceptionrn(1 errors); nested propertyAccessExceptions are: [org.springframework.beans.TypeMismatchException:rnFailed to convert property value of type [$Proxy1] to required type [com.boyasi.service.MovieMonthService]rnfor property 'movieMonthService']rn at org.springframework.beans.BeanWrapperImpl.setPropertyValues(BeanWrapperImpl.java:670)rn at org.springframework.beans.BeanWrapperImpl.setPropertyValues(BeanWrapperImpl.java:642)rn at org.springframework.beans.factory.support.AbstractAutowireCapableBeanFactory.applyPropertyValues(AbstractAutowireCapableBeanFactory.java:1023)rn at org.springframework.beans.factory.support.AbstractAutowireCapableBeanFactory.populateBean(AbstractAutowireCapableBeanFactory.java:824)rn at org.springframework.beans.factory.support.AbstractAutowireCapableBeanFactory.createBean(AbstractAutowireCapableBeanFactory.java:345)rn at org.springframework.beans.factory.support.AbstractBeanFactory.getBean(AbstractBeanFactory.java:239)rn at org.springframework.beans.factory.support.AbstractBeanFactory.getBean(AbstractBeanFactory.java:151)rn at org.springframework.context.support.AbstractApplicationContext.getBean(AbstractApplicationContext.java:559)rn at org.springframework.web.struts.DelegatingActionProxy.getDelegateAction(DelegatingActionProxy.java:122)rn at org.springframework.web.struts.DelegatingActionProxy.execute(DelegatingActionProxy.java:105)rn at org.apache.struts.action.RequestProcessor.processActionPerform(RequestProcessor.java:484)rn at org.apache.struts.action.RequestProcessor.process(RequestProcessor.java:274)rn at org.apache.struts.action.ActionServlet.process(ActionServlet.java:1482)rn at org.apache.struts.action.ActionServlet.doPost(ActionServlet.java:525)rn at javax.servlet.http.HttpServlet.service(HttpServlet.java:154)rn at javax.servlet.http.HttpServlet.service(HttpServlet.java:92)rn at com.caucho.server.dispatch.ServletFilterChain.doFilter(ServletFilterChain.java:99)rn at org.springframework.orm.hibernate3.support.OpenSessionInViewFilter.doFilterInternal(OpenSessionInViewFilter.java:174)rn at org.springframework.web.filter.OncePerRequestFilter.doFilter(OncePerRequestFilter.java:76)rn at com.caucho.server.dispatch.FilterFilterChain.doFilter(FilterFilterChain.java:70)rn at org.springframework.web.filter.CharacterEncodingFilter.doFilterInternal(CharacterEncodingFilter.java:75)rn at org.springframework.web.filter.OncePerRequestFilter.doFilter(OncePerRequestFilter.java:76)rn at com.caucho.server.dispatch.FilterFilterChain.doFilter(FilterFilterChain.java:70)rn at com.caucho.server.webapp.WebAppFilterChain.doFilter(WebAppFilterChain.java:163)rn at com.caucho.server.dispatch.ServletInvocation.service(ServletInvocation.java:208)rn at com.caucho.server.http.HttpRequest.handleRequest(HttpRequest.java:259)rn at com.caucho.server.port.TcpConnection.run(TcpConnection.java:363)rn at com.caucho.util.ThreadPool.runTasks(ThreadPool.java:490)rn at com.caucho.util.ThreadPool.run(ThreadPool.java:423)rn at java.lang.Thread.run(Thread.java:595)rnrnrnMovieMonthServiceImp.javarnrn public MovieMonth findMoveMonthByUserId(int userId) rn return this.getMovieMonthDAO().findMoveMonthByUserId(userId);rn rnrnMovieMonthHibernateDAO.javarnrn private static final String LOAD_BY_USERID ="from movie_Month where userID = ?";rn /**rn * 默认构造函数rn */rn public MovieMonthHibernateDAO()rn super();rn rn /**rn * 根据UserId查找MoveMonth对象rn * @param userIdrn * @return MovieMonthrn */rn public MovieMonth findMoveMonthByUserId(int userId) rn Object[] o = new Integer(userId);rn List l = this.getHibernateTemplate().find(LOAD_BY_USERID,o);rn if(l == null || l.isEmpty())rn return null;rn elsern return (MovieMonth) l.get(0);rn rn
插入数据时出现的错误??
存储过程rn.... rn strsql:= 'INSERT INTO aa(fd_dovou_start ,fd_dovou_end)rn values( '||start_num||' ,'||end_num||')';rn execute immediate strsql;rnrn执行存储过程PRO_PZ_ADD(0009001,00010000); 不出错,但改为PRO_PZ_ADD('0009001','00010000'); 就有错,为什么啊?rnfd_dovou_start ,fd_dovou_end是varchar2类型的rnrnrnrn
aspnet_regiis时出现错误
运行aspnet_regiis.exe -irn显示rnSetup has detected some errors during the operation.For details,plplease read th e setup log file C:\DOCUME~1\ah\LOCALS~1\Temp\ASPNETSetup_00001.log ...rnrn请问这是怎么回事?以前从来没遇到过。都是一次成功的。
QMAKE时出现错误
gmake[1]: *** [../../lib/libQtCore.so.4.7.0] Error 1rngmake[1]: Leaving directory `/home/geoway/qtsdk-2010.05/qt/src/corelib'rngmake: *** [sub-corelib-make_default-ordered] Error 2rnrn这个问题 如何解决
安装时出现了错误
1、无法装载与语言相关的资源文件rn2、search stp.exe应用程序初始化失败rnrnsql server2000标准版,win2000 serverrn
g_conn.BeginTrans时出现错误
我在使用connection的事务时遇到一问题想请高手解答rn在模块中定义了一connectionrnpublic g_cnn as new adodb.connectionrnrn用g_conn.BeginTrans时出现错误-2147467259 ODBC 无法设置属性
远程连接时出现的错误
两台电脑都是ghost装的xp系统。点击“开始”-“程序”-“附件”-“通信”-“远程桌面连接”时出现如图所示的错误,请问怎么解决?rn
相关热词 c#异步发送kafka c#窗体编号 c# 操作二进制文件 c# 反射 机制 c#线程 窗体失去响应 c#角度转弧度 c# 解析gps数据 c# vs设置 语法版本 c# json含回车 c#多线程demo