eclipse新建maven时出现了maven-compiler错误,请问如何解决?

我新装了64位jdk1.8和64位eclipse后新建maven项目,最后爆出maven-compiler-plugin:3.1compile(1 error)错误,之后我又卸载了64位jdk和eclipse换成32位,错误一样。
图片说明
图片说明
图片说明
图片说明

2个回答

已经搞定,装JDK1.7和Maven3.3.9,在报错的maven项目alt+F5执行update project即可

贴一下错误看看,另外排除一下是不是maven插件的问题。

qq_43168845
LWX- 大神 今天不小心应该吧maven的插件删了,敢问报上面一样的错,根据网上的答案,还是解决不了
一年多之前 回复
dcxy0
Q544471255 回复wangxiao1427: 用旧版本的试试吧,可能是新版本不兼容的问题。
3 年多之前 回复
wangxiao1427
wangxiao1427 我是在新建项目的时候出的这个错,报的错就是最后一图里的maven-compiler-plugin:3.1...................eclipse和maven都是分别从官网下载下来的最新版本,jdk和maven的环境变量也测试了成功的,愁死我了
3 年多之前 回复
Csdn user default icon
上传中...
上传图片
插入图片
抄袭、复制答案,以达到刷声望分或其他目的的行为,在CSDN问答是严格禁止的,一经发现立刻封号。是时候展现真正的技术了!
其他相关推荐
maven配置私服打包报错Failed to execute goal org.apache.maven.plugins:maven-compiler-plugin:3.5:compile
直接使用阿里云镜像仓库打包没问题,替换为私服镜像仓库后报错: 就是pom.xml中的plugin报错 ``` <plugin> <groupId>org.apache.maven.plugins</groupId> <artifactId>maven-compiler-plugin</artifactId> <version>3.5</version> <configuration> <source>1.8</source> <target>1.8</target> <encoding>UTF-8</encoding> </configuration> </plugin> ``` 网上找了半天说这个指定的jdk版本的问题,查了一下版本没问题都是1.8 报错内容: [ERROR] Failed to execute goal org.apache.maven.plugins:maven-compiler-plugin:3.5:compile (default-compile) on project mytest-web: Execution default-compile of goal org.apache.maven.plugins:maven-compiler-plugin:3.5:compile failed: Plugin org.apache.maven.plugins:maven-compiler-plugin:3.5 or one of its dependencies could not be resolved: Failed to collect dependencies at org.apache.maven.plugins:maven-compiler-plugin:jar:3.5 -> org.apache.maven:maven-toolchain:jar:2.2.1 -> org.apache.maven:maven-core:jar:2.2.1 -> commons-cli:commons-cli:jar:1.2: Failed to read artifact descriptor for commons-cli:commons-cli:jar:1.2: Failure to find org.apache:apache:pom:4 in http://localhost:8081/nexus/content/groups/public/ was cached in the local repository, resolution will not be reattempted until the update interval of public has elapsed or updates are forced -> [Help 1] org.apache.maven.lifecycle.LifecycleExecutionException: Failed to execute goal org.apache.maven.plugins:maven-compiler-plugin:3.5:compile (default-compile) on project mytest-web: Execution default-compile of goal org.apache.maven.plugins:maven-compiler-plugin:3.5:compile failed: Plugin org.apache.maven.plugins:maven-compiler-plugin:3.5 or one of its dependencies could not be resolved: Failed to collect dependencies at org.apache.maven.plugins:maven-compiler-plugin:jar:3.5 -> org.apache.maven:maven-toolchain:jar:2.2.1 -> org.apache.maven:maven-core:jar:2.2.1 -> commons-cli:commons-cli:jar:1.2 at org.apache.maven.lifecycle.internal.MojoExecutor.execute(MojoExecutor.java:213) at org.apache.maven.lifecycle.internal.MojoExecutor.execute(MojoExecutor.java:154) at org.apache.maven.lifecycle.internal.MojoExecutor.execute(MojoExecutor.java:146) at org.apache.maven.lifecycle.internal.LifecycleModuleBuilder.buildProject(LifecycleModuleBuilder.java:117) at org.apache.maven.lifecycle.internal.LifecycleModuleBuilder.buildProject(LifecycleModuleBuilder.java:81) at org.apache.maven.lifecycle.internal.builder.singlethreaded.SingleThreadedBuilder.build(SingleThreadedBuilder.java:51) at org.apache.maven.lifecycle.internal.LifecycleStarter.execute(LifecycleStarter.java:128) at org.apache.maven.DefaultMaven.doExecute(DefaultMaven.java:309) at org.apache.maven.DefaultMaven.doExecute(DefaultMaven.java:194) at org.apache.maven.DefaultMaven.execute(DefaultMaven.java:107) at org.apache.maven.cli.MavenCli.execute(MavenCli.java:993) at org.apache.maven.cli.MavenCli.doMain(MavenCli.java:345) at org.apache.maven.cli.MavenCli.main(MavenCli.java:191) at sun.reflect.NativeMethodAccessorImpl.invoke0(Native Method) at sun.reflect.NativeMethodAccessorImpl.invoke(NativeMethodAccessorImpl.java:62) at sun.reflect.DelegatingMethodAccessorImpl.invoke(DelegatingMethodAccessorImpl.java:43) at java.lang.reflect.Method.invoke(Method.java:498) at org.codehaus.plexus.classworlds.launcher.Launcher.launchEnhanced(Launcher.java:289) at org.codehaus.plexus.classworlds.launcher.Launcher.launch(Launcher.java:229) at org.codehaus.plexus.classworlds.launcher.Launcher.mainWithExitCode(Launcher.java:415) at org.codehaus.plexus.classworlds.launcher.Launcher.main(Launcher.java:356) Caused by: org.apache.maven.plugin.PluginExecutionException: Execution default-compile of goal org.apache.maven.plugins:maven-compiler-plugin:3.5:compile failed: Plugin org.apache.maven.plugins:maven-compiler-plugin:3.5 or one of its dependencies could not be resolved: Failed to collect dependencies at org.apache.maven.plugins:maven-compiler-plugin:jar:3.5 -> org.apache.maven:maven-toolchain:jar:2.2.1 -> org.apache.maven:maven-core:jar:2.2.1 -> commons-cli:commons-cli:jar:1.2 at org.apache.maven.plugin.DefaultBuildPluginManager.executeMojo(DefaultBuildPluginManager.java:106) at org.apache.maven.lifecycle.internal.MojoExecutor.execute(MojoExecutor.java:208) ... 20 more Caused by: org.apache.maven.plugin.PluginResolutionException: Plugin org.apache.maven.plugins:maven-compiler-plugin:3.5 or one of its dependencies could not be resolved: Failed to collect dependencies at org.apache.maven.plugins:maven-compiler-plugin:jar:3.5 -> org.apache.maven:maven-toolchain:jar:2.2.1 -> org.apache.maven:maven-core:jar:2.2.1 -> commons-cli:commons-cli:jar:1.2 at org.apache.maven.plugin.internal.DefaultPluginDependenciesResolver.resolveInternal(DefaultPluginDependenciesResolver.java:214) at org.apache.maven.plugin.internal.DefaultPluginDependenciesResolver.resolve(DefaultPluginDependenciesResolver.java:149) at org.apache.maven.plugin.internal.DefaultMavenPluginManager.createPluginRealm(DefaultMavenPluginManager.java:402) at org.apache.maven.plugin.internal.DefaultMavenPluginManager.setupPluginRealm(DefaultMavenPluginManager.java:374) at org.apache.maven.plugin.DefaultBuildPluginManager.getPluginRealm(DefaultBuildPluginManager.java:231) at org.apache.maven.plugin.DefaultBuildPluginManager.executeMojo(DefaultBuildPluginManager.java:102) ... 21 more Caused by: org.eclipse.aether.collection.DependencyCollectionException: Failed to collect dependencies at org.apache.maven.plugins:maven-compiler-plugin:jar:3.5 -> org.apache.maven:maven-toolchain:jar:2.2.1 -> org.apache.maven:maven-core:jar:2.2.1 -> commons-cli:commons-cli:jar:1.2 at org.eclipse.aether.internal.impl.DefaultDependencyCollector.collectDependencies(DefaultDependencyCollector.java:300) at org.eclipse.aether.internal.impl.DefaultRepositorySystem.collectDependencies(DefaultRepositorySystem.java:325) at org.apache.maven.plugin.internal.DefaultPluginDependenciesResolver.resolveInternal(DefaultPluginDependenciesResolver.java:202) ... 26 more Caused by: org.eclipse.aether.resolution.ArtifactDescriptorException: Failed to read artifact descriptor for commons-cli:commons-cli:jar:1.2 at org.apache.maven.repository.internal.DefaultArtifactDescriptorReader.loadPom(DefaultArtifactDescriptorReader.java:330) at org.apache.maven.repository.internal.DefaultArtifactDescriptorReader.readArtifactDescriptor(DefaultArtifactDescriptorReader.java:199) at org.eclipse.aether.internal.impl.DefaultDependencyCollector.resolveCachedArtifactDescriptor(DefaultDependencyCollector.java:544) at org.eclipse.aether.internal.impl.DefaultDependencyCollector.getArtifactDescriptorResult(DefaultDependencyCollector.java:528) at org.eclipse.aether.internal.impl.DefaultDependencyCollector.processDependency(DefaultDependencyCollector.java:418) at org.eclipse.aether.internal.impl.DefaultDependencyCollector.processDependency(DefaultDependencyCollector.java:372) at org.eclipse.aether.internal.impl.DefaultDependencyCollector.process(DefaultDependencyCollector.java:360) at org.eclipse.aether.internal.impl.DefaultDependencyCollector.doRecurse(DefaultDependencyCollector.java:513) at org.eclipse.aether.internal.impl.DefaultDependencyCollector.processDependency(DefaultDependencyCollector.java:467) at org.eclipse.aether.internal.impl.DefaultDependencyCollector.processDependency(DefaultDependencyCollector.java:372) at org.eclipse.aether.internal.impl.DefaultDependencyCollector.process(DefaultDependencyCollector.java:360) at org.eclipse.aether.internal.impl.DefaultDependencyCollector.doRecurse(DefaultDependencyCollector.java:513) at org.eclipse.aether.internal.impl.DefaultDependencyCollector.processDependency(DefaultDependencyCollector.java:467) at org.eclipse.aether.internal.impl.DefaultDependencyCollector.processDependency(DefaultDependencyCollector.java:372) at org.eclipse.aether.internal.impl.DefaultDependencyCollector.process(DefaultDependencyCollector.java:360) at org.eclipse.aether.internal.impl.DefaultDependencyCollector.collectDependencies(DefaultDependencyCollector.java:263) ... 28 more Caused by: org.apache.maven.model.resolution.UnresolvableModelException: Failure to find org.apache:apache:pom:4 in http://localhost:8081/nexus/content/groups/public/ was cached in the local repository, resolution will not be reattempted until the update interval of public has elapsed or updates are forced at org.apache.maven.repository.internal.DefaultModelResolver.resolveModel(DefaultModelResolver.java:178) at org.apache.maven.repository.internal.DefaultModelResolver.resolveModel(DefaultModelResolver.java:224) at org.apache.maven.model.building.DefaultModelBuilder.readParentExternally(DefaultModelBuilder.java:1051) at org.apache.maven.model.building.DefaultModelBuilder.readParent(DefaultModelBuilder.java:829) at org.apache.maven.model.building.DefaultModelBuilder.build(DefaultModelBuilder.java:331) at org.apache.maven.repository.internal.DefaultArtifactDescriptorReader.loadPom(DefaultArtifactDescriptorReader.java:321) ... 43 more Caused by: org.eclipse.aether.resolution.ArtifactResolutionException: Failure to find org.apache:apache:pom:4 in http://localhost:8081/nexus/content/groups/public/ was cached in the local repository, resolution will not be reattempted until the update interval of public has elapsed or updates are forced at org.eclipse.aether.internal.impl.DefaultArtifactResolver.resolve(DefaultArtifactResolver.java:453) at org.eclipse.aether.internal.impl.DefaultArtifactResolver.resolveArtifacts(DefaultArtifactResolver.java:255) at org.eclipse.aether.internal.impl.DefaultArtifactResolver.resolveArtifact(DefaultArtifactResolver.java:232) at org.apache.maven.repository.internal.DefaultModelResolver.resolveModel(DefaultModelResolver.java:174) ... 48 more Caused by: org.eclipse.aether.transfer.ArtifactNotFoundException: Failure to find org.apache:apache:pom:4 in http://localhost:8081/nexus/content/groups/public/ was cached in the local repository, resolution will not be reattempted until the update interval of public has elapsed or updates are forced at org.eclipse.aether.internal.impl.DefaultUpdateCheckManager.newException(DefaultUpdateCheckManager.java:240) at org.eclipse.aether.internal.impl.DefaultUpdateCheckManager.checkArtifact(DefaultUpdateCheckManager.java:215) at org.eclipse.aether.internal.impl.DefaultArtifactResolver.gatherDownloads(DefaultArtifactResolver.java:594) at org.eclipse.aether.internal.impl.DefaultArtifactResolver.performDownloads(DefaultArtifactResolver.java:512) at org.eclipse.aether.internal.impl.DefaultArtifactResolver.resolve(DefaultArtifactResolver.java:430) ... 51 more [ERROR] [ERROR] Re-run Maven using the -X switch to enable full debug logging. [ERROR] [ERROR] For more information about the errors and possible solutions, please read the following articles: [ERROR] [Help 1] http://cwiki.apache.org/confluence/display/MAVEN/PluginResolutionException
maven项目maven-compiler-plugin报错 ibase4j框架
![图片说明](https://img-ask.csdn.net/upload/201801/20/1516424101_815853.png) 自己试过以下方法: 1.更换eclipse--install JDK JRE 失败; 2.添加maven-compiler-plugin依赖 没有效果; 3.更换maven-compiler-plugin版本,无效; 4.配置 <profile> <id>custom-compiler</id> <properties> <JAVA8_HOME>F:\jdk-1.8</JAVA8_HOME> </properties> </profile> 无效; 5.修改mave setting.xml jdk信息,无效; 6.一个maven项目在之前的工作环境能mvn compile,现在的不行 ibase4j两个都不行,报同样的错 求大神看看
eclipse 中创建Maven 报错,求解决方案
CoreException: Could not calculate build plan: Plugin org.apache.maven.plugins:maven-compiler-plugin:3.1 or one of its dependencies could not be resolved: Failed to read artifact descriptor for org.apache.maven.plugins:maven-compiler-plugin:jar:3.1: ArtifactResolutionException: Failure to transfer org.apache.maven.plugins:maven-compiler-plugin:pom:3.1 from https://repo.maven.apache.org/maven2 was cached in the local repository, resolution will not be reattempted until the update interval of central has elapsed or updates are forced. Original error: Could not transfer artifact org.apache.maven.plugins:maven-compiler-plugin:pom:3.1 from/to central (https://repo.maven.apache.org/maven2): repo.maven.apache.org
eclipse创建maven工程时报错
使用的是官方的Eclipse中自带的m2e插件,创建maven项目时就弹出个错误 ![图片说明](https://img-ask.csdn.net/upload/201507/15/1436949464_186734.png) 在pom.xml文件那会显示个红X,提示如下: Multiple annotations found at this line: - Plugin execution not covered by lifecycle configuration: org.apache.maven.plugins:maven-compiler-plugin:3.1:testCompile (execution: default-testCompile, phase: test- compile) - Execution default-resources of goal org.apache.maven.plugins:maven-resources-plugin:2.6:resources failed: Plugin org.apache.maven.plugins:maven-resources-plugin:2.6 or one of its dependencies could not be resolved: The following artifacts could not be resolved: org.apache.maven:maven-plugin-api:jar:2.0.6, org.apache.maven:maven- project:jar:2.0.6, org.apache.maven:maven-profile:jar:2.0.6, org.apache.maven:maven-artifact-manager:jar:2.0.6, org.apache.maven:maven-plugin-registry:jar:2.0.6, org.apache.maven:maven-core:jar:2.0.6, org.apache.maven:maven-plugin-parameter-documenter:jar:2.0.6, org.apache.maven:maven-repository-metadata:jar:2.0.6, org.apache.maven:maven-error-diagnostics:jar:2.0.6, org.apache.maven:maven-plugin-descriptor:jar:2.0.6, org.apache.maven:maven-artifact:jar:2.0.6, org.apache.maven:maven- settings:jar:2.0.6, org.apache.maven:maven-model:jar:2.0.6, org.apache.maven:maven-monitor:jar:2.0.6, org.codehaus.plexus:plexus-container-default:jar:1.0-alpha-9-stable-1: Failure to transfer org.apache.maven:maven-plugin-api:jar:2.0.6 from https://repo.maven.apache.org/maven2 was cached in the local repository, resolution will not be reattempted until the update interval of central has elapsed or updates are forced. Original error: Could not transfer artifact org.apache.maven:maven-plugin-api:jar:2.0.6 from/to central (https://repo.maven.apache.org/maven2): The operation was cancelled. (org.apache.maven.plugins:maven-resources-plugin:2.6:resources:default-resources:process-resources) org.apache.maven.plugin.PluginExecutionException: Execution default-resources of goal org.apache.maven.plugins:maven-resources-plugin:2.6:resources failed: Plugin org.apache.maven.plugins:maven-resources-plugin:2.6 or one of its dependencies could not be resolved: The following artifacts could not be resolved: org.apache.maven:maven- plugin-api:jar:2.0.6, org.apache.maven:maven-project:jar:2.0.6, org.apache.maven:maven-profile:jar:2.0.6, org.apache.maven:maven-artifact-manager:jar:2.0.6, org.apache.maven:maven-plugin-registry:jar:2.0.6, org.apache.maven:maven-core:jar:2.0.6, org.apache.maven:maven-plugin-parameter-documenter:jar:2.0.6, org.apache.maven:maven-repository-metadata:jar:2.0.6, org.apache.maven:maven-error-diagnostics:jar:2.0.6, org.apache.maven:maven-plugin-descriptor:jar:2.0.6, org.apache.maven:maven-artifact:jar:2.0.6, org.apache.maven:maven-settings:jar:2.0.6, org.apache.maven:maven-model:jar:2.0.6, org.apache.maven:maven-monitor:jar:2.0.6, org.codehaus.plexus:plexus-container-default:jar:1.0-alpha-9-stable-1: Failure to transfer org.apache.maven:maven-plugin-api:jar:2.0.6 from https://repo.maven.apache.org/ maven2 was cached in the local repository, resolution will not be reattempted until the update interval of central has elapsed or updates are forced. Original error: Could not transfer artifact org.apache.maven:maven-plugin-api:jar:2.0.6 from/to central (https://repo.maven.apache.org/maven2): The operation was cancelled. at org.apache.maven.plugin.DefaultBuildPluginManager.executeMojo(DefaultBuildPluginManager.java:106) at org.eclipse.m2e.core.internal.embedder.MavenImpl.execute(MavenImpl.java:331) at org.eclipse.m2e.core.internal.embedder.MavenImpl$11.call(MavenImpl.java:1362) at org.eclipse.m2e.core.internal.embedder.MavenImpl$11.call(MavenImpl.java:1) at org.eclipse.m2e.core.internal.embedder.MavenExecutionContext.executeBare(MavenExecutionContext.java:176) at org.eclipse.m2e.core.internal.embedder.MavenExecutionContext.execute(MavenExecutionContext.java:112) at org.eclipse.m2e.core.internal.embedder.MavenImpl.execute(MavenImpl.java:1360) at org.eclipse.m2e.core.project.configurator.MojoExecutionBuildParticipant.build(MojoExecutionBuildParticipant.java:52) at org.eclipse.m2e.core.internal.builder.MavenBuilderImpl.build(MavenBuilderImpl.java:137) at org.eclipse.m2e.core.internal.builder.MavenBuilder$1.method(MavenBuilder.java:172) at org.eclipse.m2e.core.internal.builder.MavenBuilder$1.method(MavenBuilder.java:1) at org.eclipse.m2e.core.internal.builder.MavenBuilder$BuildMethod$1$1.call(MavenBuilder.java: 115) at org.eclipse.m2e.core.internal.embedder.MavenExecutionContext.executeBare(MavenExecutionContext.java:176) at org.eclipse.m2e.core.internal.embedder.MavenExecutionContext.execute(MavenExecutionContext.java:112) at org.eclipse.m2e.core.internal.builder.MavenBuilder$BuildMethod $1.call(MavenBuilder.java:105) at org.eclipse.m2e.core.internal.embedder.MavenExecutionContext.executeBare(MavenExecutionContext.java:176) at org.eclipse.m2e.core.internal.embedder.MavenExecutionContext.execute(MavenExecutionContext.java:151) at org.eclipse.m2e.core.internal.embedder.MavenExecutionContext.execute(MavenExecutionContext.java:99) at org.eclipse.m2e.core.internal.builder.MavenBuilder $BuildMethod.execute(MavenBuilder.java:86) at org.eclipse.m2e.core.internal.builder.MavenBuilder.build(MavenBuilder.java:200) at org.eclipse.core.internal.events.BuildManager $2.run(BuildManager.java:734) at org.eclipse.core.runtime.SafeRunner.run(SafeRunner.java:42) at org.eclipse.core.internal.events.BuildManager.basicBuild(BuildManager.java:205) at org.eclipse.core.internal.events.BuildManager.basicBuild(BuildManager.java:245) at org.eclipse.core.internal.events.BuildManager$1.run(BuildManager.java:300) at org.eclipse.core.runtime.SafeRunner.run(SafeRunner.java:42) at org.eclipse.core.internal.events.BuildManager.basicBuild(BuildManager.java:303) at org.eclipse.core.internal.events.BuildManager.basicBuildLoop(BuildManager.java:359) at org.eclipse.core.internal.events.BuildManager.build(BuildManager.java:382) at org.eclipse.core.internal.events.AutoBuildJob.doBuild(AutoBuildJob.java:144) at org.eclipse.core.internal.events.AutoBuildJob.run(AutoBuildJob.java:235) at org.eclipse.core.internal.jobs.Worker.run(Worker.java:55) Caused by: org.apache.maven.plugin.PluginResolutionException: Plugin org.apache.maven.plugins:maven-resources- plugin:2.6 or one of its dependencies could not be resolved: The following artifacts could not be resolved: org.apache.maven:maven-plugin-api:jar:2.0.6, org.apache.maven:maven- project:jar:2.0.6, org.apache.maven:maven-profile:jar:2.0.6, 请问如何解决?谢谢 ----- 本机安装的maven是3.2.2 eclipse是4.5 m2e是1.2 ----- 最后也不知道什么原因,重新下了eclipse就没有问题了
新建maven工程报错,该怎么解决?
具体情况是这样的,公司jdk为1.6 ,eclipse为kepler版本 ,为了和他们俩不冲突,我下载了maven3.2.5,然后各种配置。。。。。 新建maven项目pom第一行报错:org/apache/maven/plugins/war/WarMojo : Unsupported major.minor version 51.0 然后下面的plugin标签:Multiple annotations found at this line: - CoreException: Could not get the value for parameter compilerId for plugin execution default- testCompile: TypeNotPresentException: Type org.apache.maven.plugin.compiler.TestCompilerMojo not present: UnsupportedClassVersionError: org/apache/maven/plugin/compiler/TestCompilerMojo : Unsupported major.minor version 51.0 - Plugin execution not covered by lifecycle configuration: org.apache.maven.plugins:maven- compiler-plugin:3.7.0:testCompile (execution: default-testCompile, phase: test-compile) - CoreException: Could not get the value for parameter compilerId for plugin execution default- compile: TypeNotPresentException: Type org.apache.maven.plugin.compiler.CompilerMojo not present: UnsupportedClassVersionError: org/apache/maven/plugin/compiler/CompilerMojo : Unsupported major.minor version 51.0 - Plugin execution not covered by lifecycle configuration: org.apache.maven.plugins:maven- compiler-plugin:3.7.0:compile (execution: default-compile, phase: compile) 我真的不知道该怎么解决,网上都说jdk版本和maven冲突,我按照maven官网给出的jdk'版本对应要求下载的3.2.5 为什么就不行了呢,官网是假的?
MAVEN打包找不到com.sun.beans.introspect.PropertyInfo的类文件
在用eclipse打包guns项目是时,出现了这个问题 Failed to execute goal org.apache.maven.plugins:maven-compiler-plugin:3.1:compile (default-compile) on project inspection: Compilation failure /E:/sbxj/src/main/java/cn/stylefeng/guns/core/util/Contrast.java:[56,41] 无法访问com.sun.beans.introspect.PropertyInfo 找不到com.sun.beans.introspect.PropertyInfo的类文件 -> [Help 1] To see the full stack trace of the errors, re-run Maven with the -e switch. Re-run Maven using the -X switch to enable full debug logging.
启动tomcat,maven报错:[ERROR] [Help 1] http://cwiki.apache.org/confluence/display/MAVEN/PluginConfigurationException
``` [INFO] Scanning for projects... [INFO] [INFO] ------------------------------------------------------------------------ [INFO] Building taotao-manage-web 1.0.0-SNAPSHOT [INFO] ------------------------------------------------------------------------ [INFO] [INFO] >>> tomcat7-maven-plugin:2.2:run (default-cli) > process-classes @ taotao-manage-web >>> [WARNING] The artifact org.apache.commons:commons-io:jar:1.3.2 has been relocated to commons-io:commons-io:jar:1.3.2 [INFO] [INFO] --- maven-resources-plugin:2.7:resources (default-resources) @ taotao-manage-web --- [INFO] Using 'UTF-8' encoding to copy filtered resources. [INFO] Copying 7 resources [INFO] [INFO] --- maven-compiler-plugin:3.2:compile (default-compile) @ taotao-manage-web --- [INFO] Nothing to compile - all classes are up to date [INFO] [INFO] <<< tomcat7-maven-plugin:2.2:run (default-cli) < process-classes @ taotao-manage-web <<< [WARNING] The artifact org.apache.commons:commons-io:jar:1.3.2 has been relocated to commons-io:commons-io:jar:1.3.2 [INFO] [INFO] --- tomcat7-maven-plugin:2.2:run (default-cli) @ taotao-manage-web --- [INFO] ------------------------------------------------------------------------ [INFO] BUILD FAILURE [INFO] ------------------------------------------------------------------------ [INFO] Total time: 1.444 s [INFO] Finished at: 2019-09-18T09:51:46+08:00 [INFO] Final Memory: 12M/154M [INFO] ------------------------------------------------------------------------ [ERROR] Failed to execute goal org.apache.tomcat.maven:tomcat7-maven-plugin:2.2:run (default-cli) on project taotao-manage-web: Unable to parse configuration of mojo org.apache.tomcat.maven:tomcat7-maven-plugin:2.2:run for parameter project: Cannot find default setter in class org.apache.maven.project.MavenProject -> [Help 1] [ERROR] [ERROR] To see the full stack trace of the errors, re-run Maven with the -e switch. [ERROR] Re-run Maven using the -X switch to enable full debug logging. [ERROR] [ERROR] For more information about the errors and possible solutions, please read the following articles: [ERROR] [Help 1] http://cwiki.apache.org/confluence/display/MAVEN/PluginConfigurationException ``` 烦烦烦,几个这种Bug,刚刚弄完一个,现在又出现一个,repository换了一个新的,前面的几个这样的解决了,现在又冒出一个这个问题。求大佬帮忙!
maven问题,编译jar问题
在linux服务器装了个maven,打jar包(不是在eclipse上) 错误: [ERROR] Failed to execute goal org.apache.maven.plugins:maven-compiler-plugin:2.3.2:compile (default-compile) on project DbMonitor: Compilation failure: Compilation failure: [ERROR] /opt/app/cs/DbMonitor/src/main/java/com/travelsky/dbmonitor/service/impl/FlightPriceForCCTVSVC.java:[13,16] package org.junit does not exist 这是怎么回事,我用的指令mvn -e install -Dmaven.test.skip=true,按里说已经跳过了test,但还是package org.junit does not exist,所以我认为是Failed to execute goal org.apache.maven.plugins:maven-compiler-plugin:2.3.2的问题,但不知怎办,从新下载库也不行,还有就是如果打war包的工程,就没有问题,打jar包就不行,这打war与jar,在maven层面上有什么不用(除了工程自己的配置文件),急求!!!
Myeclipse2014导入maven 项目
Myeclipse2014导入maven 项目报错 No marketplace entries found to handle maven-compiler-plugin:2.5.1:compile in Eclipse. 求解
新建maven报错怎么办?
CoreException: Could not get the value for parameter compilerId for plugin execution default-compile: TypeNotPresentException: Type org.apache.maven.plugin.compiler.CompilerMojo not present: UnsupportedClassVersionError: org/apache/maven/plugin/compiler/CompilerMojo : Unsupported major.minor version 51.0 被这个问题折磨的块不成人形了 ~~ 专门下载的不冲突的 jdk1.6 maven3.2.5 eclipse luna 结果ctm的安装完 新建maven报错 ![图片说明](https://img-ask.csdn.net/upload/201811/30/1543559676_285385.png) 这到底是什么原因 网上都说是jdk和maven版本冲突 我在setting 设置 <profile> <id>jdk-1.6</id> <activation> <activeByDefault>true</activeByDefault> <jdk>1.6</jdk> </activation> <properties> <maven.compiler.source>1.6</maven.compiler.source> <maven.compiler.target>1.6</maven.compiler.target> <maven.compiler.compilerVersion>1.6</maven.compiler.compilerVersion> </properties> </profile> 没求卵用 。。。。哪个爹能帮帮我呀??跪谢
【maven】jetty:run失败,实在不清楚怎么解决了 头疼。。。
#### pom文件配置片段 ``` <build> <finalName>front</finalName> <plugins> <plugin> <groupId>org.eclipse.jetty</groupId> <artifactId>jetty-maven-plugin</artifactId> <version>9.3.24.v20180605</version> <configuration> <scanIntervalSeconds>10</scanIntervalSeconds> <stopPort>9999</stopPort> <webAppConfig> <contextPath>/front</contextPath> </webAppConfig> <httpConnector> <port>9080</port> <idleTimeout>30000</idleTimeout> </httpConnector> </configuration> </plugin> <plugin> <groupId>org.apache.maven.plugins</groupId> <artifactId>maven-war-plugin</artifactId> <configuration> <!--注意增加这两行,在打包时相关的类会被独立打成jar --> <attachClasses>true</attachClasses> <classesClassifier>api</classesClassifier> </configuration> <version>2.4</version> <executions> </executions> </plugin> </plugins> </build> ``` #### 部分日志 ``` ………… [INFO] Scanning elapsed time=2830ms [INFO] No Spring WebApplicationInitializer types detected on classpath [INFO] Initializing Spring root WebApplicationContext log4j:WARN No appenders could be found for logger (org.springframework.web.context.ContextLoader). log4j:WARN Please initialize the log4j system properly. log4j:WARN See http://logging.apache.org/log4j/1.2/faq.html#noconfig for more info. [INFO] Started ServerConnector@1735e1c4{HTTP/1.1,[http/1.1]}{0.0.0.0:9080} [INFO] Jetty server exiting. [INFO] ------------------------------------------------------------------------ [INFO] BUILD FAILURE [INFO] ------------------------------------------------------------------------ [INFO] Total time: 42.755 s [INFO] Finished at: 2019-10-23T21:39:16+08:00 [INFO] Final Memory: 57M/620M [INFO] ------------------------------------------------------------------------ [ERROR] Failed to execute goal org.eclipse.jetty:jetty-maven-plugin:9.3.24.v20180605:run (default-cli) on project front: Execution default-cli of goal org.eclipse.jetty:jetty-maven-plugin:9.3.24.v20180605:run failed: An API incompatibility was encountered while executing org.eclipse.jetty:jetty-maven-plugin:9.3.24.v20180605:run: java.lang.AbstractMethodError: null [ERROR] ----------------------------------------------------- [ERROR] realm = plugin>org.eclipse.jetty:jetty-maven-plugin:9.3.24.v20180605 [ERROR] strategy = org.codehaus.plexus.classworlds.strategy.SelfFirstStrategy [ERROR] urls[0] = file:/C:/Users/zlzhangn/.m2/repository/org/eclipse/jetty/jetty-maven-plugin/9.3.24.v20180605/jetty-maven-plugin-9.3.24.v20180605.jar [ERROR] urls[1] = file:/C:/Users/zlzhangn/.m2/repository/org/sonatype/sisu/sisu-inject-bean/2.1.1/sisu-inject-bean-2.1.1.jar [ERROR] urls[2] = file:/C:/Users/zlzhangn/.m2/repository/org/sonatype/sisu/sisu-guice/2.9.4/sisu-guice-2.9.4-no_aop.jar [ERROR] urls[3] = file:/C:/Users/zlzhangn/.m2/repository/org/codehaus/plexus/plexus-utils/2.0.6/plexus-utils-2.0.6.jar [ERROR] urls[4] = file:/C:/Users/zlzhangn/.m2/repository/org/sonatype/aether/aether-util/1.11/aether-util-1.11.jar [ERROR] urls[5] = file:/C:/Users/zlzhangn/.m2/repository/org/codehaus/plexus/plexus-interpolation/1.14/plexus-interpolation-1.14.jar [ERROR] urls[6] = file:/C:/Users/zlzhangn/.m2/repository/org/codehaus/plexus/plexus-component-annotations/1.5.5/plexus-component-annotations-1.5.5.jar [ERROR] urls[7] = file:/C:/Users/zlzhangn/.m2/repository/org/sonatype/plexus/plexus-sec-dispatcher/1.3/plexus-sec-dispatcher-1.3.jar [ERROR] urls[8] = file:/C:/Users/zlzhangn/.m2/repository/org/sonatype/plexus/plexus-cipher/1.4/plexus-cipher-1.4.jar [ERROR] urls[9] = file:/C:/Users/zlzhangn/.m2/repository/org/apache/maven/plugin-tools/maven-plugin-tools-api/3.5/maven-plugin-tools-api-3.5.jar [ERROR] urls[10] = file:/C:/Users/zlzhangn/.m2/repository/backport-util-concurrent/backport-util-concurrent/3.1/backport-util-concurrent-3.1.jar [ERROR] urls[11] = file:/C:/Users/zlzhangn/.m2/repository/org/eclipse/jetty/jetty-util/9.3.24.v20180605/jetty-util-9.3.24.v20180605.jar [ERROR] urls[12] = file:/C:/Users/zlzhangn/.m2/repository/org/eclipse/jetty/jetty-webapp/9.3.24.v20180605/jetty-webapp-9.3.24.v20180605.jar [ERROR] urls[13] = file:/C:/Users/zlzhangn/.m2/repository/org/eclipse/jetty/jetty-xml/9.3.24.v20180605/jetty-xml-9.3.24.v20180605.jar [ERROR] urls[14] = file:/C:/Users/zlzhangn/.m2/repository/org/eclipse/jetty/jetty-servlet/9.3.24.v20180605/jetty-servlet-9.3.24.v20180605.jar [ERROR] urls[15] = file:/C:/Users/zlzhangn/.m2/repository/org/eclipse/jetty/jetty-quickstart/9.3.24.v20180605/jetty-quickstart-9.3.24.v20180605.jar [ERROR] urls[16] = file:/C:/Users/zlzhangn/.m2/repository/org/eclipse/jetty/jetty-jaas/9.3.24.v20180605/jetty-jaas-9.3.24.v20180605.jar [ERROR] urls[17] = file:/C:/Users/zlzhangn/.m2/repository/org/eclipse/jetty/jetty-security/9.3.24.v20180605/jetty-security-9.3.24.v20180605.jar [ERROR] urls[18] = file:/C:/Users/zlzhangn/.m2/repository/org/eclipse/jetty/jetty-plus/9.3.24.v20180605/jetty-plus-9.3.24.v20180605.jar [ERROR] urls[19] = file:/C:/Users/zlzhangn/.m2/repository/org/eclipse/jetty/jetty-jndi/9.3.24.v20180605/jetty-jndi-9.3.24.v20180605.jar [ERROR] urls[20] = file:/C:/Users/zlzhangn/.m2/repository/org/eclipse/jetty/jetty-server/9.3.24.v20180605/jetty-server-9.3.24.v20180605.jar [ERROR] urls[21] = file:/C:/Users/zlzhangn/.m2/repository/javax/servlet/javax.servlet-api/3.1.0/javax.servlet-api-3.1.0.jar [ERROR] urls[22] = file:/C:/Users/zlzhangn/.m2/repository/org/eclipse/jetty/jetty-http/9.3.24.v20180605/jetty-http-9.3.24.v20180605.jar [ERROR] urls[23] = file:/C:/Users/zlzhangn/.m2/repository/org/eclipse/jetty/jetty-io/9.3.24.v20180605/jetty-io-9.3.24.v20180605.jar [ERROR] urls[24] = file:/C:/Users/zlzhangn/.m2/repository/org/eclipse/jetty/jetty-jmx/9.3.24.v20180605/jetty-jmx-9.3.24.v20180605.jar [ERROR] urls[25] = file:/C:/Users/zlzhangn/.m2/repository/org/eclipse/jetty/jetty-annotations/9.3.24.v20180605/jetty-annotations-9.3.24.v20180605.jar [ERROR] urls[26] = file:/C:/Users/zlzhangn/.m2/repository/javax/annotation/javax.annotation-api/1.2/javax.annotation-api-1.2.jar [ERROR] urls[27] = file:/C:/Users/zlzhangn/.m2/repository/org/ow2/asm/asm/6.0/asm-6.0.jar [ERROR] urls[28] = file:/C:/Users/zlzhangn/.m2/repository/org/ow2/asm/asm-commons/6.0/asm-commons-6.0.jar [ERROR] urls[29] = file:/C:/Users/zlzhangn/.m2/repository/org/ow2/asm/asm-tree/6.0/asm-tree-6.0.jar [ERROR] urls[30] = file:/C:/Users/zlzhangn/.m2/repository/org/eclipse/jetty/websocket/javax-websocket-server-impl/9.3.24.v20180605/javax-websocket-server-impl-9.3.24.v20180605.jar [ERROR] urls[31] = file:/C:/Users/zlzhangn/.m2/repository/org/eclipse/jetty/websocket/javax-websocket-client-impl/9.3.24.v20180605/javax-websocket-client-impl-9.3.24.v20180605.jar [ERROR] urls[32] = file:/C:/Users/zlzhangn/.m2/repository/javax/websocket/javax.websocket-api/1.0/javax.websocket-api-1.0.jar [ERROR] urls[33] = file:/C:/Users/zlzhangn/.m2/repository/org/eclipse/jetty/websocket/websocket-server/9.3.24.v20180605/websocket-server-9.3.24.v20180605.jar [ERROR] urls[34] = file:/C:/Users/zlzhangn/.m2/repository/org/eclipse/jetty/websocket/websocket-common/9.3.24.v20180605/websocket-common-9.3.24.v20180605.jar [ERROR] urls[35] = file:/C:/Users/zlzhangn/.m2/repository/org/eclipse/jetty/websocket/websocket-api/9.3.24.v20180605/websocket-api-9.3.24.v20180605.jar [ERROR] urls[36] = file:/C:/Users/zlzhangn/.m2/repository/org/eclipse/jetty/websocket/websocket-client/9.3.24.v20180605/websocket-client-9.3.24.v20180605.jar [ERROR] urls[37] = file:/C:/Users/zlzhangn/.m2/repository/org/eclipse/jetty/websocket/websocket-servlet/9.3.24.v20180605/websocket-servlet-9.3.24.v20180605.jar [ERROR] urls[38] = file:/C:/Users/zlzhangn/.m2/repository/org/eclipse/jetty/apache-jsp/9.3.24.v20180605/apache-jsp-9.3.24.v20180605.jar [ERROR] urls[39] = file:/C:/Users/zlzhangn/.m2/repository/org/eclipse/jetty/toolchain/jetty-schemas/3.1/jetty-schemas-3.1.jar [ERROR] urls[40] = file:/C:/Users/zlzhangn/.m2/repository/org/mortbay/jasper/apache-jsp/8.0.33/apache-jsp-8.0.33.jar [ERROR] urls[41] = file:/C:/Users/zlzhangn/.m2/repository/org/mortbay/jasper/apache-el/8.0.33/apache-el-8.0.33.jar [ERROR] urls[42] = file:/C:/Users/zlzhangn/.m2/repository/org/eclipse/jdt/core/compiler/ecj/4.4.2/ecj-4.4.2.jar [ERROR] urls[43] = file:/C:/Users/zlzhangn/.m2/repository/org/eclipse/jetty/apache-jstl/9.3.24.v20180605/apache-jstl-9.3.24.v20180605.jar [ERROR] urls[44] = file:/C:/Users/zlzhangn/.m2/repository/org/apache/taglibs/taglibs-standard-spec/1.2.5/taglibs-standard-spec-1.2.5.jar [ERROR] urls[45] = file:/C:/Users/zlzhangn/.m2/repository/org/apache/taglibs/taglibs-standard-impl/1.2.5/taglibs-standard-impl-1.2.5.jar [ERROR] urls[46] = file:/C:/Users/zlzhangn/.m2/repository/javax/transaction/javax.transaction-api/1.2/javax.transaction-api-1.2.jar [ERROR] Number of foreign imports: 1 [ERROR] import: Entry[import from realm ClassRealm[maven.api, parent: null]] [ERROR] [ERROR] ----------------------------------------------------- [ERROR] -> [Help 1] [ERROR] [ERROR] To see the full stack trace of the errors, re-run Maven with the -e switch. [ERROR] Re-run Maven using the -X switch to enable full debug logging. [ERROR] [ERROR] For more information about the errors and possible solutions, please read the following articles: [ERROR] [Help 1] http://cwiki.apache.org/confluence/display/MAVEN/PluginContainerException Exception in thread "Thread-1" java.lang.BootstrapMethodError: java.lang.NoClassDefFoundError: org/eclipse/jetty/http/pathmap/MappedResource at org.eclipse.jetty.websocket.server.NativeWebSocketConfiguration.doStop(NativeWebSocketConfiguration.java:65) at org.eclipse.jetty.util.component.AbstractLifeCycle.stop(AbstractLifeCycle.java:89) at org.eclipse.jetty.util.component.ContainerLifeCycle.stop(ContainerLifeCycle.java:142) at org.eclipse.jetty.util.component.ContainerLifeCycle.doStop(ContainerLifeCycle.java:160) at org.eclipse.jetty.websocket.jsr356.ClientContainer.doStop(ClientContainer.java:205) at org.eclipse.jetty.util.component.AbstractLifeCycle.stop(AbstractLifeCycle.java:89) at org.eclipse.jetty.util.thread.ShutdownThread.run(ShutdownThread.java:138) Caused by: java.lang.NoClassDefFoundError: org/eclipse/jetty/http/pathmap/MappedResource ... 7 more Caused by: java.lang.ClassNotFoundException: org.eclipse.jetty.http.pathmap.MappedResource at org.codehaus.plexus.classworlds.strategy.SelfFirstStrategy.loadClass(SelfFirstStrategy.java:50) at org.codehaus.plexus.classworlds.realm.ClassRealm.unsynchronizedLoadClass(ClassRealm.java:271) at org.codehaus.plexus.classworlds.realm.ClassRealm.loadClass(ClassRealm.java:247) at org.codehaus.plexus.classworlds.realm.ClassRealm.loadClass(ClassRealm.java:239) ... 7 more ``` 我看这个类在本地仓库里是存在的, 试了很多办法还是提示这个 不知道该怎么办了
以前一直好好的 为什么今天springboot的jar包中,parent标签一直报错,我强制更新 maven很多次了,也没用!!!
以前一直好好的 为什么今天springboot的jar包中,parent标签一直报错,我强制更新 maven很多次了,也没用!!!,因为这个导致我项目很多注解失效! ![图片说明](https://img-ask.csdn.net/upload/201903/16/1552727814_566268.png) 这是parent节点的报错说明: Project configurator "org.springframework.ide.eclipse.boot.properties.editor.maven.EnableJdtAptM2EProjectConfigurator" required by plugin execution "org.apache.maven.plugins:maven-compiler-plugin:3.7.0:testCompile (execution: default-testCompile, phase: test-compile)" is not available. To enable full functionality, install the project configurator and run Maven->Update Project Configuration.
Maven 项目UTF-8编码问题
我在我电脑上的G:\AdobeCQ路径下面有两个相同的项目: BMWPDF PDFGeneration ![图片说明](https://img-ask.csdn.net/upload/201511/19/1447909321_791529.png) 以前我在BMWPDF项目中的POM.xml文件里面加了以下的语句: ``` <project.build.sourceEncoding>UTF-8</project.build.sourceEncoding> <project.reporting.outputEncoding>UTF-8</project.reporting.outputEncoding> <maven.compiler.encoding>UTF-8</maven.compiler.encoding> ``` 并且将这个项目Text file encoding 改为了UTF-8。做这个两个操作的目的是为了让这个项目能够支持在代码中写入中文字符。后来这样编译并没有什么问题,而且中文也能够顺利的输出到相对应的PDF中。 可是,昨天晚上大概11点半左右,我发现打开eclipse的时候出现了错误,提示“error shows in .metadata/.log”。项目打不开,我只好把.metadata文件删掉之后,重新打开eclipse,导入项目之后,用maven进行编译,出现以下的错误: [ERROR] Failed to execute goal org.apache.felix:maven-scr-plugin:1.7.4:scr (generate-scr-descriptor) on project bmwpdf-bundle: Execution generate-scr-descriptor of goal org.apache.felix:maven-scr-plugin:1.7.4:scr failed: syntax error @[861,2] in file:/G:/AdobeCQ/bmwpdf/bundle/src/main/java/com/bmw/pdf/generator/GeneratorProcess.java -> [Help 1] 看了具体的错误信息,我有点懵了。因为提示的错误文件中根本没有861行,最多859行。后来具体的去看错误信息,知道是因为这个文件存在中文引起的,但是我又不能讲中文去掉。于是,我只能想着碰运气,重新创建了一个项目PDFGeneration,代码一样,POM文件也是一样的。但是并没有改动项目配置中的Text file encoding,默认是GBK,这个时候,中文乱码,于是,我直接拷贝这些含有中文的文件内容到对应的新项目中。保存,编译,没有错误。运行包之后,只要是在代码中出现的中文字符,全部乱码。于是,我将Text file encoding改为UTF-8。编译之后同原来的项目一样,出现以下错误: [ERROR] Failed to execute goal org.apache.felix:maven-scr-plugin:1.7.4:scr (generate-scr-descriptor) on project bmwpdf-bundle: Execution generate-scr-descriptor of goal org.apache.felix:maven-scr-plugin:1.7.4:scr failed: syntax error @[861,2] in file:/G:/AdobeCQ/bmwpdf/bundle/src/main/java/com/bmw/pdf/generator/GeneratorProcess.java -> [Help 1] 于是我试着将POM文件中的以下内容去掉: ``` <project.build.sourceEncoding>UTF-8</project.build.sourceEncoding> <project.reporting.outputEncoding>UTF-8</project.reporting.outputEncoding> <maven.compiler.encoding>UTF-8</maven.compiler.encoding> ``` 并将Text file encoding改为GBK。保存,编译,运行,中文正常出现。 以上总结一下就是项目编码的问题导致的,最后改为默认的编码解决了。具体问题是代码中出现了中文字符,如何让这些中文字符输出到PDF中不出现乱码,就出现了要将项目配置中的编译POM文件进行相应的编码改动措施,然并卵,后来又改回去了。只是奇怪的是第一个项目做了两个月左右,一直没出错,从昨天开始就奇怪的出现因为编码出现的问题。 说实话,这个项目的编码问题花了我不少的时间,但终究还是没有弄得太懂,有的时候只能是凭着感觉去具体的解决问题。哎,这种感觉真是不爽。花时间去弄懂这个问题吧,其他的事情又是一大堆;不花时间吧,以后可能又是同样的问题。这也许就是程序员的无奈。
eclipse 中写的一个maven工程 debug启动报错 在线等 求大神解决啊
[INFO] --- maven-resources-plugin:2.7:resources (default-resources) @ taotao-manage-web --- [INFO] Using 'UTF-8' encoding to copy filtered resources. [INFO] Copying 9 resources [INFO] [INFO] --- maven-compiler-plugin:3.2:compile (default-compile) @ taotao-manage-web --- [INFO] Nothing to compile - all classes are up to date [INFO] [INFO] <<< tomcat7-maven-plugin:2.2:run (default-cli) < process-classes @ taotao-manage-web <<< [WARNING] The artifact org.apache.commons:commons-io:jar:1.3.2 has been relocated to commons-io:commons-io:jar:1.3.2 [INFO] [INFO] --- tomcat7-maven-plugin:2.2:run (default-cli) @ taotao-manage-web --- [INFO] Running war on http://localhost:8081/ [INFO] Using existing Tomcat server configuration at D:\work\taotao-manage\taotao-manage-web\target\tomcat [ERROR] error creating fake context.xml : 系统找不到指定的路径。 java.io.IOException: 系统找不到指定的路径。 at java.io.WinNTFileSystem.createFileExclusively(Native Method) at java.io.File.createTempFile(File.java:2024) at java.io.File.createTempFile(File.java:2070) at org.apache.tomcat.maven.plugin.tomcat7.run.RunMojo.getContextFile(RunMojo.java:190) at org.apache.tomcat.maven.plugin.tomcat7.run.AbstractRunMojo.createContext(AbstractRunMojo.java:653) at org.apache.tomcat.maven.plugin.tomcat7.run.AbstractRunMojo.startContainer(AbstractRunMojo.java:1091) at org.apache.tomcat.maven.plugin.tomcat7.run.AbstractRunMojo.execute(AbstractRunMojo.java:592) at org.apache.maven.plugin.DefaultBuildPluginManager.executeMojo(DefaultBuildPluginManager.java:132) at org.apache.maven.lifecycle.internal.MojoExecutor.execute(MojoExecutor.java:208) at org.apache.maven.lifecycle.internal.MojoExecutor.execute(MojoExecutor.java:153) at org.apache.maven.lifecycle.internal.MojoExecutor.execute(MojoExecutor.java:145) at org.apache.maven.lifecycle.internal.LifecycleModuleBuilder.buildProject(LifecycleModuleBuilder.java:116) at org.apache.maven.lifecycle.internal.LifecycleModuleBuilder.buildProject(LifecycleModuleBuilder.java:80) at org.apache.maven.lifecycle.internal.builder.singlethreaded.SingleThreadedBuilder.build(SingleThreadedBuilder.java:51) at org.apache.maven.lifecycle.internal.LifecycleStarter.execute(LifecycleStarter.java:120) at org.apache.maven.DefaultMaven.doExecute(DefaultMaven.java:355) at org.apache.maven.DefaultMaven.execute(DefaultMaven.java:155) at org.apache.maven.cli.MavenCli.execute(MavenCli.java:584) at org.apache.maven.cli.MavenCli.doMain(MavenCli.java:216) at org.apache.maven.cli.MavenCli.main(MavenCli.java:160) at sun.reflect.NativeMethodAccessorImpl.invoke0(Native Method) at sun.reflect.NativeMethodAccessorImpl.invoke(NativeMethodAccessorImpl.java:62) at sun.reflect.DelegatingMethodAccessorImpl.invoke(DelegatingMethodAccessorImpl.java:43) at java.lang.reflect.Method.invoke(Method.java:483) at org.codehaus.plexus.classworlds.launcher.Launcher.launchEnhanced(Launcher.java:289) at org.codehaus.plexus.classworlds.launcher.Launcher.launch(Launcher.java:229) at org.codehaus.plexus.classworlds.launcher.Launcher.mainWithExitCode(Launcher.java:415) at org.codehaus.plexus.classworlds.launcher.Launcher.main(Launcher.java:356) [INFO] ------------------------------------------------------------------------ [INFO] BUILD FAILURE [INFO] ------------------------------------------------------------------------ [INFO] Total time: 4.942 s [INFO] Finished at: 2017-06-09T09:35:17+08:00 [INFO] Final Memory: 15M/136M [INFO] ------------------------------------------------------------------------ [ERROR] Failed to execute goal org.apache.tomcat.maven:tomcat7-maven-plugin:2.2:run (default-cli) on project taotao-manage-web: error creating fake context.xml : 系统找不到指定的路径。 -> [Help 1] [ERROR] [ERROR] To see the full stack trace of the errors, re-run Maven with the -e switch. [ERROR] Re-run Maven using the -X switch to enable full debug logging. [ERROR] [ERROR] For more information about the errors and possible solutions, please read the following articles: [ERROR] [Help 1] http://cwiki.apache.org/confluence/display/MAVEN/MojoExecutionException
maven插件jetty:run运行项目一直失败显示
在idea中maven依赖jetty:run运行一个项目一直报这个错误 ``` [INFO] [INFO] ------------------------------------------------------------------------ [INFO] Building Xiaomi Finance LC OSS Web Project 1.0.1-SNAPSHOT [INFO] ------------------------------------------------------------------------ [INFO] [INFO] >>> jetty-maven-plugin:8.1.3.v20120416:run (default-cli) > test-compile @ lc-oss-web >>> [INFO] [INFO] --- maven-resources-plugin:2.6:resources (default-resources) @ lc-oss-web --- [INFO] Using 'UTF-8' encoding to copy filtered resources. [INFO] Copying 14 resources [INFO] Copying 3 resources to /Users/Stefan/xiaomi/cashpay-lc-oss/lc-oss/lc-oss-web/target/classes/config [INFO] [INFO] --- maven-compiler-plugin:3.1:compile (default-compile) @ lc-oss-web --- [INFO] Nothing to compile - all classes are up to date [INFO] [INFO] --- maven-resources-plugin:2.6:testResources (default-testResources) @ lc-oss-web --- [INFO] Not copying test resources [INFO] [INFO] --- maven-compiler-plugin:3.1:testCompile (default-testCompile) @ lc-oss-web --- [INFO] Not compiling test sources [INFO] [INFO] <<< jetty-maven-plugin:8.1.3.v20120416:run (default-cli) < test-compile @ lc-oss-web <<< [INFO] [INFO] --- jetty-maven-plugin:8.1.3.v20120416:run (default-cli) @ lc-oss-web --- [INFO] Configuring Jetty for project: Xiaomi Finance LC OSS Web Project [INFO] webAppSourceDirectory /Users/Stefan/xiaomi/cashpay-lc-oss/lc-oss/lc-oss-web/src/main/webapp does not exist. Defaulting to /Users/Stefan/xiaomi/cashpay-lc-oss/lc-oss/lc-oss-web/src/main/webapp [INFO] Reload Mechanic: manual [INFO] Classes = /Users/Stefan/xiaomi/cashpay-lc-oss/lc-oss/lc-oss-web/target/classes [INFO] Applying context xml file src/main/resources/jetty-context.xml [INFO] Context path = / [INFO] Tmp directory = /Users/Stefan/xiaomi/cashpay-lc-oss/lc-oss/lc-oss-web/target/tmp [INFO] Web defaults = org/eclipse/jetty/webapp/webdefault.xml [INFO] Web overrides = none [INFO] web.xml file = file:/Users/Stefan/xiaomi/cashpay-lc-oss/lc-oss/lc-oss-web/src/main/webapp/WEB-INF/web.xml [INFO] Webapp directory = /Users/Stefan/xiaomi/cashpay-lc-oss/lc-oss/lc-oss-web/src/main/webapp [INFO] jetty-8.1.3.v20120416 [INFO] No Transaction manager found - if your webapp requires one, please configure one. [INFO] No Spring WebApplicationInitializer types detected on classpath [INFO] started o.m.j.p.JettyWebAppContext{/,file:/Users/Stefan/xiaomi/cashpay-lc-oss/lc-oss/lc-oss-web/src/main/webapp/},file:/Users/Stefan/xiaomi/cashpay-lc-oss/lc-oss/lc-oss-web/src/main/webapp/ [INFO] started o.m.j.p.JettyWebAppContext{/,file:/Users/Stefan/xiaomi/cashpay-lc-oss/lc-oss/lc-oss-web/src/main/webapp/},file:/Users/Stefan/xiaomi/cashpay-lc-oss/lc-oss/lc-oss-web/src/main/webapp/ [INFO] started o.m.j.p.JettyWebAppContext{/,file:/Users/Stefan/xiaomi/cashpay-lc-oss/lc-oss/lc-oss-web/src/main/webapp/},file:/Users/Stefan/xiaomi/cashpay-lc-oss/lc-oss/lc-oss-web/src/main/webapp/ [INFO] Set web app root system property: 'webapp.root' = [/Users/Stefan/xiaomi/cashpay-lc-oss/lc-oss/lc-oss-web/src/main/webapp] [INFO] Initializing log4j from [classpath:/config/log4j.xml] [WARNING] FAILED o.m.j.p.JettyWebAppContext{/,file:/Users/Stefan/xiaomi/cashpay-lc-oss/lc-oss/lc-oss-web/src/main/webapp/},file:/Users/Stefan/xiaomi/cashpay-lc-oss/lc-oss/lc-oss-web/src/main/webapp/: java.lang.NoSuchMethodError: org.apache.log4j.LogManager.getLoggerRepository()Lorg/apache/log4j/spi/LoggerRepository; java.lang.NoSuchMethodError: org.apache.log4j.LogManager.getLoggerRepository()Lorg/apache/log4j/spi/LoggerRepository; at org.apache.log4j.xml.DOMConfigurator.configure(DOMConfigurator.java:901) at org.springframework.util.Log4jConfigurer.initLogging(Log4jConfigurer.java:72) at org.springframework.web.util.Log4jWebConfigurer.initLogging(Log4jWebConfigurer.java:152) at org.springframework.web.util.Log4jConfigListener.contextInitialized(Log4jConfigListener.java:46) at org.eclipse.jetty.server.handler.ContextHandler.callContextInitialized(ContextHandler.java:764) at org.eclipse.jetty.servlet.ServletContextHandler.callContextInitialized(ServletContextHandler.java:406) at org.eclipse.jetty.server.handler.ContextHandler.startContext(ContextHandler.java:756) at org.eclipse.jetty.servlet.ServletContextHandler.startContext(ServletContextHandler.java:242) at org.eclipse.jetty.webapp.WebAppContext.startContext(WebAppContext.java:1221) at org.eclipse.jetty.server.handler.ContextHandler.doStart(ContextHandler.java:699) at org.eclipse.jetty.webapp.WebAppContext.doStart(WebAppContext.java:454) at org.mortbay.jetty.plugin.JettyWebAppContext.doStart(JettyWebAppContext.java:256) at org.eclipse.jetty.util.component.AbstractLifeCycle.start(AbstractLifeCycle.java:59) at org.eclipse.jetty.server.handler.HandlerCollection.doStart(HandlerCollection.java:224) at org.eclipse.jetty.server.handler.ContextHandlerCollection.doStart(ContextHandlerCollection.java:167) at org.eclipse.jetty.util.component.AbstractLifeCycle.start(AbstractLifeCycle.java:59) at org.eclipse.jetty.server.handler.HandlerCollection.doStart(HandlerCollection.java:224) at org.eclipse.jetty.util.component.AbstractLifeCycle.start(AbstractLifeCycle.java:59) at org.eclipse.jetty.server.handler.HandlerWrapper.doStart(HandlerWrapper.java:90) at org.eclipse.jetty.server.Server.doStart(Server.java:262) at org.mortbay.jetty.plugin.JettyServer.doStart(JettyServer.java:65) at org.eclipse.jetty.util.component.AbstractLifeCycle.start(AbstractLifeCycle.java:59) at org.mortbay.jetty.plugin.AbstractJettyMojo.startJetty(AbstractJettyMojo.java:511) at org.mortbay.jetty.plugin.AbstractJettyMojo.execute(AbstractJettyMojo.java:364) at org.mortbay.jetty.plugin.JettyRunMojo.execute(JettyRunMojo.java:516) at org.apache.maven.plugin.DefaultBuildPluginManager.executeMojo(DefaultBuildPluginManager.java:134) at org.apache.maven.lifecycle.internal.MojoExecutor.execute(MojoExecutor.java:207) at org.apache.maven.lifecycle.internal.MojoExecutor.execute(MojoExecutor.java:153) at org.apache.maven.lifecycle.internal.MojoExecutor.execute(MojoExecutor.java:145) at org.apache.maven.lifecycle.internal.LifecycleModuleBuilder.buildProject(LifecycleModuleBuilder.java:116) at org.apache.maven.lifecycle.internal.LifecycleModuleBuilder.buildProject(LifecycleModuleBuilder.java:80) at org.apache.maven.lifecycle.internal.builder.singlethreaded.SingleThreadedBuilder.build(SingleThreadedBuilder.java:51) at org.apache.maven.lifecycle.internal.LifecycleStarter.execute(LifecycleStarter.java:128) at org.apache.maven.DefaultMaven.doExecute(DefaultMaven.java:307) at org.apache.maven.DefaultMaven.doExecute(DefaultMaven.java:193) at org.apache.maven.DefaultMaven.execute(DefaultMaven.java:106) at org.apache.maven.cli.MavenCli.execute(MavenCli.java:863) at org.apache.maven.cli.MavenCli.doMain(MavenCli.java:288) at org.apache.maven.cli.MavenCli.main(MavenCli.java:199) at sun.reflect.NativeMethodAccessorImpl.invoke0(Native Method) at sun.reflect.NativeMethodAccessorImpl.invoke(NativeMethodAccessorImpl.java:57) at sun.reflect.DelegatingMethodAccessorImpl.invoke(DelegatingMethodAccessorImpl.java:43) at java.lang.reflect.Method.invoke(Method.java:606) at org.codehaus.plexus.classworlds.launcher.Launcher.launchEnhanced(Launcher.java:289) at org.codehaus.plexus.classworlds.launcher.Launcher.launch(Launcher.java:229) at org.codehaus.plexus.classworlds.launcher.Launcher.mainWithExitCode(Launcher.java:415) at org.codehaus.plexus.classworlds.launcher.Launcher.main(Launcher.java:356) at org.codehaus.classworlds.Launcher.main(Launcher.java:47) [WARNING] FAILED org.eclipse.jetty.server.handler.ContextHandlerCollection@4a2047ce: java.lang.NoSuchMethodError: org.apache.log4j.LogManager.getLoggerRepository()Lorg/apache/log4j/spi/LoggerRepository; java.lang.NoSuchMethodError: org.apache.log4j.LogManager.getLoggerRepository()Lorg/apache/log4j/spi/LoggerRepository; at org.apache.log4j.xml.DOMConfigurator.configure(DOMConfigurator.java:901) at org.springframework.util.Log4jConfigurer.initLogging(Log4jConfigurer.java:72) at org.springframework.web.util.Log4jWebConfigurer.initLogging(Log4jWebConfigurer.java:152) at org.springframework.web.util.Log4jConfigListener.contextInitialized(Log4jConfigListener.java:46) at org.eclipse.jetty.server.handler.ContextHandler.callContextInitialized(ContextHandler.java:764) at org.eclipse.jetty.servlet.ServletContextHandler.callContextInitialized(ServletContextHandler.java:406) at org.eclipse.jetty.server.handler.ContextHandler.startContext(ContextHandler.java:756) at org.eclipse.jetty.servlet.ServletContextHandler.startContext(ServletContextHandler.java:242) at org.eclipse.jetty.webapp.WebAppContext.startContext(WebAppContext.java:1221) at org.eclipse.jetty.server.handler.ContextHandler.doStart(ContextHandler.java:699) at org.eclipse.jetty.webapp.WebAppContext.doStart(WebAppContext.java:454) at org.mortbay.jetty.plugin.JettyWebAppContext.doStart(JettyWebAppContext.java:256) at org.eclipse.jetty.util.component.AbstractLifeCycle.start(AbstractLifeCycle.java:59) at org.eclipse.jetty.server.handler.HandlerCollection.doStart(HandlerCollection.java:224) at org.eclipse.jetty.server.handler.ContextHandlerCollection.doStart(ContextHandlerCollection.java:167) at org.eclipse.jetty.util.component.AbstractLifeCycle.start(AbstractLifeCycle.java:59) at org.eclipse.jetty.server.handler.HandlerCollection.doStart(HandlerCollection.java:224) at org.eclipse.jetty.util.component.AbstractLifeCycle.start(AbstractLifeCycle.java:59) at org.eclipse.jetty.server.handler.HandlerWrapper.doStart(HandlerWrapper.java:90) at org.eclipse.jetty.server.Server.doStart(Server.java:262) at org.mortbay.jetty.plugin.JettyServer.doStart(JettyServer.java:65) at org.eclipse.jetty.util.component.AbstractLifeCycle.start(AbstractLifeCycle.java:59) at org.mortbay.jetty.plugin.AbstractJettyMojo.startJetty(AbstractJettyMojo.java:511) at org.mortbay.jetty.plugin.AbstractJettyMojo.execute(AbstractJettyMojo.java:364) at org.mortbay.jetty.plugin.JettyRunMojo.execute(JettyRunMojo.java:516) at org.apache.maven.plugin.DefaultBuildPluginManager.executeMojo(DefaultBuildPluginManager.java:134) at org.apache.maven.lifecycle.internal.MojoExecutor.execute(MojoExecutor.java:207) at org.apache.maven.lifecycle.internal.MojoExecutor.execute(MojoExecutor.java:153) at org.apache.maven.lifecycle.internal.MojoExecutor.execute(MojoExecutor.java:145) at org.apache.maven.lifecycle.internal.LifecycleModuleBuilder.buildProject(LifecycleModuleBuilder.java:116) at org.apache.maven.lifecycle.internal.LifecycleModuleBuilder.buildProject(LifecycleModuleBuilder.java:80) at org.apache.maven.lifecycle.internal.builder.singlethreaded.SingleThreadedBuilder.build(SingleThreadedBuilder.java:51) at org.apache.maven.lifecycle.internal.LifecycleStarter.execute(LifecycleStarter.java:128) at org.apache.maven.DefaultMaven.doExecute(DefaultMaven.java:307) at org.apache.maven.DefaultMaven.doExecute(DefaultMaven.java:193) at org.apache.maven.DefaultMaven.execute(DefaultMaven.java:106) at org.apache.maven.cli.MavenCli.execute(MavenCli.java:863) at org.apache.maven.cli.MavenCli.doMain(MavenCli.java:288) at org.apache.maven.cli.MavenCli.main(MavenCli.java:199) at sun.reflect.NativeMethodAccessorImpl.invoke0(Native Method) at sun.reflect.NativeMethodAccessorImpl.invoke(NativeMethodAccessorImpl.java:57) at sun.reflect.DelegatingMethodAccessorImpl.invoke(DelegatingMethodAccessorImpl.java:43) at java.lang.reflect.Method.invoke(Method.java:606) at org.codehaus.plexus.classworlds.launcher.Launcher.launchEnhanced(Launcher.java:289) at org.codehaus.plexus.classworlds.launcher.Launcher.launch(Launcher.java:229) at org.codehaus.plexus.classworlds.launcher.Launcher.mainWithExitCode(Launcher.java:415) at org.codehaus.plexus.classworlds.launcher.Launcher.main(Launcher.java:356) at org.codehaus.classworlds.Launcher.main(Launcher.java:47) [WARNING] FAILED org.eclipse.jetty.server.handler.HandlerCollection@d4a4b67: java.lang.NoSuchMethodError: org.apache.log4j.LogManager.getLoggerRepository()Lorg/apache/log4j/spi/LoggerRepository; java.lang.NoSuchMethodError: org.apache.log4j.LogManager.getLoggerRepository()Lorg/apache/log4j/spi/LoggerRepository; at org.apache.log4j.xml.DOMConfigurator.configure(DOMConfigurator.java:901) at org.springframework.util.Log4jConfigurer.initLogging(Log4jConfigurer.java:72) at org.springframework.web.util.Log4jWebConfigurer.initLogging(Log4jWebConfigurer.java:152) at org.springframework.web.util.Log4jConfigListener.contextInitialized(Log4jConfigListener.java:46) at org.eclipse.jetty.server.handler.ContextHandler.callContextInitialized(ContextHandler.java:764) at org.eclipse.jetty.servlet.ServletContextHandler.callContextInitialized(ServletContextHandler.java:406) at org.eclipse.jetty.server.handler.ContextHandler.startContext(ContextHandler.java:756) at org.eclipse.jetty.servlet.ServletContextHandler.startContext(ServletContextHandler.java:242) at org.eclipse.jetty.webapp.WebAppContext.startContext(WebAppContext.java:1221) at org.eclipse.jetty.server.handler.ContextHandler.doStart(ContextHandler.java:699) at org.eclipse.jetty.webapp.WebAppContext.doStart(WebAppContext.java:454) at org.mortbay.jetty.plugin.JettyWebAppContext.doStart(JettyWebAppContext.java:256) at org.eclipse.jetty.util.component.AbstractLifeCycle.start(AbstractLifeCycle.java:59) at org.eclipse.jetty.server.handler.HandlerCollection.doStart(HandlerCollection.java:224) at org.eclipse.jetty.server.handler.ContextHandlerCollection.doStart(ContextHandlerCollection.java:167) at org.eclipse.jetty.util.component.AbstractLifeCycle.start(AbstractLifeCycle.java:59) at org.eclipse.jetty.server.handler.HandlerCollection.doStart(HandlerCollection.java:224) at org.eclipse.jetty.util.component.AbstractLifeCycle.start(AbstractLifeCycle.java:59) at org.eclipse.jetty.server.handler.HandlerWrapper.doStart(HandlerWrapper.java:90) at org.eclipse.jetty.server.Server.doStart(Server.java:262) at org.mortbay.jetty.plugin.JettyServer.doStart(JettyServer.java:65) at org.eclipse.jetty.util.component.AbstractLifeCycle.start(AbstractLifeCycle.java:59) at org.mortbay.jetty.plugin.AbstractJettyMojo.startJetty(AbstractJettyMojo.java:511) at org.mortbay.jetty.plugin.AbstractJettyMojo.execute(AbstractJettyMojo.java:364) at org.mortbay.jetty.plugin.JettyRunMojo.execute(JettyRunMojo.java:516) at org.apache.maven.plugin.DefaultBuildPluginManager.executeMojo(DefaultBuildPluginManager.java:134) at org.apache.maven.lifecycle.internal.MojoExecutor.execute(MojoExecutor.java:207) at org.apache.maven.lifecycle.internal.MojoExecutor.execute(MojoExecutor.java:153) at org.apache.maven.lifecycle.internal.MojoExecutor.execute(MojoExecutor.java:145) at org.apache.maven.lifecycle.internal.LifecycleModuleBuilder.buildProject(LifecycleModuleBuilder.java:116) at org.apache.maven.lifecycle.internal.LifecycleModuleBuilder.buildProject(LifecycleModuleBuilder.java:80) at org.apache.maven.lifecycle.internal.builder.singlethreaded.SingleThreadedBuilder.build(SingleThreadedBuilder.java:51) at org.apache.maven.lifecycle.internal.LifecycleStarter.execute(LifecycleStarter.java:128) at org.apache.maven.DefaultMaven.doExecute(DefaultMaven.java:307) at org.apache.maven.DefaultMaven.doExecute(DefaultMaven.java:193) at org.apache.maven.DefaultMaven.execute(DefaultMaven.java:106) at org.apache.maven.cli.MavenCli.execute(MavenCli.java:863) at org.apache.maven.cli.MavenCli.doMain(MavenCli.java:288) at org.apache.maven.cli.MavenCli.main(MavenCli.java:199) at sun.reflect.NativeMethodAccessorImpl.invoke0(Native Method) at sun.reflect.NativeMethodAccessorImpl.invoke(NativeMethodAccessorImpl.java:57) at sun.reflect.DelegatingMethodAccessorImpl.invoke(DelegatingMethodAccessorImpl.java:43) at java.lang.reflect.Method.invoke(Method.java:606) at org.codehaus.plexus.classworlds.launcher.Launcher.launchEnhanced(Launcher.java:289) at org.codehaus.plexus.classworlds.launcher.Launcher.launch(Launcher.java:229) at org.codehaus.plexus.classworlds.launcher.Launcher.mainWithExitCode(Launcher.java:415) at org.codehaus.plexus.classworlds.launcher.Launcher.main(Launcher.java:356) at org.codehaus.classworlds.Launcher.main(Launcher.java:47) [WARNING] FAILED org.mortbay.jetty.plugin.JettyServer@36214bbd: java.lang.NoSuchMethodError: org.apache.log4j.LogManager.getLoggerRepository()Lorg/apache/log4j/spi/LoggerRepository; java.lang.NoSuchMethodError: org.apache.log4j.LogManager.getLoggerRepository()Lorg/apache/log4j/spi/LoggerRepository; at org.apache.log4j.xml.DOMConfigurator.configure(DOMConfigurator.java:901) at org.springframework.util.Log4jConfigurer.initLogging(Log4jConfigurer.java:72) at org.springframework.web.util.Log4jWebConfigurer.initLogging(Log4jWebConfigurer.java:152) at org.springframework.web.util.Log4jConfigListener.contextInitialized(Log4jConfigListener.java:46) at org.eclipse.jetty.server.handler.ContextHandler.callContextInitialized(ContextHandler.java:764) at org.eclipse.jetty.servlet.ServletContextHandler.callContextInitialized(ServletContextHandler.java:406) at org.eclipse.jetty.server.handler.ContextHandler.startContext(ContextHandler.java:756) at org.eclipse.jetty.servlet.ServletContextHandler.startContext(ServletContextHandler.java:242) at org.eclipse.jetty.webapp.WebAppContext.startContext(WebAppContext.java:1221) at org.eclipse.jetty.server.handler.ContextHandler.doStart(ContextHandler.java:699) at org.eclipse.jetty.webapp.WebAppContext.doStart(WebAppContext.java:454) at org.mortbay.jetty.plugin.JettyWebAppContext.doStart(JettyWebAppContext.java:256) at org.eclipse.jetty.util.component.AbstractLifeCycle.start(AbstractLifeCycle.java:59) at org.eclipse.jetty.server.handler.HandlerCollection.doStart(HandlerCollection.java:224) at org.eclipse.jetty.server.handler.ContextHandlerCollection.doStart(ContextHandlerCollection.java:167) at org.eclipse.jetty.util.component.AbstractLifeCycle.start(AbstractLifeCycle.java:59) at org.eclipse.jetty.server.handler.HandlerCollection.doStart(HandlerCollection.java:224) at org.eclipse.jetty.util.component.AbstractLifeCycle.start(AbstractLifeCycle.java:59) at org.eclipse.jetty.server.handler.HandlerWrapper.doStart(HandlerWrapper.java:90) at org.eclipse.jetty.server.Server.doStart(Server.java:262) at org.mortbay.jetty.plugin.JettyServer.doStart(JettyServer.java:65) at org.eclipse.jetty.util.component.AbstractLifeCycle.start(AbstractLifeCycle.java:59) at org.mortbay.jetty.plugin.AbstractJettyMojo.startJetty(AbstractJettyMojo.java:511) at org.mortbay.jetty.plugin.AbstractJettyMojo.execute(AbstractJettyMojo.java:364) at org.mortbay.jetty.plugin.JettyRunMojo.execute(JettyRunMojo.java:516) at org.apache.maven.plugin.DefaultBuildPluginManager.executeMojo(DefaultBuildPluginManager.java:134) at org.apache.maven.lifecycle.internal.MojoExecutor.execute(MojoExecutor.java:207) at org.apache.maven.lifecycle.internal.MojoExecutor.execute(MojoExecutor.java:153) at org.apache.maven.lifecycle.internal.MojoExecutor.execute(MojoExecutor.java:145) at org.apache.maven.lifecycle.internal.LifecycleModuleBuilder.buildProject(LifecycleModuleBuilder.java:116) at org.apache.maven.lifecycle.internal.LifecycleModuleBuilder.buildProject(LifecycleModuleBuilder.java:80) at org.apache.maven.lifecycle.internal.builder.singlethreaded.SingleThreadedBuilder.build(SingleThreadedBuilder.java:51) at org.apache.maven.lifecycle.internal.LifecycleStarter.execute(LifecycleStarter.java:128) at org.apache.maven.DefaultMaven.doExecute(DefaultMaven.java:307) at org.apache.maven.DefaultMaven.doExecute(DefaultMaven.java:193) at org.apache.maven.DefaultMaven.execute(DefaultMaven.java:106) at org.apache.maven.cli.MavenCli.execute(MavenCli.java:863) at org.apache.maven.cli.MavenCli.doMain(MavenCli.java:288) at org.apache.maven.cli.MavenCli.main(MavenCli.java:199) at sun.reflect.NativeMethodAccessorImpl.invoke0(Native Method) at sun.reflect.NativeMethodAccessorImpl.invoke(NativeMethodAccessorImpl.java:57) at sun.reflect.DelegatingMethodAccessorImpl.invoke(DelegatingMethodAccessorImpl.java:43) at java.lang.reflect.Method.invoke(Method.java:606) at org.codehaus.plexus.classworlds.launcher.Launcher.launchEnhanced(Launcher.java:289) at org.codehaus.plexus.classworlds.launcher.Launcher.launch(Launcher.java:229) at org.codehaus.plexus.classworlds.launcher.Launcher.mainWithExitCode(Launcher.java:415) at org.codehaus.plexus.classworlds.launcher.Launcher.main(Launcher.java:356) at org.codehaus.classworlds.Launcher.main(Launcher.java:47) [INFO] Jetty server exiting. [INFO] ------------------------------------------------------------------------ [INFO] BUILD FAILURE [INFO] ------------------------------------------------------------------------ [INFO] Total time: 20.149 s [INFO] Finished at: 2019-04-09T17:06:45+08:00 [INFO] Final Memory: 53M/1963M [INFO] ------------------------------------------------------------------------ [ERROR] Failed to execute goal org.mortbay.jetty:jetty-maven-plugin:8.1.3.v20120416:run (default-cli) on project lc-oss-web: Execution default-cli of goal org.mortbay.jetty:jetty-maven-plugin:8.1.3.v20120416:run failed: An API incompatibility was encountered while executing org.mortbay.jetty:jetty-maven-plugin:8.1.3.v20120416:run: java.lang.NoSuchMethodError: org.apache.log4j.LogManager.getLoggerRepository()Lorg/apache/log4j/spi/LoggerRepository; [ERROR] ----------------------------------------------------- [ERROR] realm = plugin>org.mortbay.jetty:jetty-maven-plugin:8.1.3.v20120416 [ERROR] strategy = org.codehaus.plexus.classworlds.strategy.SelfFirstStrategy [ERROR] urls[0] = file:/Users/Stefan/.m2/repository/org/mortbay/jetty/jetty-maven-plugin/8.1.3.v20120416/jetty-maven-plugin-8.1.3.v20120416.jar [ERROR] urls[1] = file:/Users/Stefan/.m2/repository/commons-dbcp/commons-dbcp/1.4/commons-dbcp-1.4.jar [ERROR] urls[2] = file:/Users/Stefan/.m2/repository/commons-pool/commons-pool/1.5.4/commons-pool-1.5.4.jar [ERROR] urls[3] = file:/Users/Stefan/.m2/repository/net/sf/log4jdbc/log4jdbc4/1.2/log4jdbc4-1.2.jar [ERROR] urls[4] = file:/Users/Stefan/.m2/repository/mysql/mysql-connector-java/5.1.30/mysql-connector-java-5.1.30.jar [ERROR] urls[5] = file:/Users/Stefan/.m2/repository/ch/qos/logback/logback-core/1.0.7/logback-core-1.0.7.jar [ERROR] urls[6] = file:/Users/Stefan/.m2/repository/ch/qos/logback/logback-classic/1.0.7/logback-classic-1.0.7.jar [ERROR] urls[7] = file:/Users/Stefan/.m2/repository/org/eclipse/jetty/jetty-util/8.1.3.v20120416/jetty-util-8.1.3.v20120416.jar [ERROR] urls[8] = file:/Users/Stefan/.m2/repository/org/eclipse/jetty/jetty-webapp/8.1.3.v20120416/jetty-webapp-8.1.3.v20120416.jar [ERROR] urls[9] = file:/Users/Stefan/.m2/repository/org/eclipse/jetty/jetty-xml/8.1.3.v20120416/jetty-xml-8.1.3.v20120416.jar [ERROR] urls[10] = file:/Users/Stefan/.m2/repository/org/eclipse/jetty/jetty-servlet/8.1.3.v20120416/jetty-servlet-8.1.3.v20120416.jar [ERROR] urls[11] = file:/Users/Stefan/.m2/repository/org/eclipse/jetty/jetty-security/8.1.3.v20120416/jetty-security-8.1.3.v20120416.jar [ERROR] urls[12] = file:/Users/Stefan/.m2/repository/org/eclipse/jetty/jetty-server/8.1.3.v20120416/jetty-server-8.1.3.v20120416.jar [ERROR] urls[13] = file:/Users/Stefan/.m2/repository/org/eclipse/jetty/jetty-continuation/8.1.3.v20120416/jetty-continuation-8.1.3.v20120416.jar [ERROR] urls[14] = file:/Users/Stefan/.m2/repository/org/sonatype/sisu/sisu-inject-bean/2.1.1/sisu-inject-bean-2.1.1.jar [ERROR] urls[15] = file:/Users/Stefan/.m2/repository/org/sonatype/sisu/sisu-guice/2.9.4/sisu-guice-2.9.4-no_aop.jar [ERROR] urls[16] = file:/Users/Stefan/.m2/repository/org/codehaus/plexus/plexus-utils/2.0.6/plexus-utils-2.0.6.jar [ERROR] urls[17] = file:/Users/Stefan/.m2/repository/org/sonatype/aether/aether-util/1.11/aether-util-1.11.jar [ERROR] urls[18] = file:/Users/Stefan/.m2/repository/org/codehaus/plexus/plexus-interpolation/1.14/plexus-interpolation-1.14.jar [ERROR] urls[19] = file:/Users/Stefan/.m2/repository/org/codehaus/plexus/plexus-component-annotations/1.5.5/plexus-component-annotations-1.5.5.jar [ERROR] urls[20] = file:/Users/Stefan/.m2/repository/org/sonatype/plexus/plexus-sec-dispatcher/1.3/plexus-sec-dispatcher-1.3.jar [ERROR] urls[21] = file:/Users/Stefan/.m2/repository/org/sonatype/plexus/plexus-cipher/1.4/plexus-cipher-1.4.jar [ERROR] urls[22] = file:/Users/Stefan/.m2/repository/org/apache/maven/plugin-tools/maven-plugin-tools-api/2.9/maven-plugin-tools-api-2.9.jar [ERROR] urls[23] = file:/Users/Stefan/.m2/repository/org/apache/maven/reporting/maven-reporting-api/2.0.6/maven-reporting-api-2.0.6.jar [ERROR] urls[24] = file:/Users/Stefan/.m2/repository/org/apache/maven/doxia/doxia-sink-api/1.0-alpha-7/doxia-sink-api-1.0-alpha-7.jar [ERROR] urls[25] = file:/Users/Stefan/.m2/repository/junit/junit/3.8.1/junit-3.8.1.jar [ERROR] urls[26] = file:/Users/Stefan/.m2/repository/net/sf/jtidy/jtidy/r938/jtidy-r938.jar [ERROR] urls[27] = file:/Users/Stefan/.m2/repository/org/eclipse/jetty/jetty-plus/8.1.3.v20120416/jetty-plus-8.1.3.v20120416.jar [ERROR] urls[28] = file:/Users/Stefan/.m2/repository/org/eclipse/jetty/orbit/javax.transaction/1.1.1.v201105210645/javax.transaction-1.1.1.v201105210645.jar [ERROR] urls[29] = file:/Users/Stefan/.m2/repository/org/eclipse/jetty/jetty-jndi/8.1.3.v20120416/jetty-jndi-8.1.3.v20120416.jar [ERROR] urls[30] = file:/Users/Stefan/.m2/repository/org/eclipse/jetty/orbit/javax.mail.glassfish/1.4.1.v201005082020/javax.mail.glassfish-1.4.1.v201005082020.jar [ERROR] urls[31] = file:/Users/Stefan/.m2/repository/org/eclipse/jetty/orbit/javax.activation/1.1.0.v201105071233/javax.activation-1.1.0.v201105071233.jar [ERROR] urls[32] = file:/Users/Stefan/.m2/repository/org/eclipse/jetty/jetty-jmx/8.1.3.v20120416/jetty-jmx-8.1.3.v20120416.jar [ERROR] urls[33] = file:/Users/Stefan/.m2/repository/org/eclipse/jetty/jetty-annotations/8.1.3.v20120416/jetty-annotations-8.1.3.v20120416.jar [ERROR] urls[34] = file:/Users/Stefan/.m2/repository/org/eclipse/jetty/orbit/javax.annotation/1.1.0.v201108011116/javax.annotation-1.1.0.v201108011116.jar [ERROR] urls[35] = file:/Users/Stefan/.m2/repository/org/eclipse/jetty/orbit/org.objectweb.asm/3.1.0.v200803061910/org.objectweb.asm-3.1.0.v200803061910.jar [ERROR] urls[36] = file:/Users/Stefan/.m2/repository/org/eclipse/jetty/jetty-websocket/8.1.3.v20120416/jetty-websocket-8.1.3.v20120416.jar [ERROR] urls[37] = file:/Users/Stefan/.m2/repository/org/eclipse/jetty/jetty-io/8.1.3.v20120416/jetty-io-8.1.3.v20120416.jar [ERROR] urls[38] = file:/Users/Stefan/.m2/repository/org/eclipse/jetty/jetty-http/8.1.3.v20120416/jetty-http-8.1.3.v20120416.jar [ERROR] urls[39] = file:/Users/Stefan/.m2/repository/org/eclipse/jetty/jetty-jsp/8.1.3.v20120416/jetty-jsp-8.1.3.v20120416.jar [ERROR] urls[40] = file:/Users/Stefan/.m2/repository/org/eclipse/jetty/orbit/javax.servlet.jsp/2.2.0.v201112011158/javax.servlet.jsp-2.2.0.v201112011158.jar [ERROR] urls[41] = file:/Users/Stefan/.m2/repository/org/eclipse/jetty/orbit/javax.servlet/3.0.0.v201112011016/javax.servlet-3.0.0.v201112011016.jar [ERROR] urls[42] = file:/Users/Stefan/.m2/repository/org/eclipse/jetty/orbit/org.apache.jasper.glassfish/2.2.2.v201112011158/org.apache.jasper.glassfish-2.2.2.v201112011158.jar [ERROR] urls[43] = file:/Users/Stefan/.m2/repository/org/eclipse/jetty/orbit/javax.servlet.jsp.jstl/1.2.0.v201105211821/javax.servlet.jsp.jstl-1.2.0.v201105211821.jar [ERROR] urls[44] = file:/Users/Stefan/.m2/repository/org/eclipse/jetty/orbit/org.apache.taglibs.standard.glassfish/1.2.0.v201112081803/org.apache.taglibs.standard.glassfish-1.2.0.v201112081803.jar [ERROR] urls[45] = file:/Users/Stefan/.m2/repository/org/eclipse/jetty/orbit/javax.el/2.2.0.v201108011116/javax.el-2.2.0.v201108011116.jar [ERROR] urls[46] = file:/Users/Stefan/.m2/repository/org/eclipse/jetty/orbit/com.sun.el/2.2.0.v201108011116/com.sun.el-2.2.0.v201108011116.jar [ERROR] urls[47] = file:/Users/Stefan/.m2/repository/org/eclipse/jetty/orbit/org.eclipse.jdt.core/3.7.1/org.eclipse.jdt.core-3.7.1.jar [ERROR] Number of foreign imports: 1 [ERROR] import: Entry[import from realm ClassRealm[maven.api, parent: null]] [ERROR] [ERROR] ----------------------------------------------------- [ERROR] -> [Help 1] [ERROR] [ERROR] To see the full stack trace of the errors, re-run Maven with the -e switch. [ERROR] Re-run Maven using the -X switch to enable full debug logging. [ERROR] [ERROR] For more information about the errors and possible solutions, please read the following articles: [ERROR] [Help 1] http://cwiki.apache.org/confluence/display/MAVEN/PluginContainerException [INFO] Closing Spring root WebApplicationContext [INFO] Shutting down log4j [INFO] stopped o.m.j.p.JettyWebAppContext{/,file:/Users/Stefan/xiaomi/cashpay-lc-oss/lc-oss/lc-oss-web/src/main/webapp/},file:/Users/Stefan/xiaomi/cashpay-lc-oss/lc-oss/lc-oss-web/src/main/webapp/ Disconnected from the target VM, address: '127.0.0.1:51838', transport: 'socket' Process finished with exit code 1 log4j的版本是1.2.16应该不是版本的问题 求好心人帮助帮我看看是什么问题
eclipse中工程启动tomcat,浏览器无法访问
[INFO] Scanning for projects... [INFO] ------------------------------------------------------------------------ [INFO] Reactor Build Order: [INFO] [INFO] taotao-manager [INFO] taotao-manager-pojo [INFO] taotao-manager-dao [INFO] taotao-manager-service [INFO] taotao-manager-web [INFO] [INFO] ------------------------------------------------------------------------ [INFO] Building taotao-manager 0.0.1-SNAPSHOT [INFO] ------------------------------------------------------------------------ [INFO] [INFO] --- maven-clean-plugin:2.5:clean (default-clean) @ taotao-manager --- [INFO] [INFO] >>> tomcat7-maven-plugin:2.2:run (default-cli) > process-classes @ taotao-manager >>> [INFO] [INFO] <<< tomcat7-maven-plugin:2.2:run (default-cli) < process-classes @ taotao-manager <<< [INFO] [INFO] --- tomcat7-maven-plugin:2.2:run (default-cli) @ taotao-manager --- [INFO] Skipping non-war project [INFO] [INFO] ------------------------------------------------------------------------ [INFO] Building taotao-manager-pojo 0.0.1-SNAPSHOT [INFO] ------------------------------------------------------------------------ [INFO] [INFO] --- maven-clean-plugin:2.5:clean (default-clean) @ taotao-manager-pojo --- [INFO] Deleting D:\gongju\eclipsemars_work\taotao-manager\taotao-manager-pojo\target [INFO] [INFO] >>> tomcat7-maven-plugin:2.2:run (default-cli) > process-classes @ taotao-manager-pojo >>> [INFO] [INFO] --- maven-resources-plugin:2.7:resources (default-resources) @ taotao-manager-pojo --- [INFO] Using 'UTF-8' encoding to copy filtered resources. [INFO] Copying 0 resource [INFO] [INFO] --- maven-compiler-plugin:3.2:compile (default-compile) @ taotao-manager-pojo --- [INFO] Changes detected - recompiling the module! [INFO] Compiling 22 source files to D:\gongju\eclipsemars_work\taotao-manager\taotao-manager-pojo\target\classes [INFO] [INFO] <<< tomcat7-maven-plugin:2.2:run (default-cli) < process-classes @ taotao-manager-pojo <<< [INFO] [INFO] --- tomcat7-maven-plugin:2.2:run (default-cli) @ taotao-manager-pojo --- [INFO] Skipping non-war project [INFO] [INFO] ------------------------------------------------------------------------ [INFO] Building taotao-manager-dao 0.0.1-SNAPSHOT [INFO] ------------------------------------------------------------------------ [INFO] [INFO] --- maven-clean-plugin:2.5:clean (default-clean) @ taotao-manager-dao --- [INFO] Deleting D:\gongju\eclipsemars_work\taotao-manager\taotao-manager-dao\target [INFO] [INFO] >>> tomcat7-maven-plugin:2.2:run (default-cli) > process-classes @ taotao-manager-dao >>> [INFO] [INFO] --- maven-resources-plugin:2.7:resources (default-resources) @ taotao-manager-dao --- [INFO] Using 'UTF-8' encoding to copy filtered resources. [INFO] Copying 11 resources [INFO] [INFO] --- maven-compiler-plugin:3.2:compile (default-compile) @ taotao-manager-dao --- [INFO] Changes detected - recompiling the module! [INFO] Compiling 11 source files to D:\gongju\eclipsemars_work\taotao-manager\taotao-manager-dao\target\classes [INFO] [INFO] <<< tomcat7-maven-plugin:2.2:run (default-cli) < process-classes @ taotao-manager-dao <<< [INFO] [INFO] --- tomcat7-maven-plugin:2.2:run (default-cli) @ taotao-manager-dao --- [INFO] Skipping non-war project [INFO] [INFO] ------------------------------------------------------------------------ [INFO] Building taotao-manager-service 0.0.1-SNAPSHOT [INFO] ------------------------------------------------------------------------ [INFO] [INFO] --- maven-clean-plugin:2.5:clean (default-clean) @ taotao-manager-service --- [INFO] Deleting D:\gongju\eclipsemars_work\taotao-manager\taotao-manager-service\target [INFO] [INFO] >>> tomcat7-maven-plugin:2.2:run (default-cli) > process-classes @ taotao-manager-service >>> [INFO] [INFO] --- maven-resources-plugin:2.7:resources (default-resources) @ taotao-manager-service --- [INFO] Using 'UTF-8' encoding to copy filtered resources. [INFO] Copying 0 resource [INFO] [INFO] --- maven-compiler-plugin:3.2:compile (default-compile) @ taotao-manager-service --- [INFO] Changes detected - recompiling the module! [INFO] Compiling 2 source files to D:\gongju\eclipsemars_work\taotao-manager\taotao-manager-service\target\classes [INFO] [INFO] <<< tomcat7-maven-plugin:2.2:run (default-cli) < process-classes @ taotao-manager-service <<< [INFO] [INFO] --- tomcat7-maven-plugin:2.2:run (default-cli) @ taotao-manager-service --- [INFO] Skipping non-war project [INFO] [INFO] ------------------------------------------------------------------------ [INFO] Building taotao-manager-web 0.0.1-SNAPSHOT [INFO] ------------------------------------------------------------------------ [INFO] [INFO] --- maven-clean-plugin:2.5:clean (default-clean) @ taotao-manager-web --- [INFO] Deleting D:\gongju\eclipsemars_work\taotao-manager\taotao-manager-web\target [INFO] [INFO] >>> tomcat7-maven-plugin:2.2:run (default-cli) > process-classes @ taotao-manager-web >>> [INFO] [INFO] --- maven-resources-plugin:2.7:resources (default-resources) @ taotao-manager-web --- [INFO] Using 'UTF-8' encoding to copy filtered resources. [INFO] Copying 7 resources [INFO] [INFO] --- maven-compiler-plugin:3.2:compile (default-compile) @ taotao-manager-web --- [INFO] Changes detected - recompiling the module! [INFO] Compiling 1 source file to D:\gongju\eclipsemars_work\taotao-manager\taotao-manager-web\target\classes [INFO] [INFO] <<< tomcat7-maven-plugin:2.2:run (default-cli) < process-classes @ taotao-manager-web <<< [INFO] [INFO] --- tomcat7-maven-plugin:2.2:run (default-cli) @ taotao-manager-web --- [INFO] Running war on http://localhost:8082/ [INFO] Creating Tomcat server configuration at D:\gongju\eclipsemars_work\taotao-manager\taotao-manager-web\target\tomcat [INFO] create webapp with contextPath: 三月 29, 2016 10:52:54 上午 org.apache.coyote.AbstractProtocol init 信息: Initializing ProtocolHandler ["http-bio-8082"] 三月 29, 2016 10:52:54 上午 org.apache.catalina.core.StandardService startInternal 信息: Starting service Tomcat 三月 29, 2016 10:52:54 上午 org.apache.catalina.core.StandardEngine startInternal 信息: Starting Servlet Engine: Apache Tomcat/7.0.47 三月 29, 2016 10:52:58 上午 org.apache.catalina.core.ApplicationContext log 信息: No Spring WebApplicationInitializer types detected on classpath 三月 29, 2016 10:52:58 上午 org.apache.catalina.core.ApplicationContext log 信息: Initializing Spring root WebApplicationContext log4j:WARN No appenders could be found for logger (org.springframework.web.context.ContextLoader). log4j:WARN Please initialize the log4j system properly. log4j:WARN See http://logging.apache.org/log4j/1.2/faq.html#noconfig for more info.
.NoClassDefFoundError: org/eclipse/jdt/internal/compiler/ast/Expression
项目是struts2.3.15+spring3,搭建后,用jetty正常启动后,访问jsp时Caused by: java.lang.ClassNotFoundException: org.eclipse.jdt.internal.compiler.ast.Expression的问题。 部分maven配置: <!-- JSP support configured --> <dependency> <groupId>org.mortbay.jetty</groupId> <artifactId>jetty</artifactId> <version>${jetty.version}</version> </dependency> <dependency> <groupId>org.mortbay.jetty</groupId> <artifactId>jsp-2.1-jetty</artifactId> <version>${jetty.version}</version> </dependency> <dependency> <groupId>org.mortbay.jetty</groupId> <artifactId>jsp-2.1-glassfish</artifactId> <version>2.1.v20091210</version> </dependency> <dependency> <groupId>org.mortbay.jetty</groupId> <artifactId>jsp-api-2.1-glassfish</artifactId> <version>2.1.v20091210</version> </dependency> </dependencies> <properties> <jetty.version>6.1.26</jetty.version> </properties> <!-- jetty --> <plugin> <groupId>org.mortbay.jetty</groupId> <artifactId>maven-jetty-plugin</artifactId> <version>${jetty.version}</version> <configuration> <!-- Log to the console. --> <requestLog implementation="org.mortbay.jetty.NCSARequestLog"> <!-- This doesn't do anything for Jetty, but is a workaround for a Maven bug that prevents the requestLog from being set. --> <append>true</append> </requestLog> <scanIntervalSeconds>10</scanIntervalSeconds> <scanTargets> <scanTarget>src/main/java</scanTarget> <scanTarget>src/main/webapp/WEB-INF</scanTarget> <scanTarget>src/main/resources</scanTarget> </scanTargets> 求解,是jetty版本过低导致的么? servlet版本是2.5 用的IDE是eclipse3.6 求解 谢谢各位大大
springboot 多模块打包war,tomcat启动提示找不到配置文件
新项目使用springboot maven module方式新建了多个子模块,(多个)web,service,dao,entity,util、storage。其中web依赖entity、service、util、storage。 uitl模块中有个ConfigUtil.java @Component @ConfigurationProperties @PropertySource(value = "classpath:config.properties",encoding = "utf-8") public class ConfigUtil { ...... } 其中config.properties文件放在util模块的resources文件夹下。 在将其中一个web项目打包成war时,在tomcat中启动时提示找不到config.properties ![图片说明](https://img-ask.csdn.net/upload/202001/20/1579522003_255875.png) 下面是uitl模块的pom文件 ``` <?xml version="1.0"?> <project xsi:schemaLocation="http://maven.apache.org/POM/4.0.0 http://maven.apache.org/xsd/maven-4.0.0.xsd" xmlns="http://maven.apache.org/POM/4.0.0" xmlns:xsi="http://www.w3.org/2001/XMLSchema-instance"> <modelVersion>4.0.0</modelVersion> <parent> <groupId>com.zjyc.dsy</groupId> <artifactId>dsy-al</artifactId> <version>0.0.1-SNAPSHOT</version> </parent> <groupId>com.zjyc.dsy.util</groupId> <artifactId>dsy-util</artifactId> <name>dsy-util</name> <packaging>jar</packaging> <properties> <project.build.sourceEncoding>UTF-8</project.build.sourceEncoding> </properties> <dependencies> <dependency> <groupId>artemis</groupId> <artifactId>artemis-lib</artifactId> <version>1.0</version> <scope>system</scope> <systemPath>${project.basedir}/src/main/resources/jar/artemis-http-client-1.0-SNAPSHOT.jar</systemPath> </dependency> </dependencies> <build> <resources> <resource> <directory>src/main/java</directory> <includes> <include>**/*.properties</include> </includes> <!-- resource的filtering属性用来表示资源文件中的占位符是否需要被替换,true为需要替换。 --> <filtering>false</filtering> </resource> <resource> <directory>src/main/resources</directory> <includes> <include>**/*</include> </includes> <filtering>false</filtering> </resource> </resources> </build> </project> ``` 下面是web模块的pom ``` <?xml version="1.0"?> <project xsi:schemaLocation="http://maven.apache.org/POM/4.0.0 http://maven.apache.org/xsd/maven-4.0.0.xsd" xmlns="http://maven.apache.org/POM/4.0.0" xmlns:xsi="http://www.w3.org/2001/XMLSchema-instance"> <modelVersion>4.0.0</modelVersion> <packaging>war</packaging> <parent> <groupId>com.zjyc.dsy</groupId> <artifactId>dsy-al</artifactId> <version>0.0.1-SNAPSHOT</version> <relativePath>../pom.xml</relativePath> </parent> <groupId>com.zjyc.dsy.web</groupId> <artifactId>dsy-web</artifactId> <name>dsy-web</name> <url>http://maven.apache.org</url> <properties> <project.build.sourceEncoding>UTF-8</project.build.sourceEncoding> </properties> <dependencies> <dependency> <groupId>com.zjyc.dsy.entity</groupId> <artifactId>dsy-entity</artifactId> <version>0.0.1-SNAPSHOT</version> </dependency> <dependency> <groupId>com.zjyc.dsy.service</groupId> <artifactId>dsy-service</artifactId> <version>0.0.1-SNAPSHOT</version> </dependency> <dependency> <groupId>com.zjyc.dsy.util</groupId> <artifactId>dsy-util</artifactId> <version>0.0.1-SNAPSHOT</version> </dependency> <dependency> <groupId>com.zjyc.dsy.storage</groupId> <artifactId>dsy-storage</artifactId> <version>0.0.1-SNAPSHOT</version> </dependency> <!-- https://mvnrepository.com/artifact/javax.servlet/javax.servlet-api --> <dependency> <groupId>javax.servlet</groupId> <artifactId>javax.servlet-api</artifactId> <version>4.0.1</version> <scope>provided</scope> </dependency> <dependency> <groupId>org.springframework.boot</groupId> <artifactId>spring-boot-starter-tomcat</artifactId> <scope>provided</scope> </dependency> </dependencies> <build> <plugins> <plugin> <groupId>org.springframework.boot</groupId> <artifactId>spring-boot-maven-plugin</artifactId> </plugin> <!-- 引入java编译器插件 --> <plugin> <groupId>org.apache.maven.plugins</groupId> <artifactId>maven-compiler-plugin</artifactId> <configuration> <source>1.8</source> <target>1.8</target> <compilerVersion>1.8</compilerVersion> <encoding>UTF-8</encoding> </configuration> </plugin> <!-- 资源文件拷贝插件 --> <plugin> <groupId>org.apache.maven.plugins</groupId> <artifactId>maven-resources-plugin</artifactId> <configuration> <encoding>UTF-8</encoding> </configuration> </plugin> <plugin> <groupId>org.apache.maven.plugins</groupId> <artifactId>maven-dependency-plugin</artifactId> <executions> <execution> <id>unpack</id> <phase>generate-resources</phase> <goals> <goal>unpack</goal> </goals> <configuration> <artifactItems> <artifactItem> <groupId>com.zjyc.dsy.util</groupId> <artifactId>dsy-util</artifactId> <version>0.0.1-SNAPSHOT</version> <type>jar</type> <overWrite>true</overWrite> <outputDirectory>${project.build.directory}/classes</outputDirectory> </artifactItem> </artifactItems> </configuration> </execution> </executions> </plugin> </plugins> <pluginManagement> <plugins> <!--This plugin's configuration is used to store Eclipse m2e settings only. It has no influence on the Maven build itself.--> <plugin> <groupId>org.eclipse.m2e</groupId> <artifactId>lifecycle-mapping</artifactId> <version>1.0.0</version> <configuration> <lifecycleMappingMetadata> <pluginExecutions> <pluginExecution> <pluginExecutionFilter> <groupId> org.apache.maven.plugins </groupId> <artifactId> maven-dependency-plugin </artifactId> <versionRange> [2.1,) </versionRange> <goals> <goal>unpack</goal> </goals> </pluginExecutionFilter> <action> <ignore></ignore> </action> </pluginExecution> </pluginExecutions> </lifecycleMappingMetadata> </configuration> </plugin> </plugins> </pluginManagement> <resources> <resource> <directory>${project.basedir}/src/main/resources</directory> <excludes> <exclude>**/*.properties</exclude> </excludes> </resource> </resources> </build> </project> ``` 下面是war解压之后classes的目录结构 ![图片说明](https://img-ask.csdn.net/upload/202001/20/1579522257_42080.png) tomcat启动报错代码 ``` 20-Jan-2020 19:55:46.409 警告 [main] org.apache.catalina.startup.SetAllPropertiesRule.begin [SetAllPropertiesRule]{Server/Service/Connector} Setting property 'maxSpareThreads' to '500' did not find a matching property. 20-Jan-2020 19:55:46.534 信息 [main] org.apache.catalina.startup.VersionLoggerListener.log Server version: Apache Tomcat/9.0.6 20-Jan-2020 19:55:46.534 信息 [main] org.apache.catalina.startup.VersionLoggerListener.log Server built: Mar 5 2018 09:34:35 UTC 20-Jan-2020 19:55:46.534 信息 [main] org.apache.catalina.startup.VersionLoggerListener.log Server number: 9.0.6.0 20-Jan-2020 19:55:46.534 信息 [main] org.apache.catalina.startup.VersionLoggerListener.log OS Name: Windows Server 2008 R2 20-Jan-2020 19:55:46.534 信息 [main] org.apache.catalina.startup.VersionLoggerListener.log OS Version: 6.1 20-Jan-2020 19:55:46.534 信息 [main] org.apache.catalina.startup.VersionLoggerListener.log Architecture: amd64 20-Jan-2020 19:55:46.534 信息 [main] org.apache.catalina.startup.VersionLoggerListener.log Java Home: C:\Program Files\Java\jdk1.8.0_161\jre 20-Jan-2020 19:55:46.534 信息 [main] org.apache.catalina.startup.VersionLoggerListener.log JVM Version: 1.8.0_161-b12 20-Jan-2020 19:55:46.534 信息 [main] org.apache.catalina.startup.VersionLoggerListener.log JVM Vendor: Oracle Corporation 20-Jan-2020 19:55:46.534 信息 [main] org.apache.catalina.startup.VersionLoggerListener.log CATALINA_BASE: E:\apache-tomcat-9 20-Jan-2020 19:55:46.534 信息 [main] org.apache.catalina.startup.VersionLoggerListener.log CATALINA_HOME: E:\apache-tomcat-9 20-Jan-2020 19:55:46.534 信息 [main] org.apache.catalina.startup.VersionLoggerListener.log Command line argument: -Djava.util.logging.config.file=E:\apache-tomcat-9\conf\logging.properties 20-Jan-2020 19:55:46.534 信息 [main] org.apache.catalina.startup.VersionLoggerListener.log Command line argument: -Djava.util.logging.manager=org.apache.juli.ClassLoaderLogManager 20-Jan-2020 19:55:46.534 信息 [main] org.apache.catalina.startup.VersionLoggerListener.log Command line argument: -Djdk.tls.ephemeralDHKeySize=2048 20-Jan-2020 19:55:46.534 信息 [main] org.apache.catalina.startup.VersionLoggerListener.log Command line argument: -Djava.protocol.handler.pkgs=org.apache.catalina.webresources 20-Jan-2020 19:55:46.534 信息 [main] org.apache.catalina.startup.VersionLoggerListener.log Command line argument: -Dignore.endorsed.dirs= 20-Jan-2020 19:55:46.534 信息 [main] org.apache.catalina.startup.VersionLoggerListener.log Command line argument: -Dcatalina.base=E:\apache-tomcat-9 20-Jan-2020 19:55:46.550 信息 [main] org.apache.catalina.startup.VersionLoggerListener.log Command line argument: -Dcatalina.home=E:\apache-tomcat-9 20-Jan-2020 19:55:46.550 信息 [main] org.apache.catalina.startup.VersionLoggerListener.log Command line argument: -Djava.io.tmpdir=E:\apache-tomcat-9\temp 20-Jan-2020 19:55:46.550 信息 [main] org.apache.catalina.core.AprLifecycleListener.lifecycleEvent Loaded APR based Apache Tomcat Native library [1.2.16] using APR version [1.6.3]. 20-Jan-2020 19:55:46.550 信息 [main] org.apache.catalina.core.AprLifecycleListener.lifecycleEvent APR capabilities: IPv6 [true], sendfile [true], accept filters [false], random [true]. 20-Jan-2020 19:55:46.550 信息 [main] org.apache.catalina.core.AprLifecycleListener.lifecycleEvent APR/OpenSSL configuration: useAprConnector [false], useOpenSSL [true] 20-Jan-2020 19:55:47.440 信息 [main] org.apache.catalina.core.AprLifecycleListener.initializeSSL OpenSSL successfully initialized [OpenSSL 1.0.2m 2 Nov 2017] 20-Jan-2020 19:55:47.565 信息 [main] org.apache.coyote.AbstractProtocol.init Initializing ProtocolHandler ["http-nio-80"] 20-Jan-2020 19:55:47.612 信息 [main] org.apache.tomcat.util.net.NioSelectorPool.getSharedSelector Using a shared selector for servlet write/read 20-Jan-2020 19:55:47.628 信息 [main] org.apache.coyote.AbstractProtocol.init Initializing ProtocolHandler ["ajp-nio-7778"] 20-Jan-2020 19:55:47.628 信息 [main] org.apache.tomcat.util.net.NioSelectorPool.getSharedSelector Using a shared selector for servlet write/read 20-Jan-2020 19:55:47.628 信息 [main] org.apache.catalina.startup.Catalina.load Initialization processed in 1553 ms 20-Jan-2020 19:55:47.659 信息 [main] org.apache.catalina.core.StandardService.startInternal Starting service [Catalina] 20-Jan-2020 19:55:47.659 信息 [main] org.apache.catalina.core.StandardEngine.startInternal Starting Servlet Engine: Apache Tomcat/9.0.6 20-Jan-2020 19:55:47.675 信息 [main] org.apache.catalina.startup.HostConfig.deployWAR Deploying web application archive [E:\apache-tomcat-9\webapps\dsy-web-0.0.1-SNAPSHOT.war] 20-Jan-2020 19:55:50.815 信息 [main] org.apache.jasper.servlet.TldScanner.scanJars At least one JAR was scanned for TLDs yet contained no TLDs. Enable debug logging for this logger for a complete list of JARs that were scanned but no TLDs were found in them. Skipping unneeded JARs during scanning can improve startup time and JSP compilation time. 20-Jan-2020 19:55:52.456 严重 [main] org.apache.catalina.core.ContainerBase.addChildInternal ContainerBase.addChild: start: org.apache.catalina.LifecycleException: Failed to start component [StandardEngine[Catalina].StandardHost[localhost].StandardContext[/dsy-web-0.0.1-SNAPSHOT]] at org.apache.catalina.util.LifecycleBase.handleSubClassException(LifecycleBase.java:441) at org.apache.catalina.util.LifecycleBase.start(LifecycleBase.java:198) at org.apache.catalina.core.ContainerBase.addChildInternal(ContainerBase.java:742) at org.apache.catalina.core.ContainerBase.addChild(ContainerBase.java:718) at org.apache.catalina.core.StandardHost.addChild(StandardHost.java:703) at org.apache.catalina.startup.HostConfig.deployWAR(HostConfig.java:987) at org.apache.catalina.startup.HostConfig$DeployWar.run(HostConfig.java:1858) at java.util.concurrent.Executors$RunnableAdapter.call(Executors.java:511) at java.util.concurrent.FutureTask.run(FutureTask.java:266) at org.apache.tomcat.util.threads.InlineExecutorService.execute(InlineExecutorService.java:75) at java.util.concurrent.AbstractExecutorService.submit(AbstractExecutorService.java:112) at org.apache.catalina.startup.HostConfig.deployWARs(HostConfig.java:772) at org.apache.catalina.startup.HostConfig.deployApps(HostConfig.java:426) at org.apache.catalina.startup.HostConfig.start(HostConfig.java:1586) at org.apache.catalina.startup.HostConfig.lifecycleEvent(HostConfig.java:308) at org.apache.catalina.util.LifecycleBase.fireLifecycleEvent(LifecycleBase.java:123) at org.apache.catalina.util.LifecycleBase.setStateInternal(LifecycleBase.java:424) at org.apache.catalina.util.LifecycleBase.setState(LifecycleBase.java:367) at org.apache.catalina.core.ContainerBase.startInternal(ContainerBase.java:966) at org.apache.catalina.core.StandardHost.startInternal(StandardHost.java:839) at org.apache.catalina.util.LifecycleBase.start(LifecycleBase.java:183) at org.apache.catalina.core.ContainerBase$StartChild.call(ContainerBase.java:1427) at org.apache.catalina.core.ContainerBase$StartChild.call(ContainerBase.java:1417) at java.util.concurrent.FutureTask.run(FutureTask.java:266) at org.apache.tomcat.util.threads.InlineExecutorService.execute(InlineExecutorService.java:75) at java.util.concurrent.AbstractExecutorService.submit(AbstractExecutorService.java:134) at org.apache.catalina.core.ContainerBase.startInternal(ContainerBase.java:943) at org.apache.catalina.core.StandardEngine.startInternal(StandardEngine.java:258) at org.apache.catalina.util.LifecycleBase.start(LifecycleBase.java:183) at org.apache.catalina.core.StandardService.startInternal(StandardService.java:422) at org.apache.catalina.util.LifecycleBase.start(LifecycleBase.java:183) at org.apache.catalina.core.StandardServer.startInternal(StandardServer.java:770) at org.apache.catalina.util.LifecycleBase.start(LifecycleBase.java:183) at org.apache.catalina.startup.Catalina.start(Catalina.java:682) at sun.reflect.NativeMethodAccessorImpl.invoke0(Native Method) at sun.reflect.NativeMethodAccessorImpl.invoke(NativeMethodAccessorImpl.java:62) at sun.reflect.DelegatingMethodAccessorImpl.invoke(DelegatingMethodAccessorImpl.java:43) at java.lang.reflect.Method.invoke(Method.java:498) at org.apache.catalina.startup.Bootstrap.start(Bootstrap.java:353) at org.apache.catalina.startup.Bootstrap.main(Bootstrap.java:493) Caused by: org.springframework.beans.factory.BeanDefinitionStoreException: Failed to parse configuration class [com.zjyc.dsy.web.App]; nested exception is java.io.FileNotFoundException: Could not open ServletContext resource [/config.properties] at org.springframework.context.annotation.ConfigurationClassParser.parse(ConfigurationClassParser.java:184) at org.springframework.context.annotation.ConfigurationClassPostProcessor.processConfigBeanDefinitions(ConfigurationClassPostProcessor.java:325) at org.springframework.context.annotation.ConfigurationClassPostProcessor.postProcessBeanDefinitionRegistry(ConfigurationClassPostProcessor.java:242) at org.springframework.context.support.PostProcessorRegistrationDelegate.invokeBeanDefinitionRegistryPostProcessors(PostProcessorRegistrationDelegate.java:275) at org.springframework.context.support.PostProcessorRegistrationDelegate.invokeBeanFactoryPostProcessors(PostProcessorRegistrationDelegate.java:95) at org.springframework.context.support.AbstractApplicationContext.invokeBeanFactoryPostProcessors(AbstractApplicationContext.java:706) at org.springframework.context.support.AbstractApplicationContext.refresh(AbstractApplicationContext.java:532) at org.springframework.boot.web.servlet.context.ServletWebServerApplicationContext.refresh(ServletWebServerApplicationContext.java:141) at org.springframework.boot.SpringApplication.refresh(SpringApplication.java:747) at org.springframework.boot.SpringApplication.refreshContext(SpringApplication.java:397) at org.springframework.boot.SpringApplication.run(SpringApplication.java:315) at org.springframework.boot.web.servlet.support.SpringBootServletInitializer.run(SpringBootServletInitializer.java:152) at org.springframework.boot.web.servlet.support.SpringBootServletInitializer.createRootApplicationContext(SpringBootServletInitializer.java:132) at org.springframework.boot.web.servlet.support.SpringBootServletInitializer.onStartup(SpringBootServletInitializer.java:92) at org.springframework.web.SpringServletContainerInitializer.onStartup(SpringServletContainerInitializer.java:172) at org.apache.catalina.core.StandardContext.startInternal(StandardContext.java:5030) at org.apache.catalina.util.LifecycleBase.start(LifecycleBase.java:183) ... 38 more Caused by: java.io.FileNotFoundException: Could not open ServletContext resource [/config.properties] at org.springframework.web.context.support.ServletContextResource.getInputStream(ServletContextResource.java:159) at org.springframework.core.io.support.EncodedResource.getReader(EncodedResource.java:143) at org.springframework.core.io.support.PropertiesLoaderUtils.fillProperties(PropertiesLoaderUtils.java:95) at org.springframework.core.io.support.PropertiesLoaderUtils.fillProperties(PropertiesLoaderUtils.java:73) at org.springframework.core.io.support.PropertiesLoaderUtils.loadProperties(PropertiesLoaderUtils.java:59) at org.springframework.core.io.support.ResourcePropertySource.<init>(ResourcePropertySource.java:67) at org.springframework.core.io.support.DefaultPropertySourceFactory.createPropertySource(DefaultPropertySourceFactory.java:37) at org.springframework.context.annotation.ConfigurationClassParser.processPropertySource(ConfigurationClassParser.java:455) at org.springframework.context.annotation.ConfigurationClassParser.doProcessConfigurationClass(ConfigurationClassParser.java:274) at org.springframework.context.annotation.ConfigurationClassParser.processConfigurationClass(ConfigurationClassParser.java:245) at org.springframework.context.annotation.ConfigurationClassParser.parse(ConfigurationClassParser.java:194) at org.springframework.context.annotation.ConfigurationClassParser.doProcessConfigurationClass(ConfigurationClassParser.java:298) at org.springframework.context.annotation.ConfigurationClassParser.processConfigurationClass(ConfigurationClassParser.java:245) at org.springframework.context.annotation.ConfigurationClassParser.parse(ConfigurationClassParser.java:202) at org.springframework.context.annotation.ConfigurationClassParser.parse(ConfigurationClassParser.java:170) ... 54 more 20-Jan-2020 19:55:52.471 严重 [main] org.apache.catalina.startup.HostConfig.deployWAR Error deploying web application archive [E:\apache-tomcat-9\webapps\dsy-web-0.0.1-SNAPSHOT.war] java.lang.IllegalStateException: ContainerBase.addChild: start: org.apache.catalina.LifecycleException: Failed to start component [StandardEngine[Catalina].StandardHost[localhost].StandardContext[/dsy-web-0.0.1-SNAPSHOT]] at org.apache.catalina.core.ContainerBase.addChildInternal(ContainerBase.java:746) at org.apache.catalina.core.ContainerBase.addChild(ContainerBase.java:718) at org.apache.catalina.core.StandardHost.addChild(StandardHost.java:703) at org.apache.catalina.startup.HostConfig.deployWAR(HostConfig.java:987) at org.apache.catalina.startup.HostConfig$DeployWar.run(HostConfig.java:1858) at java.util.concurrent.Executors$RunnableAdapter.call(Executors.java:511) at java.util.concurrent.FutureTask.run(FutureTask.java:266) at org.apache.tomcat.util.threads.InlineExecutorService.execute(InlineExecutorService.java:75) at java.util.concurrent.AbstractExecutorService.submit(AbstractExecutorService.java:112) at org.apache.catalina.startup.HostConfig.deployWARs(HostConfig.java:772) at org.apache.catalina.startup.HostConfig.deployApps(HostConfig.java:426) at org.apache.catalina.startup.HostConfig.start(HostConfig.java:1586) at org.apache.catalina.startup.HostConfig.lifecycleEvent(HostConfig.java:308) at org.apache.catalina.util.LifecycleBase.fireLifecycleEvent(LifecycleBase.java:123) at org.apache.catalina.util.LifecycleBase.setStateInternal(LifecycleBase.java:424) at org.apache.catalina.util.LifecycleBase.setState(LifecycleBase.java:367) at org.apache.catalina.core.ContainerBase.startInternal(ContainerBase.java:966) at org.apache.catalina.core.StandardHost.startInternal(StandardHost.java:839) at org.apache.catalina.util.LifecycleBase.start(LifecycleBase.java:183) at org.apache.catalina.core.ContainerBase$StartChild.call(ContainerBase.java:1427) at org.apache.catalina.core.ContainerBase$StartChild.call(ContainerBase.java:1417) at java.util.concurrent.FutureTask.run(FutureTask.java:266) at org.apache.tomcat.util.threads.InlineExecutorService.execute(InlineExecutorService.java:75) at java.util.concurrent.AbstractExecutorService.submit(AbstractExecutorService.java:134) at org.apache.catalina.core.ContainerBase.startInternal(ContainerBase.java:943) at org.apache.catalina.core.StandardEngine.startInternal(StandardEngine.java:258) at org.apache.catalina.util.LifecycleBase.start(LifecycleBase.java:183) at org.apache.catalina.core.StandardService.startInternal(StandardService.java:422) at org.apache.catalina.util.LifecycleBase.start(LifecycleBase.java:183) at org.apache.catalina.core.StandardServer.startInternal(StandardServer.java:770) at org.apache.catalina.util.LifecycleBase.start(LifecycleBase.java:183) at org.apache.catalina.startup.Catalina.start(Catalina.java:682) at sun.reflect.NativeMethodAccessorImpl.invoke0(Native Method) at sun.reflect.NativeMethodAccessorImpl.invoke(NativeMethodAccessorImpl.java:62) at sun.reflect.DelegatingMethodAccessorImpl.invoke(DelegatingMethodAccessorImpl.java:43) at java.lang.reflect.Method.invoke(Method.java:498) at org.apache.catalina.startup.Bootstrap.start(Bootstrap.java:353) at org.apache.catalina.startup.Bootstrap.main(Bootstrap.java:493) 20-Jan-2020 19:55:52.487 信息 [main] org.apache.catalina.startup.HostConfig.deployWAR Deployment of web application archive [E:\apache-tomcat-9\webapps\dsy-web-0.0.1-SNAPSHOT.war] has finished in [4,812] ms 20-Jan-2020 19:55:52.487 信息 [main] org.apache.coyote.AbstractProtocol.start Starting ProtocolHandler ["http-nio-80"] 20-Jan-2020 19:55:52.503 信息 [main] org.apache.coyote.AbstractProtocol.start Starting ProtocolHandler ["ajp-nio-7778"] 20-Jan-2020 19:55:52.518 信息 [main] org.apache.catalina.startup.Catalina.start Server startup in 4881 ms ```
webmgic的应用——新手上路
我的eclipse搭载的maven,所有的配置好了,参考webmagic作者写的文档开始了爬虫的编写,看了黄勇的《maven那点事》, 他让新建的一些文档也都建了,pom里的坐标也添加了,但是这里有点问题,<artifactId></artifactId>之间的东西全都有红色波浪线,包括新添加的webmagic的坐标也是。 我直接copy的webmagic作者的代码,代码放在了src/main的目录下面,代码没显示任何错误 运行只有并没有像作者那样,控制台显示抓取的结果,而是出现了下面的情况。 SLF4J: Failed to load class "org.slf4j.impl.StaticLoggerBinder". SLF4J: Defaulting to no-operation (NOP) logger implementation SLF4J: See http://www.slf4j.org/codes.html#StaticLoggerBinder for further details. [INFO] Scanning for projects... [INFO] [INFO] ------------------------------------------------------------------------ [INFO] Building webspider 0.0.1-SNAPSHOT [INFO] ------------------------------------------------------------------------ [INFO] [INFO] --- maven-resources-plugin:2.5:resources (default-resources) @ webs pider --- [debug] execute contextualize [INFO] Using 'UTF-8' encoding to copy filtered resources. [INFO] skip non existing resourceDirectory D:\Users\Administrator\workspace\webspider\src\main\resources [INFO] [INFO] --- maven-compiler-plugin:2.3.2:compile (default-compile) @ webspider --- [INFO] Nothing to compile - all classes are up to date [INFO] ------------------------------------------------------------------------ [INFO] BUILD SUCCESS [INFO] ------------------------------------------------------------------------ [INFO] Total time: 12.209s [INFO] Finished at: Fri Jul 15 20:04:17 CST 2016 [INFO] Final Memory: 5M/15M [INFO] ------------------------------------------------------------------------ ``` ```
终于明白阿里百度这样的大公司,为什么面试经常拿ThreadLocal考验求职者了
点击上面↑「爱开发」关注我们每晚10点,捕获技术思考和创业资源洞察什么是ThreadLocalThreadLocal是一个本地线程副本变量工具类,各个线程都拥有一份线程私有的数
win10系统安装教程(U盘PE+UEFI安装)
一、准备工作 u盘,电脑一台,win10原版镜像(msdn官网) 二、下载wepe工具箱  极力推荐微pe(微pe官方下载) 下载64位的win10 pe,使用工具箱制作启动U盘打开软件,   选择安装到U盘(按照操作无需更改) 三、重启进入pe系统   1、关机后,将U盘插入电脑 2、按下电源后,按住F12进入启动项选择(技嘉主板是F12)     选择需要启
程序员必须掌握的核心算法有哪些?
由于我之前一直强调数据结构以及算法学习的重要性,所以就有一些读者经常问我,数据结构与算法应该要学习到哪个程度呢?,说实话,这个问题我不知道要怎么回答你,主要取决于你想学习到哪些程度,不过针对这个问题,我稍微总结一下我学过的算法知识点,以及我觉得值得学习的算法。这些算法与数据结构的学习大多数是零散的,并没有一本把他们全部覆盖的书籍。下面是我觉得值得学习的一些算法以及数据结构,当然,我也会整理一些看过
《奇巧淫技》系列-python!!每天早上八点自动发送天气预报邮件到QQ邮箱
将代码部署服务器,每日早上定时获取到天气数据,并发送到邮箱。 也可以说是一个小人工智障。 思路可以运用在不同地方,主要介绍的是思路。
Nginx 软件层面加强Nginx性能优化的面试问答和解决方案
Nginx 软件层面加强Nginx性能优化的面试问答和解决方案 去年我去爱卡汽车面试PHP,一轮和二轮面的都不错,在三轮面到Nginx的时候很多问题当时不知道怎么回答,确实没有深入学习过,花了一段时间的学习,终于能解答Nginx高性能优化的问题了,10月24号为了获得程序员勋章,发布了半个优化笔记,浏览到了1000+,受到这个鼓舞,我抽时间在仔细整理下关于Nginx性能优化的问题,我们从软件说起。...
【管理系统课程设计】美少女手把手教你后台管理
【文章后台管理系统】URL设计与建模分析+项目源码+运行界面 栏目管理、文章列表、用户管理、角色管理、权限管理模块(文章最后附有源码) 1. 这是一个什么系统? 1.1 学习后台管理系统的原因 随着时代的变迁,现如今各大云服务平台横空出世,市面上有许多如学生信息系统、图书阅读系统、停车场管理系统等的管理系统,而本人家里就有人在用烟草销售系统,直接在网上完成挑选、购买与提交收货点,方便又快捷。 试想,若没有烟草销售系统,本人家人想要购买烟草,还要独自前往药...
11月19日科技资讯|华为明日发布鸿蒙整体战略;京东宣告全面向技术转型;Kotlin 1.3.60 发布
「极客头条」—— 技术人员的新闻圈! CSDN 的读者朋友们早上好哇,「极客头条」来啦,快来看今天都有哪些值得我们技术人关注的重要新闻吧。扫描上方二维码进入 CSDN App 可以收听御姐萌妹 Style 的人工版音频哟。 一分钟速览新闻点! 6G 专家组成员:速率是 5G 的 10 至 100 倍,预计 2030 年商用 雷军:很多人多次劝我放弃WPS,能坚持下来并不是纯粹的商业决定 ...
C语言魔塔游戏
很早就很想写这个,今天终于写完了。 游戏截图: 编译环境: VS2017 游戏需要一些图片,如果有想要的或者对游戏有什么看法的可以加我的QQ 2985486630 讨论,如果暂时没有回应,可以在博客下方留言,到时候我会看到。 下面我来介绍一下游戏的主要功能和实现方式 首先是玩家的定义,使用结构体,这个名字是可以自己改变的 struct gamerole { char n
化繁为简 - 腾讯计费高一致TDXA的实践之路
导语:腾讯计费是孵化于支撑腾讯内部业务千亿级营收的互联网计费平台,在如此庞大的业务体量下,腾讯计费要支撑业务的快速增长,同时还要保证每笔交易不错账。采用最终一致性或离线补...
Python爬虫爬取淘宝,京东商品信息
小编是一个理科生,不善长说一些废话。简单介绍下原理然后直接上代码。 使用的工具(Python+pycharm2019.3+selenium+xpath+chromedriver)其中要使用pycharm也可以私聊我selenium是一个框架可以通过pip下载 pip install selenium -i https://pypi.tuna.tsinghua.edu.cn/simple/ 
Java学习笔记(七十二)—— Cookie
概述 会话技术: 会话:一次会话中包含多次请求和响应 一次会话:浏览器第一次给服务器发送资源请求,会话建立,直到有一方断开为止 功能:在一次会话的范围内的多次请求间,共享数据 方式: 客户端会话技术:Cookie,把数据存储到客户端 服务器端会话技术:Session,把数据存储到服务器端 Cookie 概念:客户端会话技术,将数据存储到客户端 快速入门: 使用步骤: 创建C
阿里程序员写了一个新手都写不出的低级bug,被骂惨了。
这种新手都不会范的错,居然被一个工作好几年的小伙子写出来,差点被当场开除了。
Java工作4年来应聘要16K最后没要,细节如下。。。
前奏: 今天2B哥和大家分享一位前几天面试的一位应聘者,工作4年26岁,统招本科。 以下就是他的简历和面试情况。 基本情况: 专业技能: 1、&nbsp;熟悉Sping了解SpringMVC、SpringBoot、Mybatis等框架、了解SpringCloud微服务 2、&nbsp;熟悉常用项目管理工具:SVN、GIT、MAVEN、Jenkins 3、&nbsp;熟悉Nginx、tomca
2020年,冯唐49岁:我给20、30岁IT职场年轻人的建议
点击“技术领导力”关注∆  每天早上8:30推送 作者| Mr.K   编辑| Emma 来源| 技术领导力(ID:jishulingdaoli) 前天的推文《冯唐:职场人35岁以后,方法论比经验重要》,收到了不少读者的反馈,觉得挺受启发。其实,冯唐写了不少关于职场方面的文章,都挺不错的。可惜大家只记住了“春风十里不如你”、“如何避免成为油腻腻的中年人”等不那么正经的文章。 本文整理了冯
程序员该看的几部电影
##1、骇客帝国(1999) 概念:在线/离线,递归,循环,矩阵等 剧情简介: 不久的将来,网络黑客尼奥对这个看似正常的现实世界产生了怀疑。 他结识了黑客崔妮蒂,并见到了黑客组织的首领墨菲斯。 墨菲斯告诉他,现实世界其实是由一个名叫“母体”的计算机人工智能系统控制,人们就像他们饲养的动物,没有自由和思想,而尼奥就是能够拯救人类的救世主。 可是,救赎之路从来都不会一帆风顺,到底哪里才是真实的世界?
作为一个程序员,CPU的这些硬核知识你必须会!
CPU对每个程序员来说,是个既熟悉又陌生的东西? 如果你只知道CPU是中央处理器的话,那可能对你并没有什么用,那么作为程序员的我们,必须要搞懂的就是CPU这家伙是如何运行的,尤其要搞懂它里面的寄存器是怎么一回事,因为这将让你从底层明白程序的运行机制。 随我一起,来好好认识下CPU这货吧 把CPU掰开来看 对于CPU来说,我们首先就要搞明白它是怎么回事,也就是它的内部构造,当然,CPU那么牛的一个东
@程序员,如何花式构建线程?
作者 |曾建责编 | 郭芮出品 | CSDN(ID:CSDNnews)在项目和业务的开发中,我们难免要经常使用线程来进行业务处理,使用线程可以保证我们的业务在相互处理之间可以保证原子性...
破14亿,Python分析我国存在哪些人口危机!
2020年1月17日,国家统计局发布了2019年国民经济报告,报告中指出我国人口突破14亿。 猪哥的朋友圈被14亿人口刷屏,但是很多人并没有看到我国复杂的人口问题:老龄化、男女比例失衡、生育率下降、人口红利下降等。 今天我们就来分析一下我们国家的人口数据吧! 一、背景 1.人口突破14亿 2020年1月17日,国家统计局发布了 2019年国民经济报告 ,报告中指出:年末中国大陆总人口(包括31个
强烈推荐10本程序员在家读的书
很遗憾,这个鼠年春节注定是刻骨铭心的,新型冠状病毒让每个人的神经都是紧绷的。那些处在武汉的白衣天使们,尤其值得我们的尊敬。而我们这些窝在家里的程序员,能不外出就不外出,就是对社会做出的最大的贡献。 有些读者私下问我,窝了几天,有点颓丧,能否推荐几本书在家里看看。我花了一天的时间,挑选了 10 本我最喜欢的书,你可以挑选感兴趣的来读一读。读书不仅可以平复恐惧的压力,还可以对未来充满希望,毕竟苦难终
Linux自学篇——linux命令英文全称及解释
man: Manual 意思是手册,可以用这个命令查询其他命令的用法。 pwd:Print working directory 显示当前目录 su:Swith user 切换用户,切换到root用户 cd:Change directory 切换目录 ls:List files 列出目录下的文件 ps:Process Status 进程状态 mk
Python实战:抓肺炎疫情实时数据,画2019-nCoV疫情地图
文章目录1. 前言2. 数据下载3. 数据处理4. 数据可视化 1. 前言 今天,群里白垩老师问如何用python画武汉肺炎疫情地图。白垩老师是研究海洋生态与地球生物的学者,国家重点实验室成员,于不惑之年学习python,实为我等学习楷模。先前我并没有关注武汉肺炎的具体数据,也没有画过类似的数据分布图。于是就拿了两个小时,专门研究了一下,遂成此文。 2月6日追记:本文发布后,腾讯的数据源多次变更u
智力题(程序员面试经典)
NO.1  有20瓶药丸,其中19瓶装有1克/粒的药丸,余下一瓶装有1.1克/粒的药丸。给你一台称重精准的天平,怎么找出比较重的那瓶药丸?天平只能用一次。 解法 有时候,严格的限制条件有可能反倒是解题的线索。在这个问题中,限制条件是天平只能用一次。 因为天平只能用一次,我们也得以知道一个有趣的事实:一次必须同时称很多药丸,其实更准确地说,是必须从19瓶拿出药丸进行称重。否则,如果跳过两瓶或更多瓶药
在家远程办公效率低?那你一定要收好这个「在家办公」神器!
相信大家都已经收到国务院延长春节假期的消息,接下来,在家远程办公可能将会持续一段时间。 但是问题来了。远程办公不是人在电脑前就当坐班了,相反,对于沟通效率,文件协作,以及信息安全都有着极高的要求。有着非常多的挑战,比如: 1在异地互相不见面的会议上,如何提高沟通效率? 2文件之间的来往反馈如何做到及时性?如何保证信息安全? 3如何规划安排每天工作,以及如何进行成果验收? ......
作为一个程序员,内存和磁盘的这些事情,你不得不知道啊!!!
截止目前,我已经分享了如下几篇文章: 一个程序在计算机中是如何运行的?超级干货!!! 作为一个程序员,CPU的这些硬核知识你必须会! 作为一个程序员,内存的这些硬核知识你必须懂! 这些知识可以说是我们之前都不太重视的基础知识,可能大家在上大学的时候都学习过了,但是嘞,当时由于老师讲解的没那么有趣,又加上这些知识本身就比较枯燥,所以嘞,大家当初几乎等于没学。 再说啦,学习这些,也看不出来有什么用啊!
2020年的1月,我辞掉了我的第一份工作
其实,这篇文章,我应该早点写的,毕竟现在已经2月份了。不过一些其它原因,或者是我的惰性、还有一些迷茫的念头,让自己迟迟没有试着写一点东西,记录下,或者说是总结下自己前3年的工作上的经历、学习的过程。 我自己知道的,在写自己的博客方面,我的文笔很一般,非技术类的文章不想去写;另外我又是一个还比较热衷于技术的人,而平常复杂一点的东西,如果想写文章写的清楚点,是需要足够...
别低估自己的直觉,也别高估自己的智商
所有群全部吵翻天,朋友圈全部沦陷,公众号疯狂转发。这两周没怎么发原创,只发新闻,可能有人注意到了。我不是懒,是文章写了却没发,因为大家的关注力始终在这次的疫情上面,发了也没人看。当然,我...
Java坑人面试题系列: 包装类(中级难度)
Java Magazine上面有一个专门坑人的面试题系列: https://blogs.oracle.com/javamagazine/quiz-2。 这些问题的设计宗旨,主要是测试面试者对Java语言的了解程度,而不是为了用弯弯绕绕的手段把面试者搞蒙。 如果你看过往期的问题,就会发现每一个都不简单。 这些试题模拟了认证考试中的一些难题。 而 “中级(intermediate)” 和 “高级(ad
Spring Boot 2.x基础教程:使用JdbcTemplate访问MySQL数据库
在第2章节中,我们介绍了如何通过Spring Boot来实现HTTP接口,以及围绕HTTP接口相关的单元测试、文档生成等实用技能。但是,这些内容还不足以帮助我们构建一个动态应用的服务端程序。不论我们是要做App、小程序、还是传统的Web站点,对于用户的信息、相关业务的内容,通常都需要对其进行存储,而不是像第2章节中那样,把用户信息存储在内存中(重启就丢了!)。 对于信息的存储,现在已经有非常非常多...
基于Python的人脸自动戴口罩系统
目录 1、项目背景 2、页面设计 3、器官识别 4、退出系统 1、项目背景 2019年新型冠状病毒感染的肺炎疫情发生以来,牵动人心,举国哀痛,口罩、酒精、消毒液奇货可居。 抢不到口罩,怎么办?作为技术人今天分享如何使用Python实现自动戴口罩系统,来安慰自己,系统效果如下所示: 本系统的实现原理是借助 Dlib模块的Landmark人脸68个关键点检测库轻松识别出人脸五官
这个世界上人真的分三六九等,你信吗?
偶然间,在知乎上看到一个问题 一时间,勾起了我深深的回忆。 以前在厂里打过两次工,做过家教,干过辅导班,做过中介。零下几度的晚上,贴过广告,满脸、满手地长冻疮。   再回首那段岁月,虽然苦,但让我学会了坚持和忍耐。让我明白了,在这个世界上,无论环境多么的恶劣,只要心存希望,星星之火,亦可燎原。   下文是原回答,希望能对你能有所启发。   如果我说,这个世界上人真的分三六九等,
相关热词 c#开发的dll注册 c#的反射 c# grid绑定数据源 c#多线程怎么循环 c# 鼠标左键 c# char占位符 c# 日期比较 c#16进制转换为int c#用递归求顺序表中最大 c#小型erp源代码
立即提问