mvn help:system报错,求大神解决

[INFO] Scanning for projects...
[WARNING] The POM for org.apache.maven.plugins:maven-deploy-plugin:jar:2.7 is missing, no dependency information available
Downloading: http://acooly.wicp.net/nexus/content/groups/public/org/apache/maven/plugins/maven-site-plugin/3.3/maven-site-plugin-3.3.pom

还有一系列与这个类似的警告,最后build failuer

1个回答

jar包缺失,又连接不上仓库,所以报错,错误原因应该是网络原因

Csdn user default icon
上传中...
上传图片
插入图片
抄袭、复制答案,以达到刷声望分或其他目的的行为,在CSDN问答是严格禁止的,一经发现立刻封号。是时候展现真正的技术了!
其他相关推荐
Python+OpenCV计算机视觉

Python+OpenCV计算机视觉

mvn help:system报错 No plugin

[ERROR] No plugin found for prefix 'help' in the current project and in the plugin groups [org.apache.maven.plugins, org.codehaus.mojo] available from the repositories [local (C:\Users\admin\.m2\repository), centralMirror (http://localhost/nexus/content/groups/public/)] -> [Help 1] [ERROR] [ERROR] To see the full stack trace of the errors, re-run Maven with the -e switch. [ERROR] Re-run Maven using the -X switch to enable full debug logging. [ERROR]

maven 下载失败 在cmd中输入mvn help:system

![图片说明](https://img-ask.csdn.net/upload/201512/10/1449725257_622731.jpg)

Mvn-help:systemn命令,maven 配置没问题,百度也没出现过这种错误,无语了,,,,

大神求教,,,,,,,,,,,,,,,,,,,,,,,,,,![图片说明](https://img-ask.csdn.net/upload/201706/15/1497466666_405035.png)

执行mvn sonar:sonar报错

[ERROR] Failed to execute goal org.sonarsource.scanner.maven:sonar-maven-plugin:3.3.0.603:sonar (default-cli) on project edu-common: Unable to register extension org.sonar.plugins.checkstyle.CheckstyleExecutor: Lorg/sonar/plugins/java/api/JavaResourceLocator;: org.sonar.plugins.java.api.JavaResourceLocator -> [Help 1] org.apache.maven.lifecycle.LifecycleExecutionException: Failed to execute goal org.sonarsource.scanner.maven:sonar-maven-plugin:3.3.0.603:sonar (default-cli) on project edu-common: Unable to register extension org.sonar.plugins.checkstyle.CheckstyleExecutor at org.apache.maven.lifecycle.internal.MojoExecutor.execute(MojoExecutor.java:212) at org.apache.maven.lifecycle.internal.MojoExecutor.execute(MojoExecutor.java:153) at org.apache.maven.lifecycle.internal.MojoExecutor.execute(MojoExecutor.java:145) at org.apache.maven.lifecycle.internal.LifecycleModuleBuilder.buildProject(LifecycleModuleBuilder.java:116) at org.apache.maven.lifecycle.internal.LifecycleModuleBuilder.buildProject(LifecycleModuleBuilder.java:80) at org.apache.maven.lifecycle.internal.builder.singlethreaded.SingleThreadedBuilder.build(SingleThreadedBuilder.java:51) at org.apache.maven.lifecycle.internal.LifecycleStarter.execute(LifecycleStarter.java:128) at org.apache.maven.DefaultMaven.doExecute(DefaultMaven.java:307) at org.apache.maven.DefaultMaven.doExecute(DefaultMaven.java:193) at org.apache.maven.DefaultMaven.execute(DefaultMaven.java:106) at org.apache.maven.cli.MavenCli.execute(MavenCli.java:863) at org.apache.maven.cli.MavenCli.doMain(MavenCli.java:288) at org.apache.maven.cli.MavenCli.main(MavenCli.java:199) at sun.reflect.NativeMethodAccessorImpl.invoke0(Native Method) at sun.reflect.NativeMethodAccessorImpl.invoke(NativeMethodAccessorImpl.java:62) at sun.reflect.DelegatingMethodAccessorImpl.invoke(DelegatingMethodAccessorImpl.java:43) at java.lang.reflect.Method.invoke(Method.java:498) at org.codehaus.plexus.classworlds.launcher.Launcher.launchEnhanced(Launcher.java:289) at org.codehaus.plexus.classworlds.launcher.Launcher.launch(Launcher.java:229) at org.codehaus.plexus.classworlds.launcher.Launcher.mainWithExitCode(Launcher.java:415) at org.codehaus.plexus.classworlds.launcher.Launcher.main(Launcher.java:356) Caused by: org.apache.maven.plugin.MojoExecutionException: Unable to register extension org.sonar.plugins.checkstyle.CheckstyleExecutor at org.sonarsource.scanner.maven.bootstrap.ExceptionHandling.handle(ExceptionHandling.java:36) at org.sonarsource.scanner.maven.bootstrap.ScannerBootstrapper.execute(ScannerBootstrapper.java:80) at org.sonarsource.scanner.maven.SonarQubeMojo.execute(SonarQubeMojo.java:139) at org.apache.maven.plugin.DefaultBuildPluginManager.executeMojo(DefaultBuildPluginManager.java:134) at org.apache.maven.lifecycle.internal.MojoExecutor.execute(MojoExecutor.java:207) ... 20 more Caused by: java.lang.IllegalStateException: Unable to register extension org.sonar.plugins.checkstyle.CheckstyleExecutor at org.sonar.core.platform.ComponentContainer.addExtension(ComponentContainer.java:248) at org.sonar.batch.bootstrap.ExtensionInstaller.doInstall(ExtensionInstaller.java:76) at org.sonar.batch.bootstrap.ExtensionInstaller.install(ExtensionInstaller.java:57) at org.sonar.batch.scan.ModuleScanContainer.addExtensions(ModuleScanContainer.java:179) at org.sonar.batch.scan.ModuleScanContainer.doBeforeStart(ModuleScanContainer.java:95) at org.sonar.core.platform.ComponentContainer.startComponents(ComponentContainer.java:140) at org.sonar.core.platform.ComponentContainer.execute(ComponentContainer.java:127) at org.sonar.batch.scan.ProjectScanContainer.scan(ProjectScanContainer.java:241) at org.sonar.batch.scan.ProjectScanContainer.scanRecursively(ProjectScanContainer.java:236) at org.sonar.batch.scan.ProjectScanContainer.doAfterStart(ProjectScanContainer.java:226) at org.sonar.core.platform.ComponentContainer.startComponents(ComponentContainer.java:142) at org.sonar.core.platform.ComponentContainer.execute(ComponentContainer.java:127) at org.sonar.batch.task.ScanTask.execute(ScanTask.java:47) at org.sonar.batch.task.TaskContainer.doAfterStart(TaskContainer.java:86) at org.sonar.core.platform.ComponentContainer.startComponents(ComponentContainer.java:142) at org.sonar.core.platform.ComponentContainer.execute(ComponentContainer.java:127) at org.sonar.batch.bootstrap.GlobalContainer.executeTask(GlobalContainer.java:106) at org.sonar.batch.bootstrapper.Batch.executeTask(Batch.java:119) at org.sonarsource.scanner.api.internal.batch.BatchIsolatedLauncher.execute(BatchIsolatedLauncher.java:63) at sun.reflect.NativeMethodAccessorImpl.invoke0(Native Method) at sun.reflect.NativeMethodAccessorImpl.invoke(NativeMethodAccessorImpl.java:62) at sun.reflect.DelegatingMethodAccessorImpl.invoke(DelegatingMethodAccessorImpl.java:43) at java.lang.reflect.Method.invoke(Method.java:498) at org.sonarsource.scanner.api.internal.IsolatedLauncherProxy.invoke(IsolatedLauncherProxy.java:60) at com.sun.proxy.$Proxy23.execute(Unknown Source) at org.sonarsource.scanner.api.EmbeddedScanner.doExecute(EmbeddedScanner.java:233) at org.sonarsource.scanner.api.EmbeddedScanner.runAnalysis(EmbeddedScanner.java:151) at org.sonarsource.scanner.maven.bootstrap.ScannerBootstrapper.execute(ScannerBootstrapper.java:77) ... 23 more Caused by: java.lang.NoClassDefFoundError: Lorg/sonar/plugins/java/api/JavaResourceLocator; at java.lang.Class.getDeclaredFields0(Native Method) at java.lang.Class.privateGetDeclaredFields(Class.java:2583) at java.lang.Class.getDeclaredFields(Class.java:1916) at org.picocontainer.injectors.AdaptingInjection$2.run(AdaptingInjection.java:217) at java.security.AccessController.doPrivileged(Native Method) at org.picocontainer.injectors.AdaptingInjection.injectionFieldAnnotated(AdaptingInjection.java:209) at org.picocontainer.injectors.AdaptingInjection.fieldAnnotatedInjectionAdapter(AdaptingInjection.java:188) at org.picocontainer.injectors.AdaptingInjection.createComponentAdapter(AdaptingInjection.java:57) at org.picocontainer.behaviors.AbstractBehaviorFactory.createComponentAdapter(AbstractBehaviorFactory.java:44) at org.picocontainer.behaviors.OptInCaching.createComponentAdapter(OptInCaching.java:45) at org.picocontainer.DefaultPicoContainer.addComponent(DefaultPicoContainer.java:536) at org.picocontainer.DefaultPicoContainer.access$300(DefaultPicoContainer.java:84) at org.picocontainer.DefaultPicoContainer$AsPropertiesPicoContainer.addComponent(DefaultPicoContainer.java:1149) at org.sonar.core.platform.ComponentContainer.addExtension(ComponentContainer.java:246) ... 50 more Caused by: java.lang.ClassNotFoundException: org.sonar.plugins.java.api.JavaResourceLocator at org.sonar.classloader.ParentFirstStrategy.loadClass(ParentFirstStrategy.java:39) at org.sonar.classloader.ClassRealm.loadClass(ClassRealm.java:87) at org.sonar.classloader.ClassRealm.loadClass(ClassRealm.java:76) ... 64 more [ERROR] [ERROR] Re-run Maven using the -X switch to enable full debug logging. [ERROR] [ERROR] For more information about the errors and possible solutions, please read the following articles: [ERROR] [Help 1] http://cwiki.apache.org/confluence/display/MAVEN/MojoExecutionException

Maven help命令报错build failure

![图片说明](https://img-ask.csdn.net/upload/201811/12/1542021051_792846.png) mvn -v成功 镜像也换过了 代理也试过了 都无法解决该问题

Maven archetype:generate报错

![图片说明](https://img-ask.csdn.net/upload/201601/25/1453700962_271806.png) 如何破之?

mvn exec:java未执行jar中的main方法问题

最近学习netty in action,第二章中执行mvn exec:java后,Server项目并未执行main方法,而是如下图所示: ![图片说明](https://img-ask.csdn.net/upload/201811/29/1543503697_235188.png) pom.xml文件如下配置: ![图片说明](https://img-ask.csdn.net/upload/201811/29/1543503771_213381.png) 请看过该书或者了解的朋友能帮忙下,多谢!!!

Maven创建项目报错,archetype:create创建报错

使用mvn archetype:create创建maven的web项目报错。 ``` mvn archetype:create -DgroupId=com.mycompany.app -DartifactId=myWebApp -DarchetypeArtifactId=maven-archetype-webapp -DinteractiveMode=false ``` 各位大神们看看什么问题呀! 然而使用mvn archetype:generate创建maven的web项目就可以顺利创建。但是所费时间较长大概40秒左右吧 错误: ![图片说明](https://img-ask.csdn.net/upload/201602/03/1454489967_604743.png)

在cmd命令行中运行tomcat时出现乱码如何解决

如下图所示,望请大神解答![图片说明](https://img-ask.csdn.net/upload/202004/15/1586947983_73349.jpg)

maven3 2个问题求解答 网上搜不到

1. maven的内置插件是在哪里定义的 有哪些内置插件 看了源码里的主pom,只有以下插件 ``` - <pluginManagement> - <!-- NOTE: These plugins will be removed from future versions of the super POM --> - <!-- They are kept for the moment as they are very unlikely to conflict with lifecycle mappings (MNG-4453) --> - <plugins> - <plugin> <artifactId>maven-antrun-plugin</artifactId> <version>1.3</version> </plugin> - <plugin> <artifactId>maven-assembly-plugin</artifactId> <version>2.2-beta-5</version> </plugin> - <plugin> <artifactId>maven-dependency-plugin</artifactId> <version>2.8</version> </plugin> - <plugin> <artifactId>maven-release-plugin</artifactId> <version>2.3.2</version> </plugin> </plugins> </pluginManagement> ``` 2、我在我自己的父pom里声明了插件 ``` <pluginManagement> <plugins> <plugin> <groupId>org.apache.maven.plugins</groupId> <artifactId>maven-compiler-plugin</artifactId> <version>2.3.2</version> <configuration> <source>1.6</source> <target>1.6</target> <encoding>UTF-8</encoding> </configuration> </plugin> <plugin> <groupId>org.apache.maven.plugins</groupId> <artifactId>maven-resources-plugin</artifactId> <version>2.5</version> <configuration> <useDefaultDelimiters>false</useDefaultDelimiters> <delimiters> <delimiter>$[*]</delimiter> </delimiters> <encoding>UTF-8</encoding> </configuration> </plugin> <plugin> <groupId>org.owasp</groupId> <artifactId>dependency-check-maven</artifactId> <executions> <execution> <goals> <goal>check</goal> </goals> </execution> </executions> <configuration> <format>xml</format> </configuration> </plugin> </plugins> </pluginManagement> ``` 但我在其他子模块中并没有用这些插件,但是这些插件还是起作用了,为什么?

使用IDEA运行maven插件没问题,使用mvn命令运行插件报错?

使用swagger2markup插件,在IDEA里可以直接运行插件,生成asciidoc文件。 ![图片说明](https://img-ask.csdn.net/upload/201902/28/1551323694_720508.png) IDEA运行的默认执行的命令: *** mvn io.github.swagger2markup:swagger2markup-maven-plugin:1.2.0:convertSwagger2markup。 因为要编写技术文档,所以我需要mvn命令,但用PowerShell执行mvn的时候就报错了。* ``` java.io.IOException: Server returned HTTP response code: 400 for URL: http://localhost:8032/v2/api-docs at sun.net.www.protocol.http.HttpURLConnection.getInputStream0(HttpURLConnection.java:1894) at sun.net.www.protocol.http.HttpURLConnection.getInputStream(HttpURLConnection.java:1492) at io.swagger.parser.util.RemoteUrl.urlToString(RemoteUrl.java:130) at io.swagger.parser.Swagger20Parser.read(Swagger20Parser.java:81) 。。。。。。。 ``` 项目是运行启动了的,8032/v2/api/docs能得到json数据

Eclipse的安装问题,请求大佬报忙解决。

java 的eclipse安装不成功 配置Java环境 ![图片说明](https://img-ask.csdn.net/upload/201907/16/1563252196_741291.gif) 然后它出现 ![图片说明](https://img-ask.csdn.net/upload/201907/16/1563252340_207994.gif) 我的电脑是64位,安装32位的eclipse可以吗? java环境配置没有问题,都能用,是不是因为存储位置不同才安装不好呢?

mvn tomcat:run启动项目运行显示的是BUILD SUCCESS没有启动tomcat

pom.xml如下: ``` <build> <plugins> <plugin> <!-- <groupId>org.eclipse.jetty</groupId> <artifactId>jetty-maven-plugin</artifactId> <version>9.3.20.v20170531</version> --> <groupId>org.apache.tomcat.maven</groupId> <artifactId>tomcat7-maven-plugin</artifactId> <version>2.2</version> </plugin> </plugins> </build> ``` 使用mvn jetty:run没问题,屏蔽jetty后换成tomcat插件 换成mvn tomcat:run或mvn tomcat7:run 就只显示BUILD SUCCESS并没有启动tomcat ![图片说明](https://img-ask.csdn.net/upload/201706/22/1498100037_830106.jpg)

idea中使用maven的聚合工程时调用同级的聚合工程install后的jar包,install没报错但是使用tomcat7:run后报错:

[INFO] Scanning for projects... [INFO] [INFO] ------------------------------------------------------------------------ [INFO] Building pinyougou-sellergoods-service 0.5-SNAPSHOT [INFO] ------------------------------------------------------------------------ [INFO] [INFO] >>> tomcat7-maven-plugin:2.2:run (default-cli) > process-classes @ pinyougou-sellergoods-service >>> [WARNING] The POM for com.pinyougou:pinyougou-dao:jar:0.5-SNAPSHOT is missing, no dependency information available [WARNING] The POM for com.pinyougou:pinyougou-sellergoods-interface:jar:0.5-SNAPSHOT is missing, no dependency information available [INFO] ------------------------------------------------------------------------ [INFO] BUILD FAILURE [INFO] ------------------------------------------------------------------------ [INFO] Total time: 0.679 s [INFO] Finished at: 2020-03-28T13:21:39+08:00 [INFO] Final Memory: 7M/155M [INFO] ------------------------------------------------------------------------ [ERROR] Failed to execute goal on project pinyougou-sellergoods-service: Could not resolve dependencies for project com.pinyougou:pinyougou-sellergoods-service:war:0.5-SNAPSHOT: The following artifacts could not be resolved: com.pinyougou:pinyougou-dao:jar:0.5-SNAPSHOT, com.pinyougou:pinyougou-sellergoods-interface:jar:0.5-SNAPSHOT: Could not find artifact com.pinyougou:pinyougou-dao:jar:0.5-SNAPSHOT -> [Help 1] [ERROR] [ERROR] To see the full stack trace of the errors, re-run Maven with the -e switch. [ERROR] Re-run Maven using the -X switch to enable full debug logging. [ERROR] [ERROR] For more information about the errors and possible solutions, please read the following articles: [ERROR] [Help 1] http://cwiki.apache.org/confluence/display/MAVEN/DependencyResolutionException Process finished with exit code 1 ![图片说明](https://img-ask.csdn.net/upload/202003/28/1585372990_947277.jpg)

maven没有报错tomcat也启动成功,但是不能访问localhost:8080,求大神指点

INFO] Scanning for projects... [INFO] ------------------------------------------------------------------------ [INFO] Reactor Build Order: [INFO] [INFO] xzytaotao-manager [INFO] xzytaotao-manager-pojo [INFO] xzytaotao-manager-dao [INFO] xzytaotao-manager-service [INFO] xzytaotao-manager-web [INFO] [INFO] ------------------------------------------------------------------------ [INFO] Building xzytaotao-manager 0.0.1-SNAPSHOT [INFO] ------------------------------------------------------------------------ [INFO] [INFO] --- maven-clean-plugin:2.4.1:clean (default-clean) @ xzytaotao-manager --- [INFO] [INFO] >>> tomcat7-maven-plugin:2.2:run (default-cli) @ xzytaotao-manager >>> [INFO] [INFO] <<< tomcat7-maven-plugin:2.2:run (default-cli) @ xzytaotao-manager <<< [INFO] [INFO] --- tomcat7-maven-plugin:2.2:run (default-cli) @ xzytaotao-manager --- [INFO] Skipping non-war project [INFO] [INFO] ------------------------------------------------------------------------ [INFO] Building xzytaotao-manager-pojo 0.0.1-SNAPSHOT [INFO] ------------------------------------------------------------------------ [INFO] [INFO] --- maven-clean-plugin:2.4.1:clean (default-clean) @ xzytaotao-manager-pojo --- [INFO] Deleting M:\Myeclipseworkspaces\xzytaotao-manager\xzytaotao-manager-pojo\target [INFO] [INFO] >>> tomcat7-maven-plugin:2.2:run (default-cli) @ xzytaotao-manager-pojo >>> [INFO] [INFO] --- maven-resources-plugin:2.7:resources (default-resources) @ xzytaotao-manager-pojo --- [INFO] Using 'UTF-8' encoding to copy filtered resources. [INFO] Copying 0 resource [INFO] [INFO] --- maven-compiler-plugin:3.2:compile (default-compile) @ xzytaotao-manager-pojo --- [INFO] Changes detected - recompiling the module! [INFO] Compiling 22 source files to M:\Myeclipseworkspaces\xzytaotao-manager\xzytaotao-manager-pojo\target\classes [INFO] [INFO] <<< tomcat7-maven-plugin:2.2:run (default-cli) @ xzytaotao-manager-pojo <<< [INFO] [INFO] --- tomcat7-maven-plugin:2.2:run (default-cli) @ xzytaotao-manager-pojo --- [INFO] Skipping non-war project [INFO] [INFO] ------------------------------------------------------------------------ [INFO] Building xzytaotao-manager-dao 0.0.1-SNAPSHOT [INFO] ------------------------------------------------------------------------ [INFO] [INFO] --- maven-clean-plugin:2.4.1:clean (default-clean) @ xzytaotao-manager-dao --- [INFO] Deleting M:\Myeclipseworkspaces\xzytaotao-manager\xzytaotao-manager-dao\target [INFO] [INFO] >>> tomcat7-maven-plugin:2.2:run (default-cli) @ xzytaotao-manager-dao >>> [INFO] [INFO] --- maven-resources-plugin:2.7:resources (default-resources) @ xzytaotao-manager-dao --- [INFO] Using 'UTF-8' encoding to copy filtered resources. [INFO] Copying 11 resources [INFO] [INFO] --- maven-compiler-plugin:3.2:compile (default-compile) @ xzytaotao-manager-dao --- [INFO] Changes detected - recompiling the module! [INFO] Compiling 11 source files to M:\Myeclipseworkspaces\xzytaotao-manager\xzytaotao-manager-dao\target\classes [INFO] [INFO] <<< tomcat7-maven-plugin:2.2:run (default-cli) @ xzytaotao-manager-dao <<< [INFO] [INFO] --- tomcat7-maven-plugin:2.2:run (default-cli) @ xzytaotao-manager-dao --- [INFO] Skipping non-war project [INFO] [INFO] ------------------------------------------------------------------------ [INFO] Building xzytaotao-manager-service 0.0.1-SNAPSHOT [INFO] ------------------------------------------------------------------------ [INFO] [INFO] --- maven-clean-plugin:2.4.1:clean (default-clean) @ xzytaotao-manager-service --- [INFO] Deleting M:\Myeclipseworkspaces\xzytaotao-manager\xzytaotao-manager-service\target [INFO] [INFO] >>> tomcat7-maven-plugin:2.2:run (default-cli) @ xzytaotao-manager-service >>> [INFO] [INFO] --- maven-resources-plugin:2.7:resources (default-resources) @ xzytaotao-manager-service --- [INFO] Using 'UTF-8' encoding to copy filtered resources. [INFO] Copying 0 resource [INFO] [INFO] --- maven-compiler-plugin:3.2:compile (default-compile) @ xzytaotao-manager-service --- [INFO] Changes detected - recompiling the module! [INFO] Compiling 14 source files to M:\Myeclipseworkspaces\xzytaotao-manager\xzytaotao-manager-service\target\classes [INFO] /M:/Myeclipseworkspaces/xzytaotao-manager/xzytaotao-manager-service/src/main/java/com/xzytaotao/service/impl/ItemParamItemServiceImpl.java: M:\Myeclipseworkspaces\xzytaotao-manager\xzytaotao-manager-service\src\main\java\com\xzytaotao\service\impl\ItemParamItemServiceImpl.java使用了未经检查或不安全的操作。 [INFO] /M:/Myeclipseworkspaces/xzytaotao-manager/xzytaotao-manager-service/src/main/java/com/xzytaotao/service/impl/ItemParamItemServiceImpl.java: 有关详细信息, 请使用 -Xlint:unchecked 重新编译。 [INFO] [INFO] <<< tomcat7-maven-plugin:2.2:run (default-cli) @ xzytaotao-manager-service <<< [INFO] [INFO] --- tomcat7-maven-plugin:2.2:run (default-cli) @ xzytaotao-manager-service --- [INFO] Skipping non-war project [INFO] [INFO] ------------------------------------------------------------------------ [INFO] Building xzytaotao-manager-web 0.0.1-SNAPSHOT [INFO] ------------------------------------------------------------------------ [INFO] [INFO] --- maven-clean-plugin:2.4.1:clean (default-clean) @ xzytaotao-manager-web --- [INFO] Deleting M:\Myeclipseworkspaces\xzytaotao-manager\xzytaotao-manager-web\target [INFO] [INFO] >>> tomcat7-maven-plugin:2.2:run (default-cli) @ xzytaotao-manager-web >>> [INFO] [INFO] --- maven-resources-plugin:2.7:resources (default-resources) @ xzytaotao-manager-web --- [INFO] Using 'UTF-8' encoding to copy filtered resources. [INFO] Copying 7 resources [INFO] [INFO] --- maven-compiler-plugin:3.2:compile (default-compile) @ xzytaotao-manager-web --- [INFO] Changes detected - recompiling the module! [INFO] Compiling 8 source files to M:\Myeclipseworkspaces\xzytaotao-manager\xzytaotao-manager-web\target\classes [INFO] [INFO] <<< tomcat7-maven-plugin:2.2:run (default-cli) @ xzytaotao-manager-web <<< [INFO] [INFO] --- tomcat7-maven-plugin:2.2:run (default-cli) @ xzytaotao-manager-web --- [INFO] Running war on http://localhost:8080/ [INFO] Creating Tomcat server configuration at M:\Myeclipseworkspaces\xzytaotao-manager\xzytaotao-manager-web\target\tomcat [INFO] create webapp with contextPath: 六月 04, 2017 9:48:09 下午 org.apache.coyote.AbstractProtocol init 信息: Initializing ProtocolHandler ["http-bio-8080"] 六月 04, 2017 9:48:09 下午 org.apache.catalina.core.StandardService startInternal 信息: Starting service Tomcat 六月 04, 2017 9:48:09 下午 org.apache.catalina.core.StandardEngine startInternal 信息: Starting Servlet Engine: Apache Tomcat/7.0.47 六月 04, 2017 9:48:13 下午 org.apache.catalina.core.ApplicationContext log 信息: No Spring WebApplicationInitializer types detected on classpath 六月 04, 2017 9:48:13 下午 org.apache.catalina.core.ApplicationContext log 信息: Initializing Spring root WebApplicationContext log4j:WARN No appenders could be found for logger (org.springframework.web.context.ContextLoader). log4j:WARN Please initialize the log4j system properly. log4j:WARN See http://logging.apache.org/log4j/1.2/faq.html#noconfig for more info. 运行我的聚合工程xzytaotao-manager. 命令:clean tomcat7:run,正常启动不报错,按照学习视频应该能访问http://localhost:8080然后访问index.jsp的但是却连不上,而且8080端口没有被占用,一直找不到运行,求大神指点一下小弟!

maven工程使用jetty:run报jdk找不到之类的错,求大神

具体错误截图如下![图片说明](https://img-ask.csdn.net/upload/201612/19/1482136673_762379.png) 根据百度配jdk什么的完全没用,求大神指导

eclipse下mvn install成功,使用批处理bat文件执行出错

本项目在使用eclipse时,maven插件进行clean,install都是成功的。 > 但是,在使用bat批量打包时,弹出错误:: Could not find artifact com.xxx.component:component-common-parent:pom:2.1-SNAPSHOT and 'parent.relativePath' points at wrong local POM @ line 5, column 10 -> [Help 2]。 ```批处理语句eg: set ns_common_base="D:\gzhc-dev\git\hc-hipay-common" cd %ns_common_base% call mvn clean call mvn install ``` 如果有大侠知道是什么原因,还请指教,不胜感激!!!

docker maven,使用部署时出现错误!

这是报错的信息。 ![图片说明](https://img-ask.csdn.net/upload/201904/13/1555126901_51792.png) 首先为了确保宿主机可以远程访问,我已经修改了ExecStart=后添加配置 ‐H tcp://0.0.0.0:2375 ‐H unix:///var/run/docker.sock 然后添加了 相关依赖 然后敲击命令mvn clean package docker:build ‐DpushImage,上传的时候就报这个错了,有知道怎么解决的大神吗。

Maven命令问题,然后出现错误

执行下面这个命令 ![图片说明](https://img-ask.csdn.net/upload/201703/05/1488701744_772978.png) 然后报错 ![图片说明](https://img-ask.csdn.net/upload/201703/05/1488701756_510054.png) 求大佬帮忙指点下 谢谢

2019 Python开发者日-培训

2019 Python开发者日-培训

150讲轻松搞定Python网络爬虫

150讲轻松搞定Python网络爬虫

设计模式(JAVA语言实现)--20种设计模式附带源码

设计模式(JAVA语言实现)--20种设计模式附带源码

YOLOv3目标检测实战:训练自己的数据集

YOLOv3目标检测实战:训练自己的数据集

java后台+微信小程序 实现完整的点餐系统

java后台+微信小程序 实现完整的点餐系统

三个项目玩转深度学习(附1G源码)

三个项目玩转深度学习(附1G源码)

初级玩转Linux+Ubuntu(嵌入式开发基础课程)

初级玩转Linux+Ubuntu(嵌入式开发基础课程)

2019 AI开发者大会

2019 AI开发者大会

玩转Linux:常用命令实例指南

玩转Linux:常用命令实例指南

一学即懂的计算机视觉(第一季)

一学即懂的计算机视觉(第一季)

4小时玩转微信小程序——基础入门与微信支付实战

4小时玩转微信小程序——基础入门与微信支付实战

Git 实用技巧

Git 实用技巧

Python数据清洗实战入门

Python数据清洗实战入门

使用TensorFlow+keras快速构建图像分类模型

使用TensorFlow+keras快速构建图像分类模型

实用主义学Python(小白也容易上手的Python实用案例)

实用主义学Python(小白也容易上手的Python实用案例)

程序员的算法通关课:知己知彼(第一季)

程序员的算法通关课:知己知彼(第一季)

MySQL数据库从入门到实战应用

MySQL数据库从入门到实战应用

机器学习初学者必会的案例精讲

机器学习初学者必会的案例精讲

手把手实现Java图书管理系统(附源码)

手把手实现Java图书管理系统(附源码)

极简JAVA学习营第四期(报名以后加助教微信:eduxy-1)

极简JAVA学习营第四期(报名以后加助教微信:eduxy-1)

.net core快速开发框架

.net core快速开发框架

玩转Python-Python3基础入门

玩转Python-Python3基础入门

Python数据挖掘简易入门

Python数据挖掘简易入门

微信公众平台开发入门

微信公众平台开发入门

程序员的兼职技能课

程序员的兼职技能课

Windows版YOLOv4目标检测实战:训练自己的数据集

Windows版YOLOv4目标检测实战:训练自己的数据集

HoloLens2开发入门教程

HoloLens2开发入门教程

微信小程序开发实战

微信小程序开发实战

Java8零基础入门视频教程

Java8零基础入门视频教程

相关热词 c#跨线程停止timer c#批量写入sql数据库 c# 自动安装浏览器 c#语言基础考试题 c# 偏移量打印是什么 c# 绘制曲线图 c#框体中的退出函数 c# 按钮透明背景 c# idl 混编出错 c#在位置0处没有任何行
立即提问