VS2017开发ASP.NET时遇到的编译错误 2C

Visual Studio 2017编译错误

错误信息:关于ASP.NET开发在VS2017中生成后出现无法将文件“..\bin\Debug **.dll”复制到“bin**.dll”,对路径“bin **.dll”的访问被拒绝的问题

出现该问题的场景:
(1)在使用VS2017写完代码后单击某个aspx文件在浏览器中查看,然后再到VS2017资源管理器中点击项目的生成,便会出现该问题;
(2)调试后再点击生成项目或者解决方案,也会出现该问题;
暂时缓解问题的方法:
(1)注销或者重新启动电脑;
(2)间隔大概10分钟后,在没有任何其它操作的情况下又可以正常编译通过。

总感觉好像是有某个程序在初次编译的时候将项目程序锁定或者占用着,而在这个程序还未释放项目前是无法再次编译的,说不清楚具体是什么原因!我在网上看到有不少朋友都遇到这个问题,但是没有壹个行之有效的解决办法!在此提出,期待壹个更好的解决问题的方法!

2个回答

看下你的程序是不是还在运行,先停止下,如果你直接部署到iis,把iis停掉。

访问被拒绝的问题, 一般不是权限问题就是有进程正在使用。
你的这个问题很显然是有进程正在使用(比如 自动部署到 IIS的临时site的instance启动的 w3wp.exe ),可以到task manager 查一下有没有相关进程在用,或者间隔一段时间(site 的cookie timeout=20min 默认值),系统释放资源之后就可以正常编译运行了。

Csdn user default icon
上传中...
上传图片
插入图片
抄袭、复制答案,以达到刷声望分或其他目的的行为,在CSDN问答是严格禁止的,一经发现立刻封号。是时候展现真正的技术了!
其他相关推荐
遇到的编译错误
Ubuntu 变量GLUT_INCLUDE_DIR未找到:sudo apt-get install freeglut freeglut-dev 变量GLUT_Xmu_LIBRARY未找到:sudo apt-get install libxmu-dev
VS2017新建MVC项目部署编译错误
最近新装了VS2017版,新建的MVC项目部署到Server2012上报编译错误225.rn有遇到类似的吗?
vs2017创建UWP项目时遇到的问题
本人UWP菜鸟一枚,在vs2017创建UWP项目后,打开MainPage.xaml的设计视图,出现提示[img=https://img-bbs.csdn.net/upload/201706/22/1498117796_803422.png][/img],大家是否遇到过这个问题,是怎么解决的呢?
android+opencv+jni开发中遇到一个编译错误
[armeabi-v7a] SharedLibrary : libImgFun.sornD:/adt-bundle-windows-x86-20140321/android-ndk-r9d/toolchains/arm-linux-androideabi-4.6/prebuilt/windows-x86_64/bin/../lib/gcc/arm-linux-androideabi/4.6/../../../../arm-linux-androideabi/bin/ld.exe: F:/OpenCV-2.4.9-android-sdk\sdk\native\jni\/../libs/armeabi-v7a/libopencv_core.a(persistence.cpp.o): in function cv::fromUtf16(std::basic_string, std::allocator > const&):persistence.cpp(.text._ZN2cv9fromUtf16ERKSbIwSt11char_traitsIwESaIwEE+0x26): error: undefined reference to 'wcstombs'rnD:/adt-bundle-windows-x86-20140321/android-ndk-r9d/toolchains/arm-linux-androideabi-4.6/prebuilt/windows-x86_64/bin/../lib/gcc/arm-linux-androideabi/4.6/../../../../arm-linux-androideabi/bin/ld.exe: F:/OpenCV-2.4.9-android-sdk\sdk\native\jni\/../libs/armeabi-v7a/libopencv_core.a(persistence.cpp.o): in function cv::toUtf16(std::string const&):persistence.cpp(.text._ZN2cv7toUtf16ERKSs+0x36): error: undefined reference to 'mbstowcs'rncollect2: ld returned 1 exit statusrnmake.exe: *** [F:/workspace/HaveImgFun//obj/local/armeabi-v7a/libImgFun.so] Error 1rn哪位大神帮看看怎么回事啊?rn在线等。。。。
APP开发过程中遇到的编译错误及修复
在开发过程中遇到过各种各样的编译错误,在这里记录一下防止下次再出现错误。以后会不定期更新! 1>-[__NSCFNumber rangeOfCharacterFromSet:]: unrecognized selector sent to instance 0x7fa5216589d0 出现这种错误是由于将NSNumber类型的赋给字符串,这个问题常出现在JSON解析几赋值阶段,有时候
asp.net编译错误!!!
编译错误 rn说明: 在编译向该请求提供服务所需资源的过程中出现错误。请检查下列特定错误详细信息并适当地修改源代码。 rn编译器错误信息: CS0234: 类型或命名空间名称“ADO”在类或命名空间“System.Data”中不存在(是否缺少程序集引用?)rn源错误:rn行 1: <%@ Page Language="c#"%>rn行 2: <%@import namespace="System.Data"%>rn行 3: <%@import namespace="System.Data.ADO"%>rn行 4: rn行 5: rn源文件: C:\Inetpub\wwwroot\default.aspx 行: 3 rn是不是我没装ADO.net呀!!!系统应该有自带的吧!
Eclipse中开发Android项目遇到编译错误
各位大侠好!rn我是五一假期结束后开始学习Android开发的。前天根据网上介绍的步骤搭好了开发环境,并打算以“Create project from existing source”的方式创建一个新工程。“existing source”来自Android SDK(我的计算机上的路径是:D:\Program Files\android-sdk_r18-windows\android-sdk-windows\samples\android-15\ApiDemos)。可是工程编译出错:“Description Resource Path Location TypernThe method compare(LoaderCustom.AppEntry, LoaderCustom.AppEntry) of type new Comparator() must override a superclass method LoaderCustom.java /ApiDemos/src/com/example/android/apis/app line 152 Java Problemrn”。rn不知道是什么原因造成的,也不知道如何消除。在学习Android过程中发现需要具备Java相关的知识,可我以前也没有学过Java,请各位大侠帮忙!
ASP.NET编译错误
编译错误 rn说明: 在编译向该请求提供服务所需资源的过程中出现错误。请检查下列特定错误详细信息并适当地修改源代码。 rnrn编译器错误信息: BC31019: 无法写入输出文件“C:\WINNT\Microsoft.NET\Framework\v1.0.3705\Temporary ASP.NET Files\ioffice\2995f8c9\8c089d75\l_kwch1b.pdb”:无法向注册表写入项rnrnrn这是什么错误啊?帮帮忙! rnrn
asp.net编译错误
F:\asp.net\WebApplication2\WebForm8.aspx.vb(67): 'Next' must be preceded by a matching 'For'.rnrnF:\asp.net\WebApplication2\WebForm2.aspx.vb(29): End of statement expected.rnrn“/WebApplication2”应用程序中的服务器错误。rn--------------------------------------------------------------------------------rnrn分析器错误 rn说明: 在分析向此请求提供服务所需资源时出错。请检查下列特定分析错误详细信息并适当地修改源文件。 rnrn分析器错误信息: 未能加载类型“WebApplication2.WebForm11”。rnrn源错误: rnrnrn行 1: <%@ Page Language="vb" AutoEventWireup="false" Codebehind="WebForm11.aspx.vb" Inherits="WebApplication2.WebForm11"%>rn行 2: rn行 3: rn rnrn源文件: F:\asp.net\WebApplication2\WebForm11.aspx 行: 1 rnrn刚接触.net,上面这些问题我该如何解决,向高手请教/rn
asp.net 编译错误
rn rn rn rn rn rn rn rn rn rn 姓名:rn Category:rn Psychologyrn Bussinessrn Popularrn rn rn rn rn rn rn rn rnrn rnrn编译错误:void submitBtn_Click(Object sender,EventArgs e) 没有声明
我编写聊天室时遇到的编译错误!!
--------------------Configuration: Talk2 - Win32 Debug--------------------rnCompiling...rnMySocket.cpprne:\vc++\我的文件\talk2\mysocket.h(39) : error C2143: syntax error : missing ';' before '*'rne:\vc++\我的文件\talk2\mysocket.h(39) : error C2501: 'CTalk2Dlg' : missing storage-class or type specifiersrne:\vc++\我的文件\talk2\mysocket.h(39) : error C2501: 'm_pDlg' : missing storage-class or type specifiersrnError executing cl.exe.rnrnTalk2.exe - 3 error(s), 0 warning(s)rnrnrn我要在CMySocket类中加入一个指向窗体类的指针,我已经添加了头文件到该类中了,怎么还会出现这样的问题呢??
[Help]新人学习代码时遇到编译错误
新人一个,学习swtich的时候,写了一段简单代码,但是编译报错,百度上找了半天也没找到该怎么解决;rn代码如下rn[code=java]public class examrn public static void main(String[] args)rn int n = 5;rn switch(n)rn case'1':rn System.out.println("The number is 1");rn break;rn defult:rn System.out.println("Wrong input,plz input the right number");rn break;rn rn rn[/code]rn报错如下:rnexam.java:1: 错误: 需要class, interface或enumrn锘縫ublic class examrn^rn1 个错误rnrn这是因为public乱码了?我原来是在notepad++写代码的,然后打开记事本,选择英文输入法,手打了全部代码,还是这个报错,然后又以为是字符编码的问题,javac -encoding UTF-8 exam.java,报错如下:rn[img=https://img-bbs.csdn.net/upload/201409/09/1410231906_723781.png][/img]rn然后完全不懂了,public前面什么东西都没有,为什么报错信息里面前面有个问号rn求大神帮助
到linking时,遇到的编译错误,百思不得其解,高分相送!
错误信息如下:利用Oracle的OLE对象进行编程。rnnafxcwd.lib(afxmem.obj) : error LNK2005: "public: static void __stdcall CObject::operator delete(void *)" (??3CObject@@SGXPAX@Z) already defined in omfc60.lib(OMFC.OBJ)rnnafxcwd.lib(afxinl1.obj) : error LNK2005: "public: virtual void __thiscall CObject::Serialize(class CArchive &)" (?Serialize@CObject@@UAEXAAVCArchive@@@Z) already defined in omfc60.lib(OMFC.OBJ)rnnafxcwd.lib(afxinl3.obj) : error LNK2005: "protected: virtual void __thiscall CWnd::DoDataExchange(class CDataExchange *)" (?DoDataExchange@CWnd@@MAEXPAVCDataExchange@@@Z) already defined in omfc60.lib(OMFC.OBJ)rnnafxcwd.lib(afxinl3.obj) : error LNK2005: "public: virtual void __thiscall CWnd::BeginModalState(void)" (?BeginModalState@CWnd@@UAEXXZ) already defined in omfc60.lib(OMFC.OBJ)rnnafxcwd.lib(afxinl3.obj) : error LNK2005: "public: virtual void __thiscall CWnd::EndModalState(void)" (?EndModalState@CWnd@@UAEXXZ) already defined in omfc60.lib(OMFC.OBJ)rn请教各位大虾不吝赐教!
开发时遇到的bug
数据库表字段和实体类属性不一致时会产生该异常(org.springframework.beans.factory.BeanCreationException: Error creating bean with name 'sessionFactory' defined in class path resource [applicationContext.xml]: Invocation of ...
开发时遇到的坑
OkHttp 会针对 gzip 的头进行自动判断是否解压 RecycleView+EditText RecycleView item包含EditText。通过给EditText添加addTextChangedListener监听从而完成修改数据的时候会造成修改数据混乱。原因是 RecycleView的复用机制。解决办法在给EditText添加监听前判断该EditText是否已经存在监听,若...
vs2017 linux调试遇到的一些问题
问题一:Unable to start debugging. Unexpected GDB output from command 具体如图 编译的时候可以编译成功, 但是当调试的时候会报这个错。 初步确定是因为没有找到对应的工作目录 默认的工作目录 但是我这里设置了常规里的输出目录 工作目录不一致,然后就报了那个错误。 解决方法: 更改 调试-&gt;工作目录与常规...
安装VS2017遇到的坑
在VS官网下载了安装包,结果反反复复的下载资源,安装进度条迟迟没有动静,重装、拷贝各种各样方法都试过了,依旧不行...... 后来观察到下载完成后需要验证,感觉是验证的时候出了错误,于是才下载下来,下面是解决方法 1、运行命令行,输入命令gpedit.msc 2、打开本地组策略编辑器,找到Windows 设置 3、打开Windows 设置找到安全设置-&amp;gt;本地策略 4、找到安全选项-...
c++遇到的编译错误
1.LINK : fatal error LNK1123: 转换到 COFF 期间失败: 文件无效或损坏的错误 解决方案: 1.将 项目——项目属性——配置属性——连接器——清单文件——嵌入清单 “是”改为“否”。若还不能解决问题进入2。 2.查看计算机是否为64bit操作系统,如是,继续如下操作。 查找是否有两个cvtres.exe。 C:\Program Files(
QT编程遇到的编译错误
编译我的源文件MyThread.cpp时报错如下,总说connect()没声明,可是信号和槽的连接用声明么?rnMyThread.cpp: In constructor `MyThread::MyThread()':rnMyThread.cpp:16: error: `connect' undeclared (first use this function)rnMyThread.cpp:16: error: (Each undeclared identifier is reported only once for each function it appears in.)rnrn源代码如下:rn/*MyThread.h*/rn#ifndef MYTHREAD_Hrn#define MYTHREAD_Hrnrn#include rn#includern#includern#includern#includern/**rn *MyThread.h文件摹拟用户访问Web Server,向web 服务器发送request请求包,这里通过rn *get()请求实现对web服务器进行负载测试 rn */rnclass QHttp;rnclass QFile;rnclass QMessageBox;rnrnclass MyThread: public QThreadrnrn Q_OBJECTrnpublic:rn MyThread();rn void run();rn void setData(int port,QString& host,int sleeptime,QString& filename);rn void init();rn void stop();rnrnprivate:rn QString host,filename;rn int sleeptime,port;rn volatile bool stopped;rn QHttp http;rn QFile file;rnprivate slots:rn void httpDone(bool error); rn rn;rn#endif rn///////////////////////////////////////////rn//MyThread.cpprn#include "MyThread.h"rn/**rn *缺省的参数:端口号为8080,主机为localhost,运行时间为600秒.每隔100rn *ms向web服务器发送请求rn */rnMyThread::MyThread()rn :QThread()rnrn rn port=8080;rn host="localhost";rn sleeptime=100;//msrn stopped=false;rn filename="test";rn // signals and slots connectionsrn connect( &http,SIGNAL(done(bool)),this,SLOT(httpDone(bool))); //::::::::::: 报错的地方rn rnrnvoid MyThread::run()rnrn init();rn while(!stopped)rn rn if (!file.open(IO_WriteOnly)) rn QMessageBox::warning(new QDialog(), tr("HTTP Get"),rn tr("Cannot write file %1\n%2.")rn .arg(file.name())rn .arg(file.errorString()));rn return;rn rn http.get("/index.jsp",&file);rn msleep(sleeptime); rn http.closeConnection();rn rn if(stopped)rn rn file.close();rn rnrnvoid MyThread::setData(int port,QString& host,int sleeptime,QString &filename)rnrn this->port=port;rn this->host=host;rn this->sleeptime=sleeptime;rn this->filename=filename;rnrnvoid MyThread::init()rnrn http.setHost(host,port);rn file.setName(filename);rnrnvoid MyThread::stop()rnrn stopped=true;rnrnvoid MyThread::httpDone(bool error)rnrn if(error)rn QMessageBox::warning(new QDialog(), tr("HTTP Get"),tr("Error while fetching file with""HTTP: %1.").arg(http.errorString()));rn file.close();rn rnrn<<<<<<<<<<<<<<<<<<<<<<<<<<<<<<<<<<<<<<<<<<<<<<<<<<<<]rn//main.cpprn#include "MyThread.h"rnint main(int argc,char **argv)rnrn MyThread a[50];rn for(int i=0;i<50;i++)rn rn a[i].start();rn a[i].wait();rn rnrn我不知道我错在哪里,请指出~~
遇到编译错误:CRichEdit未定义
我第一使用CRichEdit,遇到编译错误:CRichEdit未定义。rn请问要什么头文件,或如何设置?rn谢谢!rn
一些遇到g++编译错误
error: cannot convert ‘std::map&lt;_client, _stime, std::less&lt;_client&gt;, std::allocator&lt;std::pair&lt;const _client, _stime&gt; &gt; &gt;’ to ‘redisContext*’ for argument ‘1’ to ‘void* redisCom...
asp.net开发水晶报表遇到的问题
有没有哪位高人在编译时遇到一下问题:rnrunat="server">rn行 20: rn行 21: rn
asp.net调试时遇到的问题
本人在VS.net里调试下列程序出现问题,不知如何解决,请各位大虾帮忙:rn源程序1(ex06.aspx):rn<%@Import Namespace=System.Data%>rn<%@Import Namespace=System.Data.ADO%>rnrnrn rn EX06rn rn rn rn rn rn rn rn rn 执行 rn rn rn rnrn调试错误提示:rnServer Error in '/lj' Application. rn rnCompilation Error rnDescription: An error occurred during the compilation of a resource required to service this request. Please review the following specific error details and modify your source code appropriately. rnrnCompiler Error Message: BC30002: Type 'ADOCommand' is not defined.rnrnSource Error:rnLine 17: rn rnrnrnrnrnrn调试错误提示:rnServer Error in '/lj' Application. rn rnCompilation Error rnDescription: An error occurred during the compilation of a resource required to service this request. Please review the following specific error details and modify your source code appropriately. rnrnCompiler Error Message: BC30456: 'ToInt16' is not a member of 'String'.rnrnSource Error:rnLine 16:
读ASP.net时遇到的问题
在用repeater建立数据绑定时,在里VB用了<%# Container.DataItem( "au_fname" ) %>rn而C#用的是<%#DataBinder.Eval(Container.DataItem, "auther" ) %>rnC#里面这个是什么意思,Eval是类型转换吗?怎么转换的?
asp.net打包时遇到的问题
我在打包的时候参照相关文章所作的 但是还是遇到了问题rnusing System;rnusing System.Collections;rnusing System.Diagnostics;rnusing System.Reflection;rnusing System.Data;rnusing System.Data.SqlClient;rnusing System.IO;rnusing System.Configuration.Install;rnrnnamespace pp.DBCustomActionrnrn /// rn /// DBCustomAction 的摘要说明。rn /// rn public class DBCustomAction:System.Configuration.Install.Installerrn rn public DBCustomAction()rn rn //rn // TODO: 在此处添加构造函数逻辑rn //rn rn private string GetSql(string Name)rn rn Assembly Asm = Assembly.GetExecutingAssembly(); rn Stream strm = Asm.GetManifestResourceStream(Asm.GetName().Name + "."+Name); rn StreamReader reader = new StreamReader(strm); rn return reader.ReadToEnd(); rn rn /// rn /// 指定的数据库执行SQL语句rn /// rn /// 数据库名rn /// SQL语句rn /// rn private void ExecuteSql(string DataBaseName,string sqlstring)rn rn SqlConnection sqlConn=new SqlConnection("server=allserver;uid=sa;pwd=;Database=master");rn System.Data.SqlClient.SqlCommand Command = new System.Data.SqlClient.SqlCommand(sqlstring,sqlConn); rnrn Command.Connection.Open(); rn Command.Connection.ChangeDatabase(DataBaseName); rn try rn rn Command.ExecuteNonQuery(); rn rn finally rn rn Command.Connection.Close(); rn rnrn rnrn /// rn /// 创建数据库及数据库表rn /// rn /// 数据库名rn /// 配件中数据库脚本资源的名称rn /// rn protected bool CreateDBAndTable(string DBName)rn rn bool Restult = false;rn try rn rn ExecuteSql("master","CREATE DATABASE " + DBName); rn ExecuteSql(DBName,GetSql("db.txt")); rn Restult = true;rn rn rn catch(Exception ex) rn rn //次段代码为调试用可以不添加rnrn StreamWriter sw = new StreamWriter(@"c:\SrInforSys.txt");rn sw.WriteLine("[SrInforSys案装错误]");rn sw.WriteLine(ex.Message.ToString()); rn sw.Close(); rn rn return Restult;rn rn rn rn /// rn /// 安装数据库rn /// rn /// rn rn// public override void Install(System.Collections.IDictionary stateSaver)rn// rn// base.Install (stateSaver);rn// CreateDBAndTable("hcpm");rn// if(!CreateDBAndTable(this.Context.Parameters["dn"].ToString()))rn// throw new ApplicationException("创建数据库时出现严重错误!");rn// rn public override void Install(System.Collections.IDictionary stateSaver)rn rn FileInfo f = new FileInfo(@"c:\test.txt");rn StreamWriter w = f.CreateText();rn w.WriteLine("This is from");rn w.WriteLine("Chapter 1");rn w.WriteLine("Of C# Module");rn w.Write(w.NewLine);rn w.WriteLine("Thanks for your time");rn w.Close();rn rnrn base.Install (stateSaver);rn //CreateDBAndTable("hcpm");rn if(!CreateDBAndTable(this.Context.Parameters["dn"].ToString()))rn throw new ApplicationException("创建数据库时出现严重错误!");rn rn rnrnrnrn引入了自定义安装后 根本没有执行重载的函数还是安装原来的方式装的我的测试代码就没有执行rn请问是具体那个部分操作失误了 还有 再读db.sql的时候 出错说stream变量有问题。。。。。。
单元测试的编写(asp.net) (VS2017)
首先,编写单元测试主要是为了检测自己所编写的方法是否可以通过运行,这是我的理解,原理应该是判断输出结果是否一样来间接判断方法是否正确(至少我是这么理解的),好处就是这样可以避免代码一次性打完出现bug不好调试的问题。 然后单元测试应该主要包括三个方面:(1)做一个假数据 (2)mock方法 (3)assert方法输出与自己做的假数据是否一致。 接下来看一个实例:
Android 开发时遇到的坑
1.创建文件时选择了c++时遇到这个错误Error:executing external native build for cmake D:\dev\testcode\MayApplication\app\CMakeLists.txt解决办法:在build.gradle 里加上下面***中间这段android { compileSdkVersion 25 buildToolsVer...
开发 RMI时遇到的问题
需要用RMI实现远程调用rnrn因为是web应用,是用tomcat来发布,有几个问题,希望做过的大虾能为我解惑。rnrn1 服务端必须在tomcat启动完成之前开启,其实也只是执行服务端类的一个方法就行。而服务端的绑定对象是通过spring 来注入的。所以第一个问题就是:什么时候来执行这个方法,在哪里执行。rnrn2 我尝试写了一个servlet来启动这个方法,在setter方法中看到注入的对象为 rn...service = org.springframework.aop.framework.JdkDynamicAopProxyrn然后在servlet的init方法中进入创建服务器端的方法,该对象变为null。第二个问题就是,为什么会出现这种情况。rnrn3 我在远程对象的一个方法中返回了另一个对象rn[code=Java]class UserServicern rn voidgetUserDao(UserDao userDao)rn this.userDao = userDao;rnrnrnrnrnrnrn[/code]rnrn然后在客户端想通过这个方法来获得userDao的引用时出错。rnjava.rmi.UnmarshalException: error unmarshalling return; nested exception is: rn java.lang.ClassNotFoundException: com.dao.UserDaoImpl (no security manager: RMI class loader disabled)rn at sun.rmi.server.UnicastRef.invoke(UnicastRef.java:178)rn at java.rmi.server.RemoteObjectInvocationHandler.invokeRemoteMethod(RemoteObjectInvocationHandler.java:178)rn at java.rmi.server.RemoteObjectInvocationHandler.invoke(RemoteObjectInvocationHandler.java:132)rn at $Proxy0.getUserDao(Unknown Source)rn at com.test.RmiClient.main(RmiClient.java:24)rnCaused by: java.lang.ClassNotFoundException: com.dao.UserDaoImpl (no security manager: RMI class loader disabled)rn at sun.rmi.server.LoaderHandler.loadClass(LoaderHandler.java:375)rn at sun.rmi.server.LoaderHandler.loadClass(LoaderHandler.java:165)rn at java.rmi.server.RMIClassLoader$2.loadClass(RMIClassLoader.java:620)rn at java.rmi.server.RMIClassLoader.loadClass(RMIClassLoader.java:247)rn at sun.rmi.server.MarshalInputStream.resolveClass(MarshalInputStream.java:197)rn at java.io.ObjectInputStream.readNonProxyDesc(ObjectInputStream.java:1575)rn at java.io.ObjectInputStream.readClassDesc(ObjectInputStream.java:1496)rn at java.io.ObjectInputStream.readOrdinaryObject(ObjectInputStream.java:1732)rn at java.io.ObjectInputStream.readObject0(ObjectInputStream.java:1329)rn at java.io.ObjectInputStream.readObject(ObjectInputStream.java:351)rn at sun.rmi.server.UnicastRef.unmarshalValue(UnicastRef.java:306)rn at sun.rmi.server.UnicastRef.invoke(UnicastRef.java:155)rn ... 4 morernrnrn希望有知道的大虾能解答下。如果哪位大哥有这方面的例子共享下,小弟将不胜感激。
开发时遇到的一个问题
本人最近要做一个日程管理的项目,主要是利用VB开发,但是界面上需要好看一点,VB的控件没有我想要的,哪位大侠或者女侠有这方面的控件和经验请赐教,小弟一定大大给分!
开发OJ时遇到的问题
正在用JAVA开发OJ的服务器本地程序,就是网页调用这个程序然后评分的。rn如何调用CMD命令?需要调用javac和java来编译和运行选手程序。rn如何向选手的命令行程序中输入内容并获取选手程序输出的内容?选手程序既有输入也有输出,必须能够输入测试数据并得到输出的结果然后才能评分。rn有关于IO文件输入和输出流的东西有没有人在博客里写过?请把链接放出来!rn本人QQ:2276768747 验证问答全部填写CSDN-JAVA-OJrn谢谢各位geek!
asp开发时遇到的问题
用ASP做网站时,在用户登录的页面时,我准备以三种身份进行登录:管理员、销售人员、客户。于是我想在表单中插入二个文本字段和一个下拉菜单。其中下拉菜单用来选择以何种身份登入,我把三种身份的用户名和密码都放在一个SQL数据库中的SYSTEM表中(销售人员和客户可能不只一个),我是初学者,觉得很难实现,能不能有谁高手能帮我解决啊?非常感谢,很急用。
android 开发时遇到的问题
Execution failed for task ':app:processDebugManifest'. > Manifest merger failed : uses-sdk:minSdkVersion 16 cannot be smaller than version 20 declared in library D:\AndroidStudioProjects\StudioDemo\ap
AE开发时遇到的一些问题
问题: 在进行AE开发时: 检索 COM 类工厂中 CLSID 为 {D9B4FA40-D6D9-11D1-AA81-00C04FA33A15} 的组件失败,原因是出现以下错误: 80040111 ClassFactory 无法供应请求的类 (异常来自 HRESULT:0x80040111 (CLASS_E_CLASSNOTAVAILABLE))。 解决: 在执行创建语句前,增
开发chrome插件时遇到的一些问题
开发chrome插件时遇到的一些问题 背景:在一个运行在chrome浏览器上web应用基础上开发插件,web应用的协议为https。 chrome插件开发相关知识:https://www.cnblogs.com/liuxianan/p/chrome-plugin-develop.html chrome官网:https://developer.chrome.com/extensions 由于
struts开发时遇到的问题
[size=large]今天做了一个struts的例子,在运行tomcat时控制台中打印出了以下信息:[/size] [b][color=red]严重: Error loading WebappClassLoader[/color] context: /StrutsTest delegate: false repositories: /WEB-INF/classe...
在开发javaweb时遇到的问题
1、java.lang.ClassNotFoundException: com.mysql.jdbc.Driver说明没导入mysql的驱动。 2、java.sql.SQLException: Access denied for user ‘root’@’localhost’ (using password: YES) http://blog.csdn.net/hiphopmattshi/art
VS2017开发linux程序
使用VS2017开发linux程序的教程,实例中使用了boost多线程库,能够好得帮助新手学习如何搭建调用外部依赖库的工程
(Demo)Dapper+DapperExtensions+T4+Respository。VS2017开发的
开发工具VS2017。演示了Dapper+DapperExtensions+T4+Respository的使用方法。只需生成entity。就可以调用基类的Respository实现基本的增删查改的功能。
开发时遇到的好玩的终端命令
1.在看别人写的项目代码时,如果想了解项目的结构,可以在系统的终端用cd 命令打开到项目的目录下,输入命令tree ,就可以查看项目的具体结构分布:
C#winform开发时遇到的错误信息
错误信息:The ObjectContext instance has been disposed and can no longer be used for operations that require a connection. 原因:使用EF创建数据库实体类,在使用时习惯使用using(数据库实体类 对象 = new 数据库实体类()){} 解决方法:在Program.cs中创建一个数...
相关热词 c# 线程结束时执行 c# kb mb 图片 c# 替换第几位字符 c#项目决定成败 c# 与matlab c# xml缩进 c#传感器基础 c#操作wps c# md5使用方法 c# 引用父窗口的组件