终端将LLVM生成xcode时不成功 5C

终端把LLVM生成xcode时,报以下错误,是缺什么文件吗?需要怎么解决?有没有大牛懂的?

CMake Error at cmake/modules/AddLLVM.cmake:1350 (add_dependencies):
The dependency target "clang" of target "check-all" does not exist.
Call Stack (most recent call first):
CMakeLists.txt:930 (add_lit_target)

CMake Error at cmake/modules/AddLLVM.cmake:1350 (add_dependencies):
The dependency target "clang-headers" of target "check-all" does not exist.
Call Stack (most recent call first):
CMakeLists.txt:930 (add_lit_target)

1个回答

Csdn user default icon
上传中...
上传图片
插入图片
抄袭、复制答案,以达到刷声望分或其他目的的行为,在CSDN问答是严格禁止的,一经发现立刻封号。是时候展现真正的技术了!
其他相关推荐
webrtc编译Android版本编译参数is_clang=false时,编译报错,is_clang=true时,编译成功。
[2274/3376] LINK ./rgba_to_i420_converter FAILED: rgba_to_i420_converter exe.unstripped/rgba_to_i420_converter python "../../build/toolchain/gcc_link_wrapper.py" --output="./rgba_to_i420_converter" --strip="../../buildtools/third_party/eu-strip/bin/eu-strip" --unstripped-file="./exe.unstripped/rgba_to_i420_converter" -- ../../third_party/llvm-build/Release+Asserts/bin/clang++ -Wl,--fatal-warnings -fPIC -Wl,-z,noexecstack -Wl,-z,relro -Wl,-z,now -Wl,-z,defs -Wl,--as-needed -fuse-ld=gold -Wl,--icf=all -Wl,--exclude-libs=libgcc.a -Wl,--exclude-libs=libvpx_assembly_arm.a --target=aarch64-linux-android -Wl,-mllvm,-enable-machine-outliner=never -Wl,--warn-shared-textrel -Wl,-O2 -Wl,--gc-sections -nodefaultlibs --sysroot=../../third_party/android_ndk/platforms/android-21/arch-arm64 -nostdlib -Wl,--warn-shared-textrel -pie -Bdynamic -Wl,-z,nocopyreloc -Wl,--dynamic-linker,/system/bin/linker64 -L../../third_party/android_ndk/sources/cxx-stl/llvm-libc++/libs/arm64-v8a -o "./exe.unstripped/rgba_to_i420_converter" -Wl,--start-group @"./rgba_to_i420_converter.rsp" -Wl,--end-group ../../third_party/android_ndk/platforms/android-21/arch-arm64/usr/lib/crtbegin_dynamic.o -lc -lgcc_s -lm -lrt -landroid_support ../../third_party/android_ndk/toolchains/aarch64-linux-android-4.9/prebuilt/linux-x86_64/lib/gcc/aarch64-linux-android/4.9.x/libgcc.a -ldl -llog -lGLESv2 ../../third_party/android_ndk/platforms/android-21/arch-arm64/usr/lib/crtend_android.o /usr/bin/ld.gold: fatal error: obj/rtc_tools/rgba_to_i420_converter/converter.o: unsupported ELF machine number 183 clang: error: linker command failed with exit code 1 (use -v to see invocation)
CentOS编译LLVM遇到的HOST GCC版本问题
操作系统原来自带的gcc版本是4.8.5,因为安装llvm要求是5.1以上版 本,所以后来正常安装了GCC8.3.0,CMAKE 3.12.1,然后下载llvm-project,按照如下链接指示安装: http://llvm.org/docs/CMake.html 发现执行到"cmake path/to/llvm/source/root"时报错。错误信息如下: [root@jzl-cloud-01 llvm]# cmake -DCMAKE_BUILD_TYPE=Release -DLLVM_TARGETS_TO_BUILD=X86 /home/falcon/h265/llvm-project/llvm -- Could NOT find Z3: Found unsuitable version "0.0.0", but required is at least "4.7.1" (found Z3_LIBRARIES-NOTFOUND) CMake Error at cmake/modules/CheckCompilerVersion.cmake:38 (message): Host GCC version must be at least 5.1, your version is 4.8.5. Call Stack (most recent call first): cmake/modules/CheckCompilerVersion.cmake:48 (check_compiler_version) cmake/config-ix.cmake:13 (include) CMakeLists.txt:624 (include) -- Configuring incomplete, errors occurred! See also "/home/falcon/h265/llvm/CMakeFiles/CMakeOutput.log". [root@jzl-cloud-01 llvm]# cmake /home/falcon/h265/llvm-project/llvm -- Could NOT find Z3: Found unsuitable version "0.0.0", but required is at least "4.7.1" (found Z3_LIBRARIES-NOTFOUND) CMake Error at cmake/modules/CheckCompilerVersion.cmake:38 (message): Host GCC version must be at least 5.1, your version is 4.8.5. Call Stack (most recent call first): cmake/modules/CheckCompilerVersion.cmake:48 (check_compiler_version) cmake/config-ix.cmake:13 (include) CMakeLists.txt:624 (include) -- Configuring incomplete, errors occurred! See also "/home/falcon/h265/llvm/CMakeFiles/CMakeOutput.log". 请问上面提到的HOST GCC版本过低的问题该如何解决?
安装LLVM过程中提示gcc版本低,但是系统中默认的gcc版本就是7.3.0,如何解决?谢谢!!!
![图片说明](https://img-ask.csdn.net/upload/201912/06/1575600474_141765.png)
安装llvm输入相应代码得到Makefile时报错,拜托大神帮忙看下咋回事
CMake Error: The source directory "/llvm.. "does not exist. Specify --help for usage, or press the help button on the CMake GUI.
编译llvm出现链接错误怎么办?
1,编译llvm,在编译进度100%时出现链接错误。 2,错误提示: ``` [100%] Building CXX object tools/clang/tools/libclang/CMakeFiles/libclang.dir/Indexing.cpp.o [100%] Linking CXX executable ../../../../bin/lldb-vscode [100%] Built target lldb-vscode [100%] Building CXX object tools/lldb/tools/driver/CMakeFiles/lldb.dir/Driver.cpp.o [100%] Linking CXX executable ../../../../bin/lldb [100%] Built target lldb [100%] Linking CXX shared library ../../../../lib/libclang.so ../../../../lib/libclangTidyAbseilModule.a(DurationAdditionCheck.cpp.o):在函数‘clang::tidy::abseil::DurationAdditionCheck::check(clang::ast_matchers::MatchFinder::MatchResult const&)’中: DurationAdditionCheck.cpp:(.text._ZN5clang4tidy6abseil21DurationAdditionCheck5checkERKNS_12ast_matchers11MatchFinder11MatchResultE+0x362):对‘clang::tidy::abseil::getScaleForTimeInverse(llvm::StringRef)’未定义的引用 DurationAdditionCheck.cpp:(.text._ZN5clang4tidy6abseil21DurationAdditionCheck5checkERKNS_12ast_matchers11MatchFinder11MatchResultE+0x37f):对‘clang::tidy::abseil::getTimeInverseForScale(clang::tidy::abseil::DurationScale)’未定义的引用 DurationAdditionCheck.cpp:(.text._ZN5clang4tidy6abseil21DurationAdditionCheck5checkERKNS_12ast_matchers11MatchFinder11MatchResultE+0x485):对‘clang::tidy::abseil::rewriteExprFromNumberToDuration[abi:cxx11](clang::ast_matchers::MatchFinder::MatchResult const&, clang::tidy::abseil::DurationScale, clang::Expr const*)’未定义的引用 DurationAdditionCheck.cpp:(.text._ZN5clang4tidy6abseil21DurationAdditionCheck5checkERKNS_12ast_matchers11MatchFinder11MatchResultE+0xa91):对‘clang::tidy::abseil::rewriteExprFromNumberToDuration[abi:cxx11](clang::ast_matchers::MatchFinder::MatchResult const&, clang::tidy::abseil::DurationScale, clang::Expr const*)’未定义的引用 ../../../../lib/libclangTidyAbseilModule.a(DurationComparisonCheck.cpp.o):在函数‘clang::tidy::abseil::DurationComparisonCheck::check(clang::ast_matchers::MatchFinder::MatchResult const&)’中: DurationComparisonCheck.cpp:(.text._ZN5clang4tidy6abseil23DurationComparisonCheck5checkERKNS_12ast_matchers11MatchFinder11MatchResultE+0x1ab):对‘clang::tidy::abseil::getScaleForDurationInverse(llvm::StringRef)’未定义的引用 DurationComparisonCheck.cpp:(.text._ZN5clang4tidy6abseil23DurationComparisonCheck5checkERKNS_12ast_matchers11MatchFinder11MatchResultE+0x1bf):对‘clang::tidy::abseil::isInMacro(clang::ast_matchers::MatchFinder::MatchResult const&, clang::Expr const*)’未定义的引用 DurationComparisonCheck.cpp:(.text._ZN5clang4tidy6abseil23DurationComparisonCheck5checkERKNS_12ast_matchers11MatchFinder11MatchResultE+0x1cf):对‘clang::tidy::abseil::isInMacro(clang::ast_matchers::MatchFinder::MatchResult const&, clang::Expr const*)’未定义的引用 DurationComparisonCheck.cpp:(.text._ZN5clang4tidy6abseil23DurationComparisonCheck5checkERKNS_12ast_matchers11MatchFinder11MatchResultE+0x2fd):对‘clang::tidy::abseil::rewriteExprFromNumberToDuration[abi:cxx11](clang::ast_matchers::MatchFinder::MatchResult const&, clang::tidy::abseil::DurationScale, clang::Expr const*)’未定义的引用 DurationComparisonCheck.cpp:(.text._ZN5clang4tidy6abseil23DurationComparisonCheck5checkERKNS_12ast_matchers11MatchFinder11MatchResultE+0x315):对‘clang::tidy::abseil::rewriteExprFromNumberToDuration[abi:cxx11](clang::ast_matchers::MatchFinder::MatchResult const&, clang::tidy::abseil::DurationScale, clang::Expr const*)’未定义的引用 ../../../../lib/libclangTidyAbseilModule.a(DurationFactoryFloatCheck.cpp.o):在函数‘clang::tidy::abseil::DurationFactoryFloatCheck::check(clang::ast_matchers::MatchFinder::MatchResult const&)’中: DurationFactoryFloatCheck.cpp:(.text._ZN5clang4tidy6abseil25DurationFactoryFloatCheck5checkERKNS_12ast_matchers11MatchFinder11MatchResultE+0x157):对‘clang::tidy::abseil::stripFloatCast[abi:cxx11](clang::ast_matchers::MatchFinder::MatchResult const&, clang::Expr const&)’未定义的引用 DurationFactoryFloatCheck.cpp:(.text._ZN5clang4tidy6abseil25DurationFactoryFloatCheck5checkERKNS_12ast_matchers11MatchFinder11MatchResultE+0x4a7):对‘clang::tidy::abseil::stripFloatLiteralFraction[abi:cxx11](clang::ast_matchers::MatchFinder::MatchResult const&, clang::Expr const&)’未定义的引用 ../../../../lib/libclangTidyAbseilModule.a(DurationFactoryScaleCheck.cpp.o):在函数‘clang::tidy::abseil::DurationFactoryScaleCheck::check(clang::ast_matchers::MatchFinder::MatchResult const&)’中: DurationFactoryScaleCheck.cpp:(.text._ZN5clang4tidy6abseil25DurationFactoryScaleCheck5checkERKNS_12ast_matchers11MatchFinder11MatchResultE+0x10a):对‘clang::tidy::abseil::IsLiteralZero(clang::ast_matchers::MatchFinder::MatchResult const&, clang::Expr const&)’未定义的引用 DurationFactoryScaleCheck.cpp:(.text._ZN5clang4tidy6abseil25DurationFactoryScaleCheck5checkERKNS_12ast_matchers11MatchFinder11MatchResultE+0x497):对‘clang::tidy::abseil::getDurationFactoryForScale(clang::tidy::abseil::DurationScale)’未定义的引用 DurationFactoryScaleCheck.cpp:(.text._ZN5clang4tidy6abseil25DurationFactoryScaleCheck5checkERKNS_12ast_matchers11MatchFinder11MatchResultE+0xde5):对‘clang::tidy::abseil::getDurationFactoryForScale(clang::tidy::abseil::DurationScale)’未定义的引用 ../../../../lib/libclangTidyAbseilModule.a(TimeComparisonCheck.cpp.o):在函数‘clang::tidy::abseil::TimeComparisonCheck::check(clang::ast_matchers::MatchFinder::MatchResult const&)’中: TimeComparisonCheck.cpp:(.text._ZN5clang4tidy6abseil19TimeComparisonCheck5checkERKNS_12ast_matchers11MatchFinder11MatchResultE+0x1ab):对‘clang::tidy::abseil::getScaleForTimeInverse(llvm::StringRef)’未定义的引用 TimeComparisonCheck.cpp:(.text._ZN5clang4tidy6abseil19TimeComparisonCheck5checkERKNS_12ast_matchers11MatchFinder11MatchResultE+0x1bf):对‘clang::tidy::abseil::isInMacro(clang::ast_matchers::MatchFinder::MatchResult const&, clang::Expr const*)’未定义的引用 TimeComparisonCheck.cpp:(.text._ZN5clang4tidy6abseil19TimeComparisonCheck5checkERKNS_12ast_matchers11MatchFinder11MatchResultE+0x1cf):对‘clang::tidy::abseil::isInMacro(clang::ast_matchers::MatchFinder::MatchResult const&, clang::Expr const*)’未定义的引用 TimeComparisonCheck.cpp:(.text._ZN5clang4tidy6abseil19TimeComparisonCheck5checkERKNS_12ast_matchers11MatchFinder11MatchResultE+0x2fd):对‘clang::tidy::abseil::rewriteExprFromNumberToTime[abi:cxx11](clang::ast_matchers::MatchFinder::MatchResult const&, clang::tidy::abseil::DurationScale, clang::Expr const*)’未定义的引用 TimeComparisonCheck.cpp:(.text._ZN5clang4tidy6abseil19TimeComparisonCheck5checkERKNS_12ast_matchers11MatchFinder11MatchResultE+0x315):对‘clang::tidy::abseil::rewriteExprFromNumberToTime[abi:cxx11](clang::ast_matchers::MatchFinder::MatchResult const&, clang::tidy::abseil::DurationScale, clang::Expr const*)’未定义的引用 ../../../../lib/libclangTidyAndroidModule.a(AndroidTidyModule.cpp.o):在函数‘std::_Function_handler<clang::tidy::ClangTidyCheck* (llvm::StringRef, clang::tidy::ClangTidyContext*), void clang::tidy::ClangTidyCheckFactories::registerCheck<clang::tidy::android::CloexecOpenCheck>(llvm::StringRef)::{lambda(llvm::StringRef, clang::tidy::ClangTidyContext*)#1}>::_M_invoke(std::_Any_data const&, llvm::StringRef&&, clang::tidy::ClangTidyContext*&&)’中: AndroidTidyModule.cpp:(.text._ZNSt17_Function_handlerIFPN5clang4tidy14ClangTidyCheckEN4llvm9StringRefEPNS1_16ClangTidyContextEEZNS1_23ClangTidyCheckFactories13registerCheckINS1_7android16CloexecOpenCheckEEEvS5_EUlS5_S7_E_E9_M_invokeERKSt9_Any_dataOS5_OS7_[_ZNSt17_Function_handlerIFPN5clang4tidy14ClangTidyCheckEN4llvm9StringRefEPNS1_16ClangTidyContextEEZNS1_23ClangTidyCheckFactories13registerCheckINS1_7android16CloexecOpenCheckEEEvS5_EUlS5_S7_E_E9_M_invokeERKSt9_Any_dataOS5_OS7_]+0x36):对‘vtable for clang::tidy::android::CloexecOpenCheck’未定义的引用 ../../../../lib/libclangTidyBugproneModule.a(BugproneTidyModule.cpp.o):在函数‘std::_Function_handler<clang::tidy::ClangTidyCheck* (llvm::StringRef, clang::tidy::ClangTidyContext*), void clang::tidy::ClangTidyCheckFactories::registerCheck<clang::tidy::bugprone::BoolPointerImplicitConversionCheck>(llvm::StringRef)::{lambda(llvm::StringRef, clang::tidy::ClangTidyContext*)#1}>::_M_invoke(std::_Any_data const&, llvm::StringRef&&, clang::tidy::ClangTidyContext*&&)’中: BugproneTidyModule.cpp:(.text._ZNSt17_Function_handlerIFPN5clang4tidy14ClangTidyCheckEN4llvm9StringRefEPNS1_16ClangTidyContextEEZNS1_23ClangTidyCheckFactories13registerCheckINS1_8bugprone34BoolPointerImplicitConversionCheckEEEvS5_EUlS5_S7_E_E9_M_invokeERKSt9_Any_dataOS5_OS7_[_ZNSt17_Function_handlerIFPN5clang4tidy14ClangTidyCheckEN4llvm9StringRefEPNS1_16ClangTidyContextEEZNS1_23ClangTidyCheckFactories13registerCheckINS1_8bugprone34BoolPointerImplicitConversionCheckEEEvS5_EUlS5_S7_E_E9_M_invokeERKSt9_Any_dataOS5_OS7_]+0x36):对‘vtable for clang::tidy::bugprone::BoolPointerImplicitConversionCheck’未定义的引用 ../../../../lib/libclangTidyAbseilModule.a(DurationConversionCastCheck.cpp.o):在函数‘clang::tidy::abseil::DurationConversionCastCheck::check(clang::ast_matchers::MatchFinder::MatchResult const&)’中: DurationConversionCastCheck.cpp:(.text._ZN5clang4tidy6abseil27DurationConversionCastCheck5checkERKNS_12ast_matchers11MatchFinder11MatchResultE+0xcf):对‘clang::tidy::abseil::isInMacro(clang::ast_matchers::MatchFinder::MatchResult const&, clang::Expr const*)’未定义的引用 DurationConversionCastCheck.cpp:(.text._ZN5clang4tidy6abseil27DurationConversionCastCheck5checkERKNS_12ast_matchers11MatchFinder11MatchResultE+0x279):对‘clang::tidy::abseil::getScaleForDurationInverse(llvm::StringRef)’未定义的引用 DurationConversionCastCheck.cpp:(.text._ZN5clang4tidy6abseil27DurationConversionCastCheck5checkERKNS_12ast_matchers11MatchFinder11MatchResultE+0x564):对‘clang::tidy::abseil::getDurationInverseForScale(clang::tidy::abseil::DurationScale)’未定义的引用 DurationConversionCastCheck.cpp:(.text._ZN5clang4tidy6abseil27DurationConversionCastCheck5checkERKNS_12ast_matchers11MatchFinder11MatchResultE+0x924):对‘clang::tidy::abseil::getDurationInverseForScale(clang::tidy::abseil::DurationScale)’未定义的引用 ../../../../lib/libclangTidyAbseilModule.a(DurationSubtractionCheck.cpp.o):在函数‘clang::tidy::abseil::DurationSubtractionCheck::check(clang::ast_matchers::MatchFinder::MatchResult const&)’中: DurationSubtractionCheck.cpp:(.text._ZN5clang4tidy6abseil24DurationSubtractionCheck5checkERKNS_12ast_matchers11MatchFinder11MatchResultE+0x191):对‘clang::tidy::abseil::getScaleForDurationInverse(llvm::StringRef)’未定义的引用 DurationSubtractionCheck.cpp:(.text._ZN5clang4tidy6abseil24DurationSubtractionCheck5checkERKNS_12ast_matchers11MatchFinder11MatchResultE+0x1c2):对‘clang::tidy::abseil::rewriteExprFromNumberToDuration[abi:cxx11](clang::ast_matchers::MatchFinder::MatchResult const&, clang::tidy::abseil::DurationScale, clang::Expr const*)’未定义的引用 ../../../../lib/libclangTidyAbseilModule.a(DurationUnnecessaryConversionCheck.cpp.o):在函数‘clang::tidy::abseil::DurationUnnecessaryConversionCheck::check(clang::ast_matchers::MatchFinder::MatchResult const&)’中: DurationUnnecessaryConversionCheck.cpp:(.text._ZN5clang4tidy6abseil34DurationUnnecessaryConversionCheck5checkERKNS_12ast_matchers11MatchFinder11MatchResultE+0x1af):对‘clang::tidy::abseil::isInMacro(clang::ast_matchers::MatchFinder::MatchResult const&, clang::Expr const*)’未定义的引用 ../../../../lib/libclangTidyAbseilModule.a(TimeSubtractionCheck.cpp.o):在函数‘clang::tidy::abseil::TimeSubtractionCheck::registerMatchers(clang::ast_matchers::MatchFinder*)’中: TimeSubtractionCheck.cpp:(.text._ZN5clang4tidy6abseil20TimeSubtractionCheck16registerMatchersEPNS_12ast_matchers11MatchFinderE+0x208):对‘clang::tidy::abseil::getScaleForTimeInverse(llvm::StringRef)’未定义的引用 TimeSubtractionCheck.cpp:(.text._ZN5clang4tidy6abseil20TimeSubtractionCheck16registerMatchersEPNS_12ast_matchers11MatchFinderE+0x89c):对‘clang::tidy::abseil::getDurationFactoryForScale(clang::tidy::abseil::DurationScale)’未定义的引用 ../../../../lib/libclangTidyAbseilModule.a(TimeSubtractionCheck.cpp.o):在函数‘clang::tidy::abseil::TimeSubtractionCheck::check(clang::ast_matchers::MatchFinder::MatchResult const&)’中: TimeSubtractionCheck.cpp:(.text._ZN5clang4tidy6abseil20TimeSubtractionCheck5checkERKNS_12ast_matchers11MatchFinder11MatchResultE+0x1a4):对‘clang::tidy::abseil::getScaleForTimeInverse(llvm::StringRef)’未定义的引用 TimeSubtractionCheck.cpp:(.text._ZN5clang4tidy6abseil20TimeSubtractionCheck5checkERKNS_12ast_matchers11MatchFinder11MatchResultE+0x26a):对‘clang::tidy::abseil::getDurationFactoryForScale(clang::tidy::abseil::DurationScale)’未定义的引用 TimeSubtractionCheck.cpp:(.text._ZN5clang4tidy6abseil20TimeSubtractionCheck5checkERKNS_12ast_matchers11MatchFinder11MatchResultE+0x732):对‘clang::tidy::abseil::rewriteExprFromNumberToTime[abi:cxx11](clang::ast_matchers::MatchFinder::MatchResult const&, clang::tidy::abseil::DurationScale, clang::Expr const*)’未定义的引用 TimeSubtractionCheck.cpp:(.text._ZN5clang4tidy6abseil20TimeSubtractionCheck5checkERKNS_12ast_matchers11MatchFinder11MatchResultE+0x782):对‘clang::tidy::abseil::rewriteExprFromNumberToTime[abi:cxx11](clang::ast_matchers::MatchFinder::MatchResult const&, clang::tidy::abseil::DurationScale, clang::Expr const*)’未定义的引用 TimeSubtractionCheck.cpp:(.text._ZN5clang4tidy6abseil20TimeSubtractionCheck5checkERKNS_12ast_matchers11MatchFinder11MatchResultE+0xd0a):对‘clang::tidy::abseil::rewriteExprFromNumberToTime[abi:cxx11](clang::ast_matchers::MatchFinder::MatchResult const&, clang::tidy::abseil::DurationScale, clang::Expr const*)’未定义的引用 TimeSubtractionCheck.cpp:(.text._ZN5clang4tidy6abseil20TimeSubtractionCheck5checkERKNS_12ast_matchers11MatchFinder11MatchResultE+0xd51):对‘clang::tidy::abseil::rewriteExprFromNumberToTime[abi:cxx11](clang::ast_matchers::MatchFinder::MatchResult const&, clang::tidy::abseil::DurationScale, clang::Expr const*)’未定义的引用 TimeSubtractionCheck.cpp:(.text._ZN5clang4tidy6abseil20TimeSubtractionCheck5checkERKNS_12ast_matchers11MatchFinder11MatchResultE+0xd89):对‘clang::tidy::abseil::getDurationInverseForScale(clang::tidy::abseil::DurationScale)’未定义的引用 TimeSubtractionCheck.cpp:(.text._ZN5clang4tidy6abseil20TimeSubtractionCheck5checkERKNS_12ast_matchers11MatchFinder11MatchResultE+0x1061):对‘clang::tidy::abseil::rewriteExprFromNumberToTime[abi:cxx11](clang::ast_matchers::MatchFinder::MatchResult const&, clang::tidy::abseil::DurationScale, clang::Expr const*)’未定义的引用 TimeSubtractionCheck.cpp:(.text._ZN5clang4tidy6abseil20TimeSubtractionCheck5checkERKNS_12ast_matchers11MatchFinder11MatchResultE+0x10aa):对‘clang::tidy::abseil::rewriteExprFromNumberToTime[abi:cxx11](clang::ast_matchers::MatchFinder::MatchResult const&, clang::tidy::abseil::DurationScale, clang::Expr const*)’未定义的引用 collect2: 错误:ld 返回 1 make[2]: *** [lib/libclang.so.10] 错误 1 make[1]: *** [tools/clang/tools/libclang/CMakeFiles/libclang.dir/all] 错误 2 make: *** [all] 错误 2 ``` 求救
llvm/clang编译出错问题
我是直接下载llvm的源码编译出来的clang,然后编写了一个简单的源程序,包含一些STL的简单操作,在使用该clang编译该程序时,出现了一些"cannot compile this try statement yet"的try、throw错误提示,但在vs下编译成功的,很是迷惑,希望各位能指点一下,谢谢。。
development packages for llvm 3.2
development packages for llvm 3.2谁有这个东西啊,我到现在都不太懂这个到底是啥 要是大神们有这个开发包的话,求给一份啊,万分感谢,我用apt-get install装得都是3.3版本以上的,但我需要3.2版本以下的。。。。
llvm pass 如何获取Value中的内容
我在编写llvm pass,希望将获取到的Value类型操作数转换为整型相关类型,或提取其中的内容。 下一步需要用这个数据作为数组下标,因此必须是整型相关的类型。 之前试过用<Value*, Value*>的map存储,但是Value类本身没有实现"<"的重载所以不行QAQ 有大佬用过相关函数吗?
LLVM修改stackprotector.cpp
我修改了LLVM的stackprotector.cpp文件后使用clang -fstack-protector编译,为什么没有改变?怎样使用固定寄存器存储自己要存的内容?怎样让返回地址参与运算?
求大神支招? 开发过程中,会有文件生成不完整的情况
开发过程中,会有文件生成不完整的情况,例如现在运行llvm_build.bat 没生成3个文件,这个怎么处理?
如何使用LLVM在基本块的入口和出口插入代码?
&emsp;&emsp;In my recent work, I need insert the instrumentation code at the entry and exit of basic blocks to get value of varibles and so I can check them based on a DFA of the source code. Another task is when the executable file is executed according to the instrumentation code, an exception will be triggered before function call and system call or an access of an variable or after an update of an variable. <br/>&emsp;&emsp;I've read LLVM manual about how to write a pass. However, it doesn't tell me how can I get the latest value of variables. <br/>&emsp;&emsp;Someone provide a link contains basic usage of LLVM pass but it's too simple -----------<br/>①https://github.com/SumedhArani/LLVM <br/>②https://www.cs.cornell.edu/~asampson/blog/llvm.html <br/> **A simple program that can be exploited to launch DOP attacks:** #include <stdio.h> int main(){ int old_valud,new_value; int *p=&old_value,*q=&new_value; int connect_limit=100; char buf[64]; while(connect_limit--){ read(0,buf); *p=*q; } return 0; } **LLVM IR** ``` define i32 @main() #0 { %1 = alloca i32, align 4 %old_value = alloca i32, align 4 %new_value = alloca i32, align 4 %p = alloca i32*, align 8 %q = alloca i32*, align 8 %connect_limit = alloca i32, align 4 %buf = alloca [64 x i8], align 16 store i32 0, i32* %1 store i32* %old_value, i32** %p, align 8 store i32* %new_value, i32** %q, align 8 store i32 100, i32* %connect_limit, align 4 br label %2 ; <label>:2 ; preds = %6, %0 %3 = load i32, i32* %connect_limit, align 4 %4 = add nsw i32 %3, -1 store i32 %4, i32* %connect_limit, align 4 %5 = icmp ne i32 %3, 0 br i1 %5, label %6, label %12 ; <label>:6 ; preds = %2 %7 = getelementptr inbounds [64 x i8], [64 x i8]* %buf, i32 0, i32 0 %8 = call i32 (i8*, ...) @__isoc99_scanf(i8* getelementptr inbounds ([3 x i8], [3 x i8]* @.str, i32 0, i32 0), i8* %7) %9 = load i32*, i32** %q, align 8 %10 = load i32, i32* %9, align 4 %11 = load i32*, i32** %p, align 8 store i32 %10, i32* %11, align 4 br label %2 ; <label>:12 ; preds = %2 ret i32 0 } ``` <br/><br/><br/><br/><br/><br/><br/> ** CFG **<br/><br/> ![CFG of is](https://img-ask.csdn.net/upload/201905/25/1558789729_780384.png) <br/>Can someone provide some relevant source code and guidance?
编译firefox windows版时出现错误不知怎么解决
编译环境是 vs 2019 选择的是 c++ 桌面开发和c++游戏开发。 windows sdk 是 10.0.18362.0版本。 LLVM是9.0的32位版本。 rust使用的是rustup-init自动安装的最新版(使用网上的msi安装包安装后编译时报错python有问题)。 安装了nasm-2.14rc16的64位版本 firefox使用的是官网提供的firefox-69.0.3 MozillaBuild使用的是3.2版本 编译了大约20分钟后系统报错,最后错误如下 ``` 5:59.18 In file included from e:/firefox-69.0.3/obj-x86_64-pc-mingw32/ipc/ipdl/UnifiedProtocols9.cpp:2: 5:59.18 In file included from e:/firefox-69.0.3/obj-x86_64-pc-mingw32/ipc/ipdl/PChildToParentStreamChild.cpp:7: 5:59.18 In file included from e:/firefox-69.0.3/obj-x86_64-pc-mingw32/ipc/ipdl/_ipdlheaders\mozilla/ipc/PChildToParentStreamChild.h:9: 5:59.18 In file included from e:/firefox-69.0.3/obj-x86_64-pc-mingw32/ipc/ipdl/_ipdlheaders\mozilla/ipc/PChildToParentStream.h:11: 5:59.18 In file included from e:/firefox-69.0.3/obj-x86_64-pc-mingw32/dist/include/ipc/IPCMessageUtils.h:36: 5:59.18 In file included from e:/firefox-69.0.3/obj-x86_64-pc-mingw32/dist/include/nsIWidget.h:21: 5:59.18 In file included from e:/firefox-69.0.3/obj-x86_64-pc-mingw32/dist/include\nsStyleConsts.h:17: 5:59.19 In file included from e:/firefox-69.0.3/obj-x86_64-pc-mingw32/dist/include/mozilla/ServoStyleConsts.h:9929: 5:59.19 e:/firefox-69.0.3/obj-x86_64-pc-mingw32/dist/include/mozilla/ServoStyleConstsInlines.h(117,3): warning: ignoring return value of function declared with 'nodiscard' attribute [-Wunused-result] 5:59.19 count.load(std::memory_order_acquire); 5:59.19 ^~~~~~~~~~ ~~~~~~~~~~~~~~~~~~~~~~~~~ 5:59.19 e:/firefox-69.0.3/obj-x86_64-pc-mingw32/dist/include/mozilla/ServoStyleConstsInlines.h(199,22): note: in instantiation of member function 'mozilla::StyleArcInner<mozilla::StyleTemplateAreas>::DecrementRef' requested here 5:59.19 if (MOZ_LIKELY(!p->DecrementRef())) { 5:59.20 ^ 5:59.20 e:/firefox-69.0.3/obj-x86_64-pc-mingw32/dist/include/mozilla/ServoStyleConstsInlines.h(224,3): note: in instantiation of member function 'mozilla::StyleArc<mozilla::StyleTemplateAreas>::Release' requested here 5:59.21 Release(); 5:59.21 ^ 5:59.21 e:/firefox-69.0.3/obj-x86_64-pc-mingw32/dist/include/mozilla/ServoStyleConsts.h(8098,10): note: in instantiation of member function 'mozilla::StyleArc<mozilla::StyleTemplateAreas>::~StyleArc' requested here 5:59.21 struct StyleAreas_Body { 5:59.21 ^ 6:00.88 2 warnings generated. 6:02.54 2 warnings generated. 6:03.26 2 warnings generated. 6:05.10 2 warnings generated. 6:10.54 2 warnings generated. 6:10.61 mozmake.EXE[2]: *** [e:/firefox-69.0.3/config/recurse.mk:34: compile] Error 2 6:10.61 mozmake.EXE[1]: *** [e:/firefox-69.0.3/config/rules.mk:391: default] Error 2 6:10.61 mozmake.EXE: *** [client.mk:125: build] Error 2 6:10.63 147 compiler warnings present. ``` 其中大量的警告重复出现 ``` e:/firefox-69.0.3/obj-x86_64-pc-mingw32/dist/include/mozilla/ServoStyleConstsInlines.h(117,3): warning: ignoring return value of function declared with 'nodiscard' attribute [-Wunused-result] 5:59.19 count.load(std::memory_order_acquire); 5:59.19 ^~~~~~~~~~ ~~~~~~~~~~~~~~~~~~~~~~~~~ 5:59.19 e:/firefox-69.0.3/obj-x86_64-pc-mingw32/dist/include/mozilla/ServoStyleConstsInlines.h(199,22): note: in instantiation of member function 'mozilla::StyleArcInner<mozilla::StyleTemplateAreas>::DecrementRef' requested here 5:59.19 if (MOZ_LIKELY(!p->DecrementRef())) { 5:59.20 ^ 5:59.20 e:/firefox-69.0.3/obj-x86_64-pc-mingw32/dist/include/mozilla/ServoStyleConstsInlines.h(224,3): note: in instantiation of member function 'mozilla::StyleArc<mozilla::StyleTemplateAreas>::Release' requested here 5:59.21 Release(); 5:59.21 ^ 5:59.21 e:/firefox-69.0.3/obj-x86_64-pc-mingw32/dist/include/mozilla/ServoStyleConsts.h(8098,10): note: in instantiation of member function 'mozilla::StyleArc<mozilla::StyleTemplateAreas>::~StyleArc' requested here 5:59.21 struct StyleAreas_Body { 5:59.21 ^ 6:00.88 2 warnings generated. 6:02.54 2 warnings generated. ``` 请问这种问题怎么处理呢?
跪求大神帮助,LLVM如何添加内存指令呀
我需要用LLVM来最终源码中每个object在运行时的内存地址,访存行为,以及生存时间。。但是不知道要怎样添加内存指令。跪求各位大神帮助!!!
在Xcode环境下无法配置gnu gsl库
在自动配置的时候遇到错误 有没有大神能告诉我如何自动配置或者手动配置的参数呢? 下面是config.log This file contains any messages produced by compilers while running configure, to aid debugging if configure makes a mistake. It was created by gsl configure 1.9, which was generated by GNU Autoconf 2.59. Invocation command line was $ ./configure ## --------- ## ## Platform. ## ## --------- ## hostname = admindeMac-Pro.local uname -m = x86_64 uname -r = 13.0.0 uname -s = Darwin uname -v = Darwin Kernel Version 13.0.0: Thu Sep 19 22:22:27 PDT 2013; root:xnu-2422.1.72~6/RELEASE_X86_64 /usr/bin/uname -p = i386 /bin/uname -X = unknown /bin/arch = unknown /usr/bin/arch -k = unknown /usr/convex/getsysinfo = unknown hostinfo = Mach kernel version: Darwin Kernel Version 13.0.0: Thu Sep 19 22:22:27 PDT 2013; root:xnu-2422.1.72~6/RELEASE_X86_64 Kernel configured for up to 8 processors. 4 processors are physically available. 8 processors are logically available. Processor type: i486 (Intel 80486) Processors active: 0 1 2 3 4 5 6 7 Primary memory available: 16.00 gigabytes Default processor set: 142 tasks, 528 threads, 8 processors Load average: 1.33, Mach factor: 6.66 /bin/machine = unknown /usr/bin/oslevel = unknown /bin/universe = unknown PATH: /usr/bin PATH: /bin PATH: /usr/sbin PATH: /sbin PATH: /usr/local/bin ## ----------- ## ## Core tests. ## ## ----------- ## configure:1521: checking for a BSD-compatible install configure:1576: result: /usr/bin/install -c configure:1587: checking whether build environment is sane configure:1630: result: yes configure:1695: checking for gawk configure:1724: result: no configure:1695: checking for mawk configure:1724: result: no configure:1695: checking for nawk configure:1724: result: no configure:1695: checking for awk configure:1711: found /usr/bin/awk configure:1721: result: awk configure:1731: checking whether make sets $(MAKE) configure:1751: result: yes configure:1921: checking whether to enable maintainer-specific portions of Makefiles configure:1930: result: no configure:1968: checking whether make sets $(MAKE) configure:1988: result: yes configure:2004: checking build system type configure:2022: result: i386-apple-darwin13.0.0 configure:2030: checking host system type configure:2044: result: i386-apple-darwin13.0.0 configure:2105: checking for gcc configure:2121: found /usr/bin/gcc configure:2131: result: gcc configure:2375: checking for C compiler version configure:2378: gcc --version </dev/null >&5 i686-apple-darwin11-llvm-gcc-4.2 (GCC) 4.2.1 (Based on Apple Inc. build 5658) (LLVM build 2336.11.00) Copyright (C) 2007 Free Software Foundation, Inc. This is free software; see the source for copying conditions. There is NO warranty; not even for MERCHANTABILITY or FITNESS FOR A PARTICULAR PURPOSE. configure:2381: $? = 0 configure:2383: gcc -v </dev/null >&5 Using built-in specs. Target: i686-apple-darwin11 Configured with: /private/var/tmp/llvmgcc42/llvmgcc42-2336.11~67/src/configure --disable-checking --enable-werror --prefix=/Applications/Xcode.app/Contents/Developer/usr/llvm-gcc-4.2 --mandir=/share/man --enable-languages=c,objc,c++,obj-c++ --program-prefix=llvm- --program-transform-name=/^[cg][^.-]*$/s/$/-4.2/ --with-slibdir=/usr/lib --build=i686-apple-darwin11 --enable-llvm=/private/var/tmp/llvmgcc42/llvmgcc42-2336.11~67/dst-llvmCore/Developer/usr/local --program-prefix=i686-apple-darwin11- --host=x86_64-apple-darwin11 --target=i686-apple-darwin11 --with-gxx-include-dir=/usr/include/c++/4.2.1 Thread model: posix gcc version 4.2.1 (Based on Apple Inc. build 5658) (LLVM build 2336.11.00) configure:2386: $? = 0 configure:2388: gcc -V </dev/null >&5 llvm-gcc-4.2: argument to `-V' is missing configure:2391: $? = 1 configure:2414: checking for C compiler default output file name configure:2417: gcc conftest.c >&5 ld: library not found for -lcrt1.10.6.o collect2: ld returned 1 exit status configure:2420: $? = 1 configure: failed program was: | /* confdefs.h. */ | | #define PACKAGE_NAME "gsl" | #define PACKAGE_TARNAME "gsl" | #define PACKAGE_VERSION "1.9" | #define PACKAGE_STRING "gsl 1.9" | #define PACKAGE_BUGREPORT "" | #define PACKAGE "gsl" | #define VERSION "1.9" | #define RELEASED 1 | /* end confdefs.h. */ | | int | main () | { | | ; | return 0; | } configure:2459: error: C compiler cannot create executables See `config.log' for more details. ## ---------------- ## ## Cache variables. ## ## ---------------- ## ac_cv_build=i386-apple-darwin13.0.0 ac_cv_build_alias=i386-apple-darwin13.0.0 ac_cv_env_CC_set= ac_cv_env_CC_value= ac_cv_env_CFLAGS_set= ac_cv_env_CFLAGS_value= ac_cv_env_CPPFLAGS_set= ac_cv_env_CPPFLAGS_value= ac_cv_env_CPP_set= ac_cv_env_CPP_value= ac_cv_env_LDFLAGS_set= ac_cv_env_LDFLAGS_value= ac_cv_env_build_alias_set= ac_cv_env_build_alias_value= ac_cv_env_host_alias_set= ac_cv_env_host_alias_value= ac_cv_env_target_alias_set= ac_cv_env_target_alias_value= ac_cv_host=i386-apple-darwin13.0.0 ac_cv_host_alias=i386-apple-darwin13.0.0 ac_cv_path_install='/usr/bin/install -c' ac_cv_prog_AWK=awk ac_cv_prog_ac_ct_CC=gcc ac_cv_prog_make_make_set=yes ## ----------------- ## ## Output variables. ## ## ----------------- ## ACLOCAL='${SHELL} /Users/admin/Downloads/gsl-1.9/missing --run aclocal-1.9' AMTAR='${SHELL} /Users/admin/Downloads/gsl-1.9/missing --run tar' AR='' AUTOCONF='${SHELL} /Users/admin/Downloads/gsl-1.9/missing --run autoconf' AUTOHEADER='${SHELL} /Users/admin/Downloads/gsl-1.9/missing --run autoheader' AUTOMAKE='${SHELL} /Users/admin/Downloads/gsl-1.9/missing --run automake-1.9' AWK='awk' CC='gcc' CFLAGS='' CPP='' CPPFLAGS='' CYGPATH_W='echo' DEFS='' ECHO='/bin/echo' ECHO_C='ECHO_N='' ECHO_T='' EGREP='' EXEEXT='' GSL_CFLAGS='' GSL_LIBS='' GSL_LT_CBLAS_VERSION='0:0:0' GSL_LT_VERSION='10:0:10' HAVE_AIX_IEEE_INTERFACE='' HAVE_DARWIN86_IEEE_INTERFACE='' HAVE_DARWIN_IEEE_INTERFACE='' HAVE_EXTENDED_PRECISION_REGISTERS='' HAVE_FREEBSD_IEEE_INTERFACE='' HAVE_GNUM68K_IEEE_INTERFACE='' HAVE_GNUPPC_IEEE_INTERFACE='' HAVE_GNUSPARC_IEEE_INTERFACE='' HAVE_GNUX86_IEEE_INTERFACE='' HAVE_HPUX11_IEEE_INTERFACE='' HAVE_HPUX_IEEE_INTERFACE='' HAVE_IEEE_COMPARISONS='' HAVE_IEEE_DENORMALS='' HAVE_INLINE='' HAVE_IRIX_IEEE_INTERFACE='' HAVE_NETBSD_IEEE_INTERFACE='' HAVE_OPENBSD_IEEE_INTERFACE='' HAVE_OS2EMX_IEEE_INTERFACE='' HAVE_PRINTF_LONGDOUBLE='' HAVE_SOLARIS_IEEE_INTERFACE='' HAVE_SUNOS4_IEEE_INTERFACE='' HAVE_TRU64_IEEE_INTERFACE='' INSTALL_DATA='${INSTALL} -m 644' INSTALL_PROGRAM='${INSTALL}' INSTALL_SCRIPT='${INSTALL}' INSTALL_STRIP_PROGRAM='${SHELL} $(install_sh) -c -s' LDFLAGS='' LIBOBJS='' LIBS='' LIBTOOL='' LN_S='' LTLIBOBJS='' MAINT='#' MAINTAINER_MODE_FALSE='' MAINTAINER_MODE_TRUE='#' MAKEINFO='${SHELL} /Users/admin/Downloads/gsl-1.9/missing --run makeinfo' OBJEXT='' PACKAGE='gsl' PACKAGE_BUGREPORT='' PACKAGE_NAME='gsl' PACKAGE_STRING='gsl 1.9' PACKAGE_TARNAME='gsl' PACKAGE_VERSION='1.9' PATH_SEPARATOR=':' RANLIB='' RELEASED='' SET_MAKE='' SHELL='/bin/sh' STRIP='' VERSION='1.9' ac_ct_AR='' ac_ct_CC='gcc' ac_ct_RANLIB='' ac_ct_STRIP='' am__leading_dot='.' am__tar='${AMTAR} chof - "$$tardir"' am__untar='${AMTAR} xf -' bindir='${exec_prefix}/bin' build='i386-apple-darwin13.0.0' build_alias='' build_cpu='i386' build_os='darwin13.0.0' build_vendor='apple' datadir='${prefix}/share' exec_prefix='NONE' host='i386-apple-darwin13.0.0' host_alias='' host_cpu='i386' host_os='darwin13.0.0' host_vendor='apple' includedir='${prefix}/include' infodir='${prefix}/info' install_sh='/Users/admin/Downloads/gsl-1.9/install-sh' libdir='${exec_prefix}/lib' libexecdir='${exec_prefix}/libexec' localstatedir='${prefix}/var' mandir='${prefix}/man' mkdir_p='$(mkinstalldirs)' oldincludedir='/usr/include' prefix='NONE' program_transform_name='s,x,x,' sbindir='${exec_prefix}/sbin' sharedstatedir='${prefix}/com' sysconfdir='${prefix}/etc' target_alias='' ## ----------- ## ## confdefs.h. ## ## ----------- ## #define PACKAGE "gsl" #define PACKAGE_BUGREPORT "" #define PACKAGE_NAME "gsl" #define PACKAGE_STRING "gsl 1.9" #define PACKAGE_TARNAME "gsl" #define PACKAGE_VERSION "1.9" #define RELEASED 1 #define VERSION "1.9" configure: exit 77
llvm7.0 test-suite的编译安装与使用
llvm7.0的test-suite不知道如何配置,按照官网上给的步骤配置,编译出错,哪位大神能指教一波
如何用gcc后端生成一种新的虚拟机命令
请问高手们如何运用gcc后端生成一种特定的虚拟机命令码。比如说,修改gcc后端的哪些部分后就可以生成JVM的命令?我想通过修改gcc或者LLVM后端做一个虚拟机,可是具体怎么做还没有商量好。我也是最近刚开始接触编译器的,基础不是特别好。看gcc和LLVM的文档也是云里雾里的,高手们可不可以给一些建议,比如像gcc的话,我正在看gcc internals,有关用gcc后端生成一种特定的虚拟机命令码,看哪些章节比较好。
iOS新建的项目,一句代码没写,使用 Cocoapod导入融云以后,编译都过不了,该怎么解决呢?
Ld /Users/mudy/Library/Developer/Xcode/DerivedData/MyChat-eklapihtyzzzagfohpydmuedmhfu/Build/Products/Debug-iphonesimulator/MyChat.app/MyChat normal x86_64 cd /Users/mudy/Desktop/MyChat export IPHONEOS_DEPLOYMENT_TARGET=8.4 export PATH="/Applications/Xcode.app/Contents/Developer/Platforms/iPhoneSimulator.platform/Developer/usr/bin:/Applications/Xcode.app/Contents/Developer/usr/bin:/usr/bin:/bin:/usr/sbin:/sbin" /Applications/Xcode.app/Contents/Developer/Toolchains/XcodeDefault.xctoolchain/usr/bin/clang -arch x86_64 -isysroot /Applications/Xcode.app/Contents/Developer/Platforms/iPhoneSimulator.platform/Developer/SDKs/iPhoneSimulator8.4.sdk -L/Users/mudy/Library/Developer/Xcode/DerivedData/MyChat-eklapihtyzzzagfohpydmuedmhfu/Build/Products/Debug-iphonesimulator -L/Users/mudy/Desktop/MyChat/Pods/RongCloudIMKit/Rong_Cloud_iOS_SDK_v2_3_2_stable -F/Users/mudy/Library/Developer/Xcode/DerivedData/MyChat-eklapihtyzzzagfohpydmuedmhfu/Build/Products/Debug-iphonesimulator -F/Users/mudy/Desktop/MyChat/Pods/RongCloudIMKit/Rong_Cloud_iOS_SDK_v2_3_2_stable -filelist /Users/mudy/Library/Developer/Xcode/DerivedData/MyChat-eklapihtyzzzagfohpydmuedmhfu/Build/Intermediates/MyChat.build/Debug-iphonesimulator/MyChat.build/Objects-normal/x86_64/MyChat.LinkFileList -Xlinker -rpath -Xlinker @executable_path/Frameworks -Xlinker -objc_abi_version -Xlinker 2 -ObjC -lc++ -lc++abi -lopencore-amrnb -lsqlite3 -lstdc++ -lxml2 -lz -framework AVFoundation -framework AssetsLibrary -framework AudioToolbox -framework CFNetwork -framework CoreAudio -framework CoreGraphics -framework CoreLocation -framework CoreMedia -framework CoreTelephony -framework CoreVideo -framework ImageIO -framework MapKit -framework OpenGLES -framework QuartzCore -framework RongIMKit -framework RongIMLib -framework SystemConfiguration -framework UIKit -L/Applications/Xcode.app/Contents/Developer/Toolchains/XcodeDefault.xctoolchain/usr/lib/swift/iphonesimulator -Xlinker -add_ast_path -Xlinker /Users/mudy/Library/Developer/Xcode/DerivedData/MyChat-eklapihtyzzzagfohpydmuedmhfu/Build/Intermediates/MyChat.build/Debug-iphonesimulator/MyChat.build/Objects-normal/x86_64/MyChat.swiftmodule -mios-simulator-version-min=8.4 -lPods -Xlinker -dependency_info -Xlinker /Users/mudy/Library/Developer/Xcode/DerivedData/MyChat-eklapihtyzzzagfohpydmuedmhfu/Build/Intermediates/MyChat.build/Debug-iphonesimulator/MyChat.build/Objects-normal/x86_64/MyChat_dependency_info.dat -o /Users/mudy/Library/Developer/Xcode/DerivedData/MyChat-eklapihtyzzzagfohpydmuedmhfu/Build/Products/Debug-iphonesimulator/MyChat.app/MyChat duplicate symbol _llvm.cmdline in: /Users/mudy/Desktop/MyChat/Pods/RongCloudIMKit/Rong_Cloud_iOS_SDK_v2_3_2_stable/libopencore-amrnb.a(wrapper.o) /Users/mudy/Desktop/MyChat/Pods/RongCloudIMKit/Rong_Cloud_iOS_SDK_v2_3_2_stable/libopencore-amrnb.a(agc.o) duplicate symbol _llvm.embedded.module in: /Users/mudy/Desktop/MyChat/Pods/RongCloudIMKit/Rong_Cloud_iOS_SDK_v2_3_2_stable/libopencore-amrnb.a(wrapper.o) /Users/mudy/Desktop/MyChat/Pods/RongCloudIMKit/Rong_Cloud_iOS_SDK_v2_3_2_stable/libopencore-amrnb.a(agc.o) ld: 288 duplicate symbols for architecture x86_64 clang: error: linker command failed with exit code 1 (use -v to see invocation)
请问SDL2.0是怎么编译到ios平台的呢,我按照README-ios.txt编译但是编译过不了
uilding with iOS SDK v6.1 for iOS >= 3.0 checking build system type... i386-apple-darwin12.4.0 checking host system type... armv6-apple-darwin checking how to print strings... printf checking for armv6-apple-darwin-gcc... /Applications/Xcode 2.app/Contents/Developer/Platforms/iPhoneOS.platform/Developer/usr/bin/llvm-gcc-4.2 checking whether the C compiler works... no configure: error: in `/Users/PS/SDL2-2.0.0/build/armv6': configure: error: C compiler cannot create executables See `config.log' for more details 请问有遇到这样的问题没?我的系统 OS X 10.8.4,XCode4.6.3 SDK6.1
Android使用Webrtc进行降噪增益,如何适配64位so
Android使用Webrtc进行降噪增益编译成32位so测试正常,但是编译64位so报错,arm64-v8a的so文件报错,是需要64位的源码编译吗还是需要改什么东西,附错误信息,急求大神解答。 *** *** *** *** *** *** *** *** *** *** *** *** *** *** *** *** 2019-05-21 17:21:06.190 13887-13887/? A/DEBUG: Build fingerprint: 'Nokia/Panda_00CN/PDA:9/PPR1.180610.011/00CN_2_15B:user/release-keys' 2019-05-21 17:21:06.190 13887-13887/? A/DEBUG: Revision: '0' 2019-05-21 17:21:06.190 13887-13887/? A/DEBUG: ABI: 'arm64' 2019-05-21 17:21:06.190 13887-13887/? A/DEBUG: pid: 12202, tid: 13878, name: Thread-35 >>> com.xx.xx<<< 2019-05-21 17:21:06.190 13887-13887/? A/DEBUG: signal 11 (SIGSEGV), code 1 (SEGV_MAPERR), fault addr 0x5b5cb298 2019-05-21 17:21:06.190 13887-13887/? A/DEBUG: x0 000000005b5cb294 x1 0000000000000003 x2 00000000000000ff x3 0000000000000003 2019-05-21 17:21:06.191 13887-13887/? A/DEBUG: x4 0000000000001f40 x5 0000000000000003 x6 0000000000001f40 x7 0000000000000000 2019-05-21 17:21:06.191 13887-13887/? A/DEBUG: x8 0000000000000003 x9 0000000008000000 x10 0000000000430000 x11 0000007183dfc688 2019-05-21 17:21:06.191 13887-13887/? A/DEBUG: x12 0000007209bb8410 x13 dff7b546ac046781 x14 0000007206b68000 x15 0000007206b68000 2019-05-21 17:21:06.191 13887-13887/? A/DEBUG: x16 000000715ae2cc88 x17 000000715ae09e7c x18 0000000000000000 x19 000000005b5cb100 2019-05-21 17:21:06.191 13887-13887/? A/DEBUG: x20 0000000000000000 x21 00000000000000ff x22 0000000000001f40 x23 0000000000000003 2019-05-21 17:21:06.191 13887-13887/? A/DEBUG: x24 0000000000000018 x25 0000007159f2a588 x26 000000714082b4a0 x27 0000000000000001 2019-05-21 17:21:06.191 13887-13887/? A/DEBUG: x28 0000000000000000 x29 0000007159f28ee0 2019-05-21 17:21:06.191 13887-13887/? A/DEBUG: sp 0000007159f28eb0 lr 000000715ae08da0 pc 000000715ae09e84 2019-05-21 17:21:06.262 413-9844/? E/AudioALSAPlaybackHandlerBase: -getHardwareBufferInfo(), pcm_get_htimestamp fail, ret = -1, pcm_get_error = 2019-05-21 17:21:06.263 13887-13887/? A/DEBUG: backtrace: 2019-05-21 17:21:06.263 13887-13887/? A/DEBUG: #00 pc 0000000000006e84 /data/app/com.xx.xx-U5O1pzNUtbiwoTPGd6O-UA==/split_config.arm64_v8a.apk (offset 0x1c000) (WebRtcAgc_InitDigital+8) 2019-05-21 17:21:06.263 13887-13887/? A/DEBUG: #01 pc 0000000000005d9c /data/app/com.xx.xx-U5O1pzNUtbiwoTPGd6O-UA==/split_config.arm64_v8a.apk (offset 0x1c000) (WebRtcAgc_Init+48) 2019-05-21 17:21:06.263 13887-13887/? A/DEBUG: #02 pc 0000000000033534 /data/app/com.xx.xx-U5O1pzNUtbiwoTPGd6O-UA==/oat/arm64/base.odex (offset 0x33000) (com.xx.xx.util.AgcNsUtils.init+164) 2019-05-21 17:21:06.263 13887-13887/? A/DEBUG: #03 pc 000000000055cd88 /system/lib64/libart.so (art_quick_invoke_stub+584) 2019-05-21 17:21:06.263 13887-13887/? A/DEBUG: #04 pc 00000000000cf740 /system/lib64/libart.so (art::ArtMethod::Invoke(art::Thread*, unsigned int*, unsigned int, art::JValue*, char const*)+200) 2019-05-21 17:21:06.263 13887-13887/? A/DEBUG: #05 pc 00000000002823b8 /system/lib64/libart.so (art::interpreter::ArtInterpreterToCompiledCodeBridge(art::Thread*, art::ArtMethod*, art::ShadowFrame*, unsigned short, art::JValue*)+344) 2019-05-21 17:21:06.263 13887-13887/? A/DEBUG: #06 pc 000000000027d480 /system/lib64/libart.so (bool art::interpreter::DoCall<true, false>(art::ArtMethod*, art::Thread*, art::ShadowFrame&, art::Instruction const*, unsigned short, art::JValue*)+752) 2019-05-21 17:21:06.263 13887-13887/? A/DEBUG: #07 pc 000000000052fa0c /system/lib64/libart.so (MterpInvokeVirtualQuickRange+420) 2019-05-21 17:21:06.263 13887-13887/? A/DEBUG: #08 pc 0000000000553194 /system/lib64/libart.so (ExecuteMterpImpl+30100) 2019-05-21 17:21:06.263 13887-13887/? A/DEBUG: #09 pc 00000000002146b8 /data/app/com..xx.xx-U5O1pzNUtbiwoTPGd6O-UA==/oat/arm64/base.vdex (com.xx.xx.AgcNsUtils.prepare+44) 2019-05-21 17:21:06.263 13887-13887/? A/DEBUG: #10 pc 0000000000255e70 /system/lib64/libart.so (_ZN3art11interpreterL7ExecuteEPNS_6ThreadERKNS_20CodeItemDataAccessorERNS_11ShadowFrameENS_6JValueEb.llvm.1181525464+496) 2019-05-21 17:21:06.263 13887-13887/? A/DEBUG: #11 pc 000000000025b9f0 /system/lib64/libart.so (art::interpreter::ArtInterpreterToInterpreterBridge(art::Thread*, art::CodeItemDataAccessor const&, art::ShadowFrame*, art::JValue*)+216) 2019-05-21 17:21:06.263 13887-13887/? A/DEBUG: #12 pc 000000000027c358 /system/lib64/libart.so (bool art::interpreter::DoCall<false, false>(art::ArtMethod*, art::Thread*, art::ShadowFrame&, art::Instruction const*, unsigned short, art::JValue*)+920) 2019-05-21 17:21:06.263 13887-13887/? A/DEBUG: #13 pc 000000000052f6f0 /system/lib64/libart.so (MterpInvokeVirtualQuick+584) 2019-05-21 17:21:06.263 13887-13887/? A/DEBUG: #14 pc 0000000000553114 /system/lib64/libart.so (ExecuteMterpImpl+29972) 2019-05-21 17:21:06.263 13887-13887/? A/DEBUG: #15 pc 00000000002bc446 /data/app/.xx.xx-U5O1pzNUtbiwoTPGd6O-UA==/oat/arm64/base.vdex (com.xx.xx.AudioRecorder.a+26) 2019-05-21 17:21:06.263 13887-13887/? A/DEBUG: #16 pc 0000000000255e70 /system/lib64/libart.so (_ZN3art11interpreterL7ExecuteEPNS_6ThreadERKNS_20CodeItemDataAccessorERNS_11ShadowFrameENS_6JValueEb.llvm.1181525464+496) 2019-05-21 17:21:06.263 13887-13887/? A/DEBUG: #17 pc 000000000025b9f0 /system/lib64/libart.so (art::interpreter::ArtInterpreterToInterpreterBridge(art::Thread*, art::CodeItemDataAccessor const&, art::ShadowFrame*, art::JValue*)+216) 2019-05-21 17:21:06.264 13887-13887/? A/DEBUG: #18 pc 000000000027c358 /system/lib64/libart.so (bool art::interpreter::DoCall<false, false>(art::ArtMethod*, art::Thread*, art::ShadowFrame&, art::Instruction const*, unsigned short, art::JValue*)+920) 2019-05-21 17:21:06.264 13887-13887/? A/DEBUG: #19 pc 000000000052d9e0 /system/lib64/libart.so (MterpInvokeDirect+296) 2019-05-21 17:21:06.264 13887-13887/? A/DEBUG: #20 pc 000000000054f494 /system/lib64/libart.so (ExecuteMterpImpl+14484) 2019-05-21 17:21:06.264 13887-13887/? A/DEBUG: #21 pc 00000000002bc388 /data/app/com.allinone.callerid-U5O1pzNUtbiwoTPGd6O-UA==/oat/arm64/base.vdex (com.allinone.callerid.util.recorder.AudioRecorder.a) 2019-05-21 17:21:06.264 13887-13887/? A/DEBUG: #22 pc 0000000000255e70 /system/lib64/libart.so (_ZN3art11interpreterL7ExecuteEPNS_6ThreadERKNS_20CodeItemDataAccessorERNS_11ShadowFrameENS_6JValueEb.llvm.1181525464+496) 2019-05-21 17:21:06.264 13887-13887/? A/DEBUG: #23 pc 000000000025b9f0 /system/lib64/libart.so (art::interpreter::ArtInterpreterToInterpreterBridge(art::Thread*, art::CodeItemDataAccessor const&, art::ShadowFrame*, art::JValue*)+216) 2019-05-21 17:21:06.264 13887-13887/? A/DEBUG: #24 pc 000000000027c358 /system/lib64/libart.so (bool art::interpreter::DoCall<false, false>(art::ArtMethod*, art::Thread*, art::ShadowFrame&, art::Instruction const*, unsigned short, art::JValue*)+920) 2019-05-21 17:21:06.264 13887-13887/? A/DEBUG: #25 pc 000000000052dba4 /system/lib64/libart.so (MterpInvokeStatic+204) 2019-05-21 17:21:06.264 13887-13887/? A/DEBUG: #26 pc 000000000054f514 /system/lib64/libart.so (ExecuteMterpImpl+14612) 2019-05-21 17:21:06.264 13887-13887/? A/DEBUG: #27 pc 00000000002bbfe8 /data/app/com.allinone.callerid-U5O1pzNUtbiwoTPGd6O-UA==/oat/arm64/base.vdex (com.allinone.callerid.util.recorder.e.run+12) 2019-05-21 17:21:06.264 13887-13887/? A/DEBUG: #28 pc 0000000000255e70 /system/lib64/libart.so (_ZN3art11interpreterL7ExecuteEPNS_6ThreadERKNS_20CodeItemDataAccessorERNS_11ShadowFrameENS_6JValueEb.llvm.1181525464+496) 2019-05-21 17:21:06.264 13887-13887/? A/DEBUG: #29 pc 000000000051cde0 /system/lib64/libart.so (artQuickToInterpreterBridge+1032) 2019-05-21 17:21:06.264 13887-13887/? A/DEBUG: #30 pc 0000000000565efc /system/lib64/libart.so (art_quick_to_interpreter_bridge+92) 2019-05-21 17:21:06.264 13887-13887/? A/DEBUG: #31 pc 000000000025cfa8 /system/framework/arm64/boot.oat (offset 0x114000) (java.lang.Thread.run+72) 2019-05-21 17:21:06.264 13887-13887/? A/DEBUG: #32 pc 000000000055cd88 /system/lib64/libart.so (art_quick_invoke_stub+584) 2019-05-21 17:21:06.264 13887-13887/? A/DEBUG: #33 pc 00000000000cf740 /system/lib64/libart.so (art::ArtMethod::Invoke(art::Thread*, unsigned int*, unsigned int, art::JValue*, char const*)+200) 2019-05-21 17:21:06.264 13887-13887/? A/DEBUG: #34 pc 00000000004633d0 /system/lib64/libart.so (art::(anonymous namespace)::InvokeWithArgArray(art::ScopedObjectAccessAlreadyRunnable const&, art::ArtMethod*, art::(anonymous namespace)::ArgArray*, art::JValue*, char const*)+104) 2019-05-21 17:21:06.264 13887-13887/? A/DEBUG: #35 pc 0000000000464498 /system/lib64/libart.so (art::InvokeVirtualOrInterfaceWithJValues(art::ScopedObjectAccessAlreadyRunnable const&, _jobject*, _jmethodID*, jvalue*)+424) 2019-05-21 17:21:06.264 13887-13887/? A/DEBUG: #36 pc 000000000048f808 /system/lib64/libart.so (art::Thread::CreateCallback(void*)+1120) 2019-05-21 17:21:06.264 13887-13887/? A/DEBUG: #37 pc 0000000000083114 /system/lib64/libc.so (__pthread_start(void*)+36) 2019-05-21 17:21:06.264 13887-13887/? A/DEBUG: #38 pc 00000000000233bc /system/lib64/libc.so (__start_thread+68) 2019-05-21 17:21:06.455 413-9844/? E/AudioALSAPlaybackHandlerBase: -getHardwareBufferInfo(), pcm_get_htimestamp fail, ret = -1, pcm_get_error =
Java学习的正确打开方式
在博主认为,对于入门级学习java的最佳学习方法莫过于视频+博客+书籍+总结,前三者博主将淋漓尽致地挥毫于这篇博客文章中,至于总结在于个人,实际上越到后面你会发现学习的最好方式就是阅读参考官方文档其次就是国内的书籍,博客次之,这又是一个层次了,这里暂时不提后面再谈。博主将为各位入门java保驾护航,各位只管冲鸭!!!上天是公平的,只要不辜负时间,时间自然不会辜负你。 何谓学习?博主所理解的学习,它
大学四年自学走来,这些私藏的实用工具/学习网站我贡献出来了
大学四年,看课本是不可能一直看课本的了,对于学习,特别是自学,善于搜索网上的一些资源来辅助,还是非常有必要的,下面我就把这几年私藏的各种资源,网站贡献出来给你们。主要有:电子书搜索、实用工具、在线视频学习网站、非视频学习网站、软件下载、面试/求职必备网站。 注意:文中提到的所有资源,文末我都给你整理好了,你们只管拿去,如果觉得不错,转发、分享就是最大的支持了。 一、PDF搜索网站推荐 对于大部
linux系列之常用运维命令整理笔录
本博客记录工作中需要的linux运维命令,大学时候开始接触linux,会一些基本操作,可是都没有整理起来,加上是做开发,不做运维,有些命令忘记了,所以现在整理成博客,当然vi,文件操作等就不介绍了,慢慢积累一些其它拓展的命令,博客不定时更新 顺便拉下票,我在参加csdn博客之星竞选,欢迎投票支持,每个QQ或者微信每天都可以投5票,扫二维码即可,http://m234140.nofollow.ax.
Vue + Spring Boot 项目实战(十四):用户认证方案与完善的访问拦截
本篇文章主要讲解 token、session 等用户认证方案的区别并分析常见误区,以及如何通过前后端的配合实现完善的访问拦截,为下一步权限控制的实现打下基础。
比特币原理详解
一、什么是比特币 比特币是一种电子货币,是一种基于密码学的货币,在2008年11月1日由中本聪发表比特币白皮书,文中提出了一种去中心化的电子记账系统,我们平时的电子现金是银行来记账,因为银行的背后是国家信用。去中心化电子记账系统是参与者共同记账。比特币可以防止主权危机、信用风险。其好处不多做赘述,这一层面介绍的文章很多,本文主要从更深层的技术原理角度进行介绍。 二、问题引入  假设现有4个人
程序员接私活怎样防止做完了不给钱?
首先跟大家说明一点,我们做 IT 类的外包开发,是非标品开发,所以很有可能在开发过程中会有这样那样的需求修改,而这种需求修改很容易造成扯皮,进而影响到费用支付,甚至出现做完了项目收不到钱的情况。 那么,怎么保证自己的薪酬安全呢? 我们在开工前,一定要做好一些证据方面的准备(也就是“讨薪”的理论依据),这其中最重要的就是需求文档和验收标准。一定要让需求方提供这两个文档资料作为开发的基础。之后开发
网页实现一个简单的音乐播放器(大佬别看。(⊙﹏⊙))
今天闲着无事,就想写点东西。然后听了下歌,就打算写个播放器。 于是乎用h5 audio的加上js简单的播放器完工了。 欢迎 改进 留言。 演示地点跳到演示地点 html代码如下`&lt;!DOCTYPE html&gt; &lt;html&gt; &lt;head&gt; &lt;title&gt;music&lt;/title&gt; &lt;meta charset="utf-8"&gt
Python十大装B语法
Python 是一种代表简单思想的语言,其语法相对简单,很容易上手。不过,如果就此小视 Python 语法的精妙和深邃,那就大错特错了。本文精心筛选了最能展现 Python 语法之精妙的十个知识点,并附上详细的实例代码。如能在实战中融会贯通、灵活使用,必将使代码更为精炼、高效,同时也会极大提升代码B格,使之看上去更老练,读起来更优雅。 1. for - else 什么?不是 if 和 else 才
数据库优化 - SQL优化
前面一篇文章从实例的角度进行数据库优化,通过配置一些参数让数据库性能达到最优。但是一些“不好”的SQL也会导致数据库查询变慢,影响业务流程。本文从SQL角度进行数据库优化,提升SQL运行效率。 判断问题SQL 判断SQL是否有问题时可以通过两个表象进行判断: 系统级别表象 CPU消耗严重 IO等待严重 页面响应时间过长
2019年11月中国大陆编程语言排行榜
2019年11月2日,我统计了某招聘网站,获得有效程序员招聘数据9万条。针对招聘信息,提取编程语言关键字,并统计如下: 编程语言比例 rank pl_ percentage 1 java 33.62% 2 c/c++ 16.42% 3 c_sharp 12.82% 4 javascript 12.31% 5 python 7.93% 6 go 7.25% 7
通俗易懂地给女朋友讲:线程池的内部原理
餐厅的约会 餐盘在灯光的照耀下格外晶莹洁白,女朋友拿起红酒杯轻轻地抿了一小口,对我说:“经常听你说线程池,到底线程池到底是个什么原理?”我楞了一下,心里想女朋友今天是怎么了,怎么突然问出这么专业的问题,但做为一个专业人士在女朋友面前也不能露怯啊,想了一下便说:“我先给你讲讲我前同事老王的故事吧!” 大龄程序员老王 老王是一个已经北漂十多年的程序员,岁数大了,加班加不动了,升迁也无望,于是拿着手里
经典算法(5)杨辉三角
写在前面: 我是 扬帆向海,这个昵称来源于我的名字以及女朋友的名字。我热爱技术、热爱开源、热爱编程。技术是开源的、知识是共享的。 这博客是对自己学习的一点点总结及记录,如果您对 Java、算法 感兴趣,可以关注我的动态,我们一起学习。 用知识改变命运,让我们的家人过上更好的生活。 目录一、杨辉三角的介绍二、杨辉三角的算法思想三、代码实现1.第一种写法2.第二种写法 一、杨辉三角的介绍 百度
腾讯算法面试题:64匹马8个跑道需要多少轮才能选出最快的四匹?
昨天,有网友私信我,说去阿里面试,彻底的被打击到了。问了为什么网上大量使用ThreadLocal的源码都会加上private static?他被难住了,因为他从来都没有考虑过这个问题。无独有偶,今天笔者又发现有网友吐槽了一道腾讯的面试题,我们一起来看看。 腾讯算法面试题:64匹马8个跑道需要多少轮才能选出最快的四匹? 在互联网职场论坛,一名程序员发帖求助到。二面腾讯,其中一个算法题:64匹
面试官:你连RESTful都不知道我怎么敢要你?
面试官:了解RESTful吗? 我:听说过。 面试官:那什么是RESTful? 我:就是用起来很规范,挺好的 面试官:是RESTful挺好的,还是自我感觉挺好的 我:都挺好的。 面试官:… 把门关上。 我:… 要干嘛?先关上再说。 面试官:我说出去把门关上。 我:what ?,夺门而去 文章目录01 前言02 RESTful的来源03 RESTful6大原则1. C-S架构2. 无状态3.统一的接
SQL-小白最佳入门sql查询一
一 说明 如果是初学者,建议去网上寻找安装Mysql的文章安装,以及使用navicat连接数据库,以后的示例基本是使用mysql数据库管理系统; 二 准备前提 需要建立一张学生表,列分别是id,名称,年龄,学生信息;本示例中文章篇幅原因SQL注释略; 建表语句: CREATE TABLE `student` ( `id` int(11) NOT NULL AUTO_INCREMENT, `
项目中的if else太多了,该怎么重构?
介绍 最近跟着公司的大佬开发了一款IM系统,类似QQ和微信哈,就是聊天软件。我们有一部分业务逻辑是这样的 if (msgType = "文本") { // dosomething } else if(msgType = "图片") { // doshomething } else if(msgType = "视频") { // doshomething } else { // dosho
漫话:什么是平衡(AVL)树?这应该是把AVL树讲的最好的文章了
这篇文章通过对话的形式,由浅入深带你读懂 AVL 树,看完让你保证理解 AVL 树的各种操作,如果觉得不错,别吝啬你的赞哦。 1、若它的左子树不为空,则左子树上所有的节点值都小于它的根节点值。 2、若它的右子树不为空,则右子树上所有的节点值均大于它的根节点值。 3、它的左右子树也分别可以充当为二叉查找树。 例如: 例如,我现在想要查找数值为14的节点。由于二叉查找树的特性,我们可...
“狗屁不通文章生成器”登顶GitHub热榜,分分钟写出万字形式主义大作
一、垃圾文字生成器介绍 最近在浏览GitHub的时候,发现了这样一个骨骼清奇的雷人项目,而且热度还特别高。 项目中文名:狗屁不通文章生成器 项目英文名:BullshitGenerator 根据作者的介绍,他是偶尔需要一些中文文字用于GUI开发时测试文本渲染,因此开发了这个废话生成器。但由于生成的废话实在是太过富于哲理,所以最近已经被小伙伴们给玩坏了。 他的文风可能是这样的: 你发现,
程序员:我终于知道post和get的区别
IT界知名的程序员曾说:对于那些月薪三万以下,自称IT工程师的码农们,其实我们从来没有把他们归为我们IT工程师的队伍。他们虽然总是以IT工程师自居,但只是他们一厢情愿罢了。 此话一出,不知激起了多少(码农)程序员的愤怒,却又无可奈何,于是码农问程序员。 码农:你知道get和post请求到底有什么区别? 程序员:你看这篇就知道了。 码农:你月薪三万了? 程序员:嗯。 码农:你是怎么做到的? 程序员:
《程序人生》系列-这个程序员只用了20行代码就拿了冠军
你知道的越多,你不知道的越多 点赞再看,养成习惯GitHub上已经开源https://github.com/JavaFamily,有一线大厂面试点脑图,欢迎Star和完善 前言 这一期不算《吊打面试官》系列的,所有没前言我直接开始。 絮叨 本来应该是没有这期的,看过我上期的小伙伴应该是知道的嘛,双十一比较忙嘛,要值班又要去帮忙拍摄年会的视频素材,还得搞个程序员一天的Vlog,还要写BU
开源并不是你认为的那些事
点击上方蓝字 关注我们开源之道导读所以 ————想要理清开源是什么?先要厘清开源不是什么,名正言顺是句中国的古代成语,概念本身的理解非常之重要。大部分生物多样性的起源,...
加快推动区块链技术和产业创新发展,2019可信区块链峰会在京召开
      11月8日,由中国信息通信研究院、中国通信标准化协会、中国互联网协会、可信区块链推进计划联合主办,科技行者协办的2019可信区块链峰会将在北京悠唐皇冠假日酒店开幕。   区块链技术被认为是继蒸汽机、电力、互联网之后,下一代颠覆性的核心技术。如果说蒸汽机释放了人类的生产力,电力解决了人类基本的生活需求,互联网彻底改变了信息传递的方式,区块链作为构造信任的技术有重要的价值。   1
程序员把地府后台管理系统做出来了,还有3.0版本!12月7号最新消息:已在开发中有github地址
第一幕:缘起 听说阎王爷要做个生死簿后台管理系统,我们派去了一个程序员…… 996程序员做的梦: 第一场:团队招募 为了应对地府管理危机,阎王打算找“人”开发一套地府后台管理系统,于是就在地府总经办群中发了项目需求。 话说还是中国电信的信号好,地府都是满格,哈哈!!! 经常会有外行朋友问:看某网站做的不错,功能也简单,你帮忙做一下? 而这次,面对这样的需求,这个程序员
网易云6亿用户音乐推荐算法
网易云音乐是音乐爱好者的集聚地,云音乐推荐系统致力于通过 AI 算法的落地,实现用户千人千面的个性化推荐,为用户带来不一样的听歌体验。 本次分享重点介绍 AI 算法在音乐推荐中的应用实践,以及在算法落地过程中遇到的挑战和解决方案。 将从如下两个部分展开: AI 算法在音乐推荐中的应用 音乐场景下的 AI 思考 从 2013 年 4 月正式上线至今,网易云音乐平台持续提供着:乐屏社区、UGC
【技巧总结】位运算装逼指南
位算法的效率有多快我就不说,不信你可以去用 10 亿个数据模拟一下,今天给大家讲一讲位运算的一些经典例子。不过,最重要的不是看懂了这些例子就好,而是要在以后多去运用位运算这些技巧,当然,采用位运算,也是可以装逼的,不信,你往下看。我会从最简单的讲起,一道比一道难度递增,不过居然是讲技巧,那么也不会太难,相信你分分钟看懂。 判断奇偶数 判断一个数是基于还是偶数,相信很多人都做过,一般的做法的代码如下
《C++ Primer》学习笔记(六):C++模块设计——函数
专栏C++学习笔记 《C++ Primer》学习笔记/习题答案 总目录 https://blog.csdn.net/TeFuirnever/article/details/100700212 —————————————————————————————————————————————————————— 《C++ Primer》习题参考答案:第6章 - C++模块设计——函数 文章目录专栏C+...
8年经验面试官详解 Java 面试秘诀
    作者 | 胡书敏 责编 | 刘静 出品 | CSDN(ID:CSDNnews) 本人目前在一家知名外企担任架构师,而且最近八年来,在多家外企和互联网公司担任Java技术面试官,前后累计面试了有两三百位候选人。在本文里,就将结合本人的面试经验,针对Java初学者、Java初级开发和Java开发,给出若干准备简历和准备面试的建议。   Java程序员准备和投递简历的实
面试官如何考察你的思维方式?
1.两种思维方式在求职面试中,经常会考察这种问题:北京有多少量特斯拉汽车? 某胡同口的煎饼摊一年能卖出多少个煎饼? 深圳有多少个产品经理? 一辆公交车里能装下多少个乒乓球? 一
so easy! 10行代码写个"狗屁不通"文章生成器
前几天,GitHub 有个开源项目特别火,只要输入标题就可以生成一篇长长的文章。背后实现代码一定很复杂吧,里面一定有很多高深莫测的机器学习等复杂算法不过,当我看了源代码之后这程序不到50
知乎高赞:中国有什么拿得出手的开源软件产品?(整理自本人原创回答)
知乎高赞:中国有什么拿得出手的开源软件产品? 在知乎上,有个问题问“中国有什么拿得出手的开源软件产品(在 GitHub 等社区受欢迎度较好的)?” 事实上,还不少呢~ 本人于2019.7.6进行了较为全面的 回答 - Bravo Yeung,获得该问题下回答中得最高赞(236赞和1枚专业勋章),对这些受欢迎的 Github 开源项目分类整理如下: 分布式计算、云平台相关工具类 1.SkyWalk
相关热词 c#中dns类 c#合并的excel c# implicit c#怎么保留3个小数点 c# 串口通信、 网络调试助手c# c# 泛型比较大小 c#解压分卷问题 c#启动居中 c# 逻辑或运算符
立即提问